{"text_format":"1","workbook":"xlsx","n_sheets":17,"sheets":["00","01","02","03","04","05","06","07","servicios","proveedores","PlanContable","partidas","CE","CashData","planilla","recibos","comprobante"],"not_rendered":{"charts":0,"images":5,"macros":1,"external_links":0,"defined_names":10,"comments":1,"pivot_tables":0},"unopened":[],"bounds":{"document_bytes":16777216,"sheet_cells":100000,"rows_first":2000,"rows_last":500,"rows_between":2000,"halvings":0,"cell_chars":16384,"cell_head_chars":4096},"cells_cut":0,"cells_raw":0,"read":"whole","date_system":"1900"}

{"sheet":"00","index":0,"n_rows":6,"n_cols":12,"rows_kept":6,"cut":false,"hidden":false,"merged":[[0,0,3,10],[0,11,3,14],[5,0,6,1]]}
["Biometepe - Caja Chica - Balance C$:",null,null,null,null,null,null,null,null,null,null,{"$f":"SUMIF(CashData!L:L, \"ENTRADA\", CashData!K:K) - SUMIF(CashData!L:L, \"SALIDA\", CashData!K:K)","v":0}]
[]
[]
[]
[]
["Actividades"]

{"sheet":"01","index":1,"n_rows":18,"n_cols":3,"rows_kept":18,"cut":false,"hidden":false,"merged":[]}
[]
[null,"Tarea","Usuario"]
[null,"Elaborado por:","Priscila Castillo Fonseca"]
[null,"Revisado por:","Emerson Urtecho"]
[null,"Autorizado por:","Keyla Esperanza Mena Romero"]
[]
[]
[null,"Fecha del Reporte"]
[null,"Fecha inicial","2023-10-01"]
[null,"Fecha final",{"$f":"EOMONTH(C9,0)","v":"2023-10-31"}]
[]
[]
[]
[null,"Lista de Donantes"]
[null,"ID","NOMBRE DEL DONANTE"]
[null,1,"Brooke America Central"]
[null,2,"Fauna y Flora International"]
[null,3,"Fondos Propios Biometepe"]

{"sheet":"02","index":2,"n_rows":16,"n_cols":8,"rows_kept":16,"cut":false,"hidden":false,"merged":[]}
["COD","N.º INSS","CEDULA","NOMBRES Y APELLIDOS","CARGO","SALARIO US","T/C","SALARIO C$"]
[1,13523295,"5700905760001D","Carlos Roberto Barrios Alvarez","Coordinador técnico",20065.56,1,{"$f":"F2*G2","v":20065.56}]
[2,38417973,"5690307960000B","Priscila Castillo Fonseca","Asistente contable",17813.79,1,{"$f":"F3*G3","v":17813.79}]
[3,36969409,"5700804880002F","Ermenson Urtecho ","Especialista en Trafico Ilegal, vida silvestre ",16000.13,1,{"$f":"F4*G4","v":16000.13}]
[4,20631350,"5702703840000K","Norlan Luis Zambrana Morales ","Especialista en especie de conservacion ",16000.13,1,{"$f":"F5*G5","v":16000.13}]
[5,15067892,"5691812820001T","Keyla Esperanza Mena Romero ","Especialista en recursos naturales en gobernanza ",30537.93,1,{"$f":"F6*G6","v":30537.93}]
[6,39582241,"5611102900004J","Ervin Joel Aviles Romero","Técnico agroecológico",10701.54,1,{"$f":"F7*G7","v":10701.54}]
[7,39582234,"5700802950000C","Cristhiam Selena Hernández Salazar","Técnico agroecológico",16000.13,1,{"$f":"F8*G8","v":16000.13}]
[8,40644141,"5700712880002F","Levis Antonio Hernández","Técnico de Biodiversidad",14445.78,1,{"$f":"F9*G9","v":14445.78}]
[9,40644158,"5612805991000Y","Anry Rossmery Rodríguez Valdivia","Técnico en Educación y Comunicación",12646.02,1,{"$f":"F10*G10","v":12646.02}]
[10,29797437,"5700509900002V","Adonis Antonio López Lorío","Técnico agroecológico",10701.54,1,{"$f":"F11*G11","v":10701.54}]
[11,41003518,"5702705830002F","Marlon José González","Técnico agroecológico",10701.54,1,{"$f":"F12*G12","v":10701.54}]
[12,41013148,"5700702950002C","Numa Martínez Arguello","Técnico agroecológico",10701.54,1,{"$f":"F13*G13","v":10701.54}]
[13,41417746,"5700810011000C","Jorvin Urías Aguirre Barrios","Técnico agroecológico",9531.14,1,{"$f":"F14*G14","v":9531.14}]
[14,41417874,"5691411001000K","Derex Xavier Muñoz Rodríguez","Técnico agroecológico",9531.14,1,{"$f":"F15*G15","v":9531.14}]
[15,43526965,"5612302041000K","Sarah Michelle Mena Saballos","Técnico agroecológico",10701.54,1,{"$f":"F16*G16","v":10701.54}]

{"sheet":"03","index":3,"n_rows":208,"n_cols":3,"rows_kept":208,"cut":false,"hidden":false,"merged":[]}
["ID_RUBRO","NOMBRE_RUBRO"]
[1,"RECURSO HUMANO"]
[2,"ACTIVIDADES DE PROYECTOS"]
[3,"EQUIPAMIENTO"]
[4,"COSTOS DE OPERACIONES"]
[5,"GASTOS MENORES DE CAJA CHICA"]
[]
[]
[]
[]
[]
[]
[]
[]
[]
[]
[]
[]
[]
[]
{"$rows_left_out":189}
{"sheet":"04","index":4,"n_rows":9,"n_cols":5,"rows_kept":9,"cut":false,"hidden":false,"merged":[]}
[null,"ID","ID_DONANTE","DESTINO_FONDO","NOMBRE_CORTO"]
[null,1,1,"Bienestar Equino en RB Isla de Ometepe","BRK-EQUINO"]
[null,2,2,"Proyecto Lora Nuca Amarilla - Khalili","PLNA-KHALILI"]
[null,3,2,"Proyecto Lora Nuca Amarilla - Fondo de Emergencia","PLNA-FE"]
[null,4,2,"Proyecto Lora Nuca Amarilla - Loro Parque","PLNA-LOR"]
[null,5,3,"Caja Chica","CAJA CHICA"]
[null,6,2,"PROYECTO LORA NUCA AMARILLA ","DARWIN "]
[null,7,3,"FONDOS PROPIOS ","BIOMETEPE"]
[null,8,2,"Proyecto Lora Nuca Amarilla FFI-LUF","LUF"]

{"sheet":"05","index":5,"n_rows":15,"n_cols":3,"rows_kept":15,"cut":false,"hidden":false,"merged":[]}
["ID_LINEA","ID_RUBRO","DESCRIPCION"]
[11,1,"Remuneración"]
[12,1,"Seguros"]
[13,1,"Capacitación"]
[21,2,"Patrullaje y protección de nidos"]
[22,2,"Talleres/Foros comunitarios"]
[23,2,"Capacitación a técnicos"]
[31,3,"Equipo para escalamiento"]
[32,3,"Equipo de monitoreo"]
[33,3,"Kit de primeros auxilios"]
[34,3,"Equipo informático"]
[41,4,"Combustible y mantenimiento de vehículos"]
[42,4,"Viáticos de alimentación y transporte"]
[43,4,"Gastos de oficina"]
[51,5,"Viáticos"]

{"sheet":"06","index":6,"n_rows":13,"n_cols":2,"rows_kept":13,"cut":false,"hidden":false,"merged":[]}
["ID_RUBRO","ID_FONDO"]
[1,1]
[1,2]
[1,3]
[2,1]
[2,2]
[2,3]
[3,1]
[3,2]
[3,3]
[4,1]
[4,3]
[5,5]

{"sheet":"07","index":7,"n_rows":15,"n_cols":2,"rows_kept":15,"cut":false,"hidden":false,"merged":[]}
["ID_LINEA","NOMBRE DE LA LINEA"]
[11,"Remuneración"]
[12,"Seguros"]
[13,"Capacitación"]
[21,"Patrullaje y protección de nidos"]
[22,"Talleres/Foros comunitarios"]
[23,"Capacitación a técnicos"]
[31,"Equipo para escalamiento"]
[32,"Equipo de monitoreo"]
[33,"Kit de primeros auxilios"]
[34,"Equipo informático"]
[41,"Combustible y mantenimiento de vehículos"]
[42,"Viáticos de alimentación y transporte"]
[43,"Gastos de oficina"]
[51,"Viáticos"]

{"sheet":"servicios","index":8,"n_rows":31,"n_cols":3,"rows_kept":31,"cut":false,"hidden":false,"merged":[]}
["TIPO","DESCRIPCION","CONFIG"]
[11,"Servicio de alimentación - Brooke","Si"]
[12,"Servicio de alimentación - FFI-PLNA-FE","Si"]
[13,"Servicio de alimentacion- FFI-LOR","Si"]
[14,"Servicios de alimentacion -FFI- DARWIN ","Si"]
[21,"Compra de bienes y servicios - Brooke","Si"]
[22,"Servicio de alimentación - FFI-KHALILI","Si"]
[23,"Compra de bienes y servicios - FFI-FE","Si"]
[24,"Compra de bienes y servicios - FFI -LOR","Si"]
[25,"Compra de bienes y servicios -FFI- DARWIN ","Si"]
[26,"Compra de Bienes y Servicios -FFI-KHALILI","Si"]
[31,"Pago salarios - Brooke","Si"]
[32,"Pago salarios - FFI","Si"]
[33,"Liquidacion de Aguinaldo","Si"]
[34,"Transferencias a cuentas propias ","Si"]
[41,"Reembolso de Caja Chica","Si"]
[42,"Anticipo para compras","Si"]
[43,"Gastos de patrullaje-FFI-FE","Si"]
[44,"Anticipo para viáticos","Si"]
[45,"Gastos de patrullaje-FFI-LOR","Si"]
{"$rows_left_out":12}
{"sheet":"proveedores","index":9,"n_rows":87,"n_cols":4,"rows_kept":87,"cut":false,"hidden":false,"merged":[]}
["ID","NOMBRE","SERVICIO","DIRECCION"]
["570-090576-0001D","Carlos Roberto Barrios Alvarez","Pago de salarios","Altagracia. De la alcaldía 1 cuadra al sur 1/2 cuadra al oeste"]
["569-030796-0000B","Priscila Castillo Fonseca","Pago de salarios","Moyogalpa. Del colegio Israel 1/2 cuadra al este."]
["561-121086-0006M","Dannibeth Pilar Aguirre Lorio ","Servicio de alimentacion ","Comarca Las Pilas, Iglesia Catolica 25mts al Norte."]
["569-260465-00001B","Fabio Martin Hernandez ","Pago de contado a proveedor ","Del Juzgado Local 1c al Norte Moyogalpa, Isla de Ometepe."]
["569-080488-0000L","Wilfredo Vargas Aleman ","Pago de contado a proveedor ","De la Portuaria 150 mts al Sur, Moyogalpa Isla de Ometepe, Rivas."]
["569-1106800001A","Juan Carlos Mena R ","Pago de contado a proveedor ","De la Iglesia Catolica 1/2 c al Norte Moyogalpa, Isla de Ometepe, Rivas."]
["201-171271-0003D","Manuel Castillo Monge ","Pago de contado a proveedor ","Alcaldia Municipal, 1c al Sur, 25 vrs al Este, Altagracia, Isla de Ometepe, Rivas."]
["569-070259-0000D","Candida Rosa Calderon Rivas","Servicio de Alimentacion ","Cmca, Moyogalpa Magfor 2c al Sur, Isla de Ometepe, Rivas "]
["570-230173-0003B","Alma Castillo Mairena ","Servicio de Alimentacion "," Escuela Madroñal 150 mts al Sur, Altagracia, Isla de Ometepe, Rivas. "]
["570-010287-0000F","Dinora Sequeira Novoa ","Servicio de Alimentacion","La Palma Iglesia Evangelica 120 vrs Norte, Altagracia, Isla de Ometepe, Rivas."]
["570-091168-0000K","Nubia Angelica Martinez ","Servicio de Alimentacion ","Urb. Alexandra Castro Casa E-26, Altagracia, Isla de Ometepe, Rivas."]
["570-311270-0001E","Cristina Correa Ortiz ","Servicio de Alimentacion","Costado Oeste Parque de Altagracia, Isla de Ometepe, Rivas. "]
["570-250687-0000J","Pedro Ramon Rivera Barrios.","Pago de contado a proveedor ","Municipio Altagracia, Isla de Ometepe, Rivas."]
["561-251069-0004F","Edgar Quintanilla Cuadra. ","Pago de contado a proveedor ","Costado Oeste de Dissur, Altagracia. "]
["570-200464-0001L","Maria Marcelina Castillo ","Servicio de Alimentacion ","Cmca, Balgue, Centro de salud 200vrs Este, 50 vrs Norte."]
["570-280982-0000M","Ceneida Elizavec Zacarias Castillo ","Servicio de Alimentacion ","Cmca Balgue Centro de Salud 200 vrs Este 50vrs Norte."]
["INSS","Instituto Nicaraguense de Seguridad Social","Cotizaciones Inss","Moyogalpa, Isla de Ometepe, Rivas."]
["INATEC","INATEC","Pago de cotizaciones al INATEC","Moyogalpa, Isla de Ometepe, Rivas"]
["569-210881-0000D","Marybel Muñoz Morgan","Servicio de alimentacion","San Lazaro, Iglesia Catolica 100 vrs oeste, Moyogalpa, Isla de Ometepe"]
{"$rows_left_out":68}
{"sheet":"PlanContable","index":10,"n_rows":275,"n_cols":3,"rows_kept":275,"cut":false,"hidden":false,"merged":[]}
["CODIGO","DESCRIPCION_DE_LA_CUENTA","TIPO CUENTA"]
[10000000,"ACTIVOS","CLASE"]
[11000000,"DISPONIBILIDADES","GRUPO"]
[11100000,"EFECTIVO EN CAJA","CUENTA"]
[11101000,"CAJA CHICA","SUBCUENTA"]
[11101100,"CAJA CHICA MN","MONEDA"]
[11101101,"CAJA CHICA MN","ANALITICA"]
[11108000,"CAJA GENERAL","SUBCUENTA"]
[11108100,"CAJA GENERAL MN","MONEDA"]
[11108101,"CAJA GENERAL MN","INACTIVA"]
[11200000,"DEPOSITOS EN COOPERATIVAS, BANCOS Y OTRAS INSTITUCIONES","CUENTA"]
[11201000,"DEPOSITOS EN CUENTAS CORRIENTES","SUBCUENTA"]
[11201100,"CUENTAS A LA VISTA MN/SMV","MONEDA"]
[11201101,"LAFISE – CTA. NIO 106007653","ANALITICA"]
[11201102,"LAFISE – CTA. NIO 106009799","ANALITICA"]
[15000000,"CUENTAS POR COBRAR","GRUPO"]
[15700000,"CUENTAS POR COBRAR AL PERSONAL","CUENTA"]
[15701000,"CUENTAS POR COBRAR AL PERSONAL","SUBCUENTA"]
[15701100,"CUENTAS POR COBRAR AL PERSONAL MN","MONEDA"]
[15701101,"ANTICIPO PARA COMPRAS Y GASTOS","ANALITICA"]
{"$rows_left_out":256}
{"sheet":"partidas","index":11,"n_rows":79,"n_cols":12,"rows_kept":79,"cut":false,"hidden":false,"merged":[]}
["ID","DESCRIPCION DEL SERVICIO","RETENCION","ALICUOTA","DONANTE","FONDO","CUENTA","PARTIDA","DISTRIBUCION","TIPO_DISTRIB","VALORES_FIJOS","ACTUALIZACION"]
[12,"Servicio de alimentación - FFI","Si",0.02,"Fauna y Flora International","PLNA-FE",57209101,"DEBITO",1,"PORCENTUAL",null,"NO"]
[12,"Servicio de alimentación - FFI","Si",0.02,"Fauna y Flora International","PLNA-FE",25202101,"CREDITO",0.02,"PORCENTUAL",null,"NO"]
[12,"Servicio de alimentación - FFI","Si",0.02,"Fauna y Flora International","PLNA-FE",11201101,"CREDITO",0.98,"PORCENTUAL",null,"NO"]
[31,"Pago salarios - Brooke","No",0,"Brooke América Central","BRK-EQUINO",57102101,"DEBITO",1,"PORCENTUAL",null,"NO"]
[31,"Pago salarios - Brooke","No",0,"Brooke América Central","BRK-EQUINO",11201101,"CREDITO",1,"PORCENTUAL",null,"NO"]
[53,"Pago de impuestos a la DGI","No",0,null,null,25201101,"DEBITO",null,"VALORES FIJOS",4630.75,"SI"]
[53,"Pago de impuestos a la DGI","No",0,null,null,25202101,"DEBITO",null,"VALORES FIJOS",2065,"SI"]
[53,"Pago de impuestos a la DGI","No",0,null,null,25202102,"DEBITO",null,"VALORES FIJOS",1187.5,"SI"]
[53,"Pago de impuestos a la DGI","No",0,null,null,11201101,"CREDITO",null,"VALORES FIJOS",7883.25,"SI"]
[61,"Servicios Consultoría - FFI-PLNA-FE","Si",0.1,"Fauna y Flora International","PLNA-FE",57205101,"DEBITO",1,"PORCENTUAL",null,"NO"]
[61,"Servicios Consultoría - FFI-PLNA-FE","Si",0.1,"Fauna y Flora International","PLNA-FE",25202102,"CREDITO",0.1,"PORCENTUAL",null,"NO"]
[61,"Servicios Consultoría - FFI-PLNA-FE","Si",0.1,"Fauna y Flora International","PLNA-FE",11201101,"CREDITO",0.9,"PORCENTUAL",null,"NO"]
[45,"Gastos de patrullaje-FFI-LOR","No",0,"Fauna y Flora International","PLNA-LOR",58398102,"DEBITO",1,"PORCENTUAL",null,"NO"]
[45,"Gastos de patrullaje-FFI-LOR","No",0,"Fauna y Flora International","PLNA-LOR",11201101,"CREDITO",1,"PORCENTUAL",null,"NO"]
[24,"Compra de bienes y servicios - FFI -LOR","Si",0.02,"Fauna y Flora International","PLNA-LOR",32201102,"DEBITO",1,"PORCENTUAL",null,"NO"]
[24,"Compra de bienes y servicios - FFI -LOR","Si",0.02,"Fauna y Flora International","PLNA-LOR",11201101,"CREDITO",0.98,"PORCENTUAL",null,"NO"]
[24,"Compra de bienes y servicios - FFI -LOR","Si",0.02,"Fauna y Flora International","PLNA-LOR",25202101,"CREDITO",0.02,"PORCENTUAL",null,"NO"]
[62,"Servicios Consultoria FFI- KHALILI","Si",0.1,"Fauna y Flora International","PLNA-KHALILI",57205101,"DEBITO",1,"PORCENTUAL",null,"NO"]
[62,"Servicios Consultoria FFI- KHALILI","Si",0.1,"Fauna y Flora International","PLNA-KHALILI",25202102,"CREDITO",0.1,"PORCENTUAL",null,"NO"]
{"$rows_left_out":60}
{"sheet":"CE","index":12,"n_rows":18,"n_cols":12,"rows_kept":18,"cut":false,"hidden":false,"merged":[[0,0,0,12],[1,11,5,12],[2,2,2,4],[4,2,4,5],[6,2,6,10],[8,2,8,4],[10,2,10,3],[10,5,10,6],[10,8,10,9],[12,2,12,3],[12,5,12,6],[12,8,12,11],[14,2,14,3],[14,5,14,6],[14,8,14,9],[17,0,20,11],[22,2,22,3],[22,6,22,7],[23,1,23,4]]}
["Procesar Comprobante de Egresos"]
[null,null,null,null,null,null,null,null,null,null,null,{"$f":"IFERROR(VLOOKUP(INDEX(Tabla1[#data], MATCH($I$13, servicios, 0), 1), partidas!A:B, 2, FALSE()), \"Partida no configurada\")","v":"Partida no configurada"}]
["Tipo de egreso:",null,"Pago"]
[]
["ID Beneficiario:",null,"569-030796-0000B"]
[]
["Nombre:",null,{"$f":"IF(C5<>\"\", VLOOKUP(C5, proveedores!A:B, 2, FALSE()), \"\")","v":"Priscila Castillo Fonseca"},null,null,null,null,null,null,null,null,{"$f":"IF(C7=\"El registro no existe en la base de datos\", \"<<=\", \"\")","v":""}]
[]
["Fecha:",null,"2021-03-03"]
[]
["N.º Comprobante:",null,15,null,null,"N.º Cheque:",null,null,1014]
[]
["Alícuota Retención:",null,{"$f":"IFERROR(VLOOKUP(INDEX(Tabla1[#data], MATCH(I13, servicios, 0), 1), partidas!A:I, 4, FALSE()), 0)","v":0},null,null,"Transacción:",null,null,"Reembolso de Caja Chica"]
[]
["Valor Bruto:",null,8000,null,null,"T/C:",null,null,34.9418]
[]
["Descripción:"]
["APERTURA DE CAJA CHICA  MES DE MARZO PARA GASTOS PROYECTO BROOKE."]

{"sheet":"CashData","index":13,"n_rows":1,"n_cols":12,"rows_kept":1,"cut":false,"hidden":false,"merged":[]}
["FECHA","DONANTE","CLAVE_FONDO","CLAVE_OPERACION","RUBRO","LINEA_GASTO","DOCUMENTO","NUMERO_DOC","PROVEEDOR","DESCRIPCION","VALOR","TRANSACCION"]

{"sheet":"planilla","index":14,"n_rows":47,"n_cols":13,"rows_kept":47,"cut":false,"hidden":false,"merged":[[2,11,2,12],[3,11,3,12],[6,10,6,12],[7,0,8,0],[7,1,8,1],[7,2,8,2],[7,3,8,3],[7,4,7,7],[7,8,8,8],[7,9,8,9],[7,10,8,10],[7,11,8,11],[7,12,8,12],[15,0,15,2],[22,1,22,4],[27,9,27,11],[32,9,32,10],[45,3,45,4],[45,8,45,10],[46,3,46,4],[46,8,46,10]]}
[]
[]
["COOPERATIVA DE AGROTURISMO RURAL BIOMETEPE R.L.",null,null,null,null,null,null,null,null,null,"Planilla:","202201 – 01"]
[{"$f":"\"PLANILLA DE SALARIOS  -  NOMINA \" & RIGHT(L3, 2)","v":"PLANILLA DE SALARIOS  -  NOMINA 01"},null,null,null,null,null,null,null,null,null,"Fecha:","2022-01-17"]
[{"$f":"\"DEL \" &UPPER(TEXT('01'!C9, \"DD-MMM-YY\")) &\" AL \"& UPPER(TEXT('01'!C10, \"DD-MMM-YY\"))","v":"DEL 01-OCT-23 AL 31-OCT-23"}]
[]
[null,null,null,null,null,null,null,null,null,null,{"$f":"\"Impreso el: \"&TEXT(NOW(),\"DD-MMM-YY\")&\"  -  \"&TEXT(NOW(),\"HH:MM:SS\")","v":"Impreso el: 26-oct-23  -  20:31:52"}]
["COD","NOMBRE Y APELLIDOS","CARGO","SALARIO MENSUAL","DEDUCCIONES",null,null,null,"NETO A RECIBIR","AGUINALDO\n8.333333%","INDEMNIZACION\n8.333333%","INATEC\n2%","PATRONAL\n21.50%"]
[null,null,null,null,"INSS\n7%","ING. GRAB.","IR","TOT. DEDUCC."]
[2,{"$f":"IF(A10<>\"\", VLOOKUP($A10, '02'!$A$2:$F$20, 4, 0), \"\")","v":"Priscila Castillo Fonseca"},{"$f":"IF(A10<>\"\", VLOOKUP($A10, '02'!$A$2:$F$20, 5, 0), \"\")","v":"Asistente contable"},{"$f":"IF(A10<>\"\", VLOOKUP($A10, '02'!$A$2:$H$20, 8, 0), 0)","v":17813.79},{"$f":"ROUND(D10*7%, 2)","v":1246.97},{"$f":"D10-E10","v":16566.82},{"$f":"ROUND(IF(F10*12<=100000, 0, IF(F10*12<=200000, (F10*12-100000)*0.15/12, IF(F10*12<=350000, ((F10*12-200000)*0.2+15000)/12, IF(F10*12<=500000, ((F10*12-350000)*0.25+45000)/12, ((F10*12-500000)*0.3+82500)/12)))), 2)","v":1235.02},{"$f":"E10+G10","v":2481.99},{"$f":"D10-H10","v":15331.8},{"$f":"ROUND(D10/30*2.5, 2)","v":1484.48},{"$f":"ROUND(D10/30*2.5, 2)","v":1484.48},{"$f":"ROUND(D10*2%, 2)","v":356.28},{"$f":"ROUND(D10*0.215, 2)","v":3829.96}]
[3,{"$f":"IF(A11<>\"\", VLOOKUP($A11, '02'!$A$2:$F$20, 4, 0), \"\")","v":"Ermenson Urtecho "},{"$f":"IF(A11<>\"\", VLOOKUP($A11, '02'!$A$2:$F$20, 5, 0), \"\")","v":"Especialista en Trafico Ilegal, vida silvestre "},{"$f":"IF(A11<>\"\", VLOOKUP($A11, '02'!$A$2:$H$20, 8, 0), 0)","v":16000.13},{"$f":"ROUND(D11*7%, 2)","v":1120.01},{"$f":"D11-E11","v":14880.12},{"$f":"ROUND(IF(F11*12<=100000, 0, IF(F11*12<=200000, (F11*12-100000)*0.15/12, IF(F11*12<=350000, ((F11*12-200000)*0.2+15000)/12, IF(F11*12<=500000, ((F11*12-350000)*0.25+45000)/12, ((F11*12-500000)*0.3+82500)/12)))), 2)","v":982.02},{"$f":"E11+G11","v":2102.03},{"$f":"D11-H11","v":13898.1},{"$f":"ROUND(D11/30*2.5, 2)","v":1333.34},{"$f":"ROUND(D11/30*2.5, 2)","v":1333.34},{"$f":"ROUND(D11*2%, 2)","v":320},{"$f":"ROUND(D11*0.215, 2)","v":3440.03}]
[5,{"$f":"IF(A12<>\"\", VLOOKUP($A12, '02'!$A$2:$F$20, 4, 0), \"\")","v":"Keyla Esperanza Mena Romero "},{"$f":"IF(A12<>\"\", VLOOKUP($A12, '02'!$A$2:$F$20, 5, 0), \"\")","v":"Especialista en recursos naturales en gobernanza "},{"$f":"IF(A12<>\"\", VLOOKUP($A12, '02'!$A$2:$H$20, 8, 0), 0)","v":30537.93},{"$f":"ROUND(D12*7%, 2)","v":2137.66},{"$f":"D12-E12","v":28400.27},{"$f":"ROUND(IF(F12*12<=100000, 0, IF(F12*12<=200000, (F12*12-100000)*0.15/12, IF(F12*12<=350000, ((F12*12-200000)*0.2+15000)/12, IF(F12*12<=500000, ((F12*12-350000)*0.25+45000)/12, ((F12*12-500000)*0.3+82500)/12)))), 2)","v":3596.72},{"$f":"E12+G12","v":5734.38},{"$f":"D12-H12","v":24803.55},{"$f":"ROUND(D12/30*2.5, 2)","v":2544.83},{"$f":"ROUND(D12/30*2.5, 2)","v":2544.83},{"$f":"ROUND(D12*2%, 2)","v":610.76},{"$f":"ROUND(D12*0.215, 2)","v":6565.65}]
[9,{"$f":"IF(A13<>\"\", VLOOKUP($A13, '02'!$A$2:$F$20, 4, 0), \"\")","v":"Anry Rossmery Rodríguez Valdivia"},{"$f":"IF(A13<>\"\", VLOOKUP($A13, '02'!$A$2:$F$20, 5, 0), \"\")","v":"Técnico en Educación y Comunicación"},{"$f":"IF(A13<>\"\", VLOOKUP($A13, '02'!$A$2:$H$20, 8, 0), 0)","v":12646.02},{"$f":"ROUND(D13*7%, 2)","v":885.22},{"$f":"D13-E13","v":11760.8},{"$f":"ROUND(IF(F13*12<=100000, 0, IF(F13*12<=200000, (F13*12-100000)*0.15/12, IF(F13*12<=350000, ((F13*12-200000)*0.2+15000)/12, IF(F13*12<=500000, ((F13*12-350000)*0.25+45000)/12, ((F13*12-500000)*0.3+82500)/12)))), 2)","v":514.12},{"$f":"E13+G13","v":1399.34},{"$f":"D13-H13","v":11246.68},{"$f":"ROUND(D13/30*2.5, 2)","v":1053.84},{"$f":"ROUND(D13/30*2.5, 2)","v":1053.84},{"$f":"ROUND(D13*2%, 2)","v":252.92},{"$f":"ROUND(D13*0.215, 2)","v":2718.89}]
[null,{"$f":"IF(A14<>\"\", VLOOKUP($A14, '02'!$A$2:$F$20, 4, 0), \"\")","v":""},{"$f":"IF(A14<>\"\", VLOOKUP($A14, '02'!$A$2:$F$20, 5, 0), \"\")","v":""},{"$f":"IF(A14<>\"\", VLOOKUP($A14, '02'!$A$2:$H$20, 8, 0), 0)","v":0},{"$f":"ROUND(D14*7%, 2)","v":0},{"$f":"D14-E14","v":0},{"$f":"ROUND(IF(F14*12<=100000, 0, IF(F14*12<=200000, (F14*12-100000)*0.15/12, IF(F14*12<=350000, ((F14*12-200000)*0.2+15000)/12, IF(F14*12<=500000, ((F14*12-350000)*0.25+45000)/12, ((F14*12-500000)*0.3+82500)/12)))), 2)","v":0},{"$f":"E14+G14","v":0},{"$f":"D14-H14","v":0},{"$f":"ROUND(D14/30*2.5, 2)","v":0},{"$f":"ROUND(D14/30*2.5, 2)","v":0},{"$f":"ROUND(D14*2%, 2)","v":0},{"$f":"ROUND(D14*0.215, 2)","v":0}]
[null,{"$f":"IF(A15<>\"\", VLOOKUP($A15, '02'!$A$2:$F$20, 4, 0), \"\")","v":""},{"$f":"IF(A15<>\"\", VLOOKUP($A15, '02'!$A$2:$F$20, 5, 0), \"\")","v":""},{"$f":"IF(A15<>\"\", VLOOKUP($A15, '02'!$A$2:$H$20, 8, 0), 0)","v":0},{"$f":"ROUND(D15*7%, 2)","v":0},{"$f":"D15-E15","v":0},{"$f":"ROUND(IF(F15*12<=100000, 0, IF(F15*12<=200000, (F15*12-100000)*0.15/12, IF(F15*12<=350000, ((F15*12-200000)*0.2+15000)/12, IF(F15*12<=500000, ((F15*12-350000)*0.25+45000)/12, ((F15*12-500000)*0.3+82500)/12)))), 2)","v":0},{"$f":"E15+G15","v":0},{"$f":"D15-H15","v":0},{"$f":"ROUND(D15/30*2.5, 2)","v":0},{"$f":"ROUND(D15/30*2.5, 2)","v":0},{"$f":"ROUND(D15*2%, 2)","v":0},{"$f":"ROUND(D15*0.215, 2)","v":0}]
["TOTALES",null,null,{"$f":"SUM(D10:D15)","v":76997.87},{"$f":"SUM(E10:E15)","v":5389.86},{"$f":"SUM(F10:F15)","v":71608.01},{"$f":"SUM(G10:G15)","v":6327.88},{"$f":"SUM(H10:H15)","v":11717.74},{"$f":"SUM(I10:I15)","v":65280.13},{"$f":"SUM(J10:J15)","v":6416.49},{"$f":"SUM(K10:K15)","v":6416.49},{"$f":"SUM(L10:L15)","v":1539.96},{"$f":"SUM(M10:M15)","v":16554.53}]
[]
[]
[]
[]
{"$rows_left_out":28}
{"sheet":"recibos","index":15,"n_rows":146,"n_cols":5,"rows_kept":146,"cut":false,"hidden":false,"merged":[[0,0,0,1],[0,3,0,4],[1,0,1,1],[1,3,1,4],[2,0,2,1],[2,3,2,4],[3,0,3,1],[3,3,3,4],[15,0,15,1],[15,3,15,4],[18,0,18,1],[18,3,18,4],[19,0,19,1],[19,3,19,4],[25,0,25,1],[25,3,25,4],[26,0,26,1],[26,3,26,4],[27,0,27,1],[27,3,27,4],[28,0,28,1],[28,3,28,4],[40,0,40,1],[40,3,40,4],[43,0,43,1],[43,3,43,4],[44,0,44,1],[44,3,44,4],[51,0,51,1],[51,3,51,4],[52,0,52,1],[52,3,52,4],[53,0,53,1],[53,3,53,4],[54,0,54,1],[54,3,54,4],[66,0,66,1],[66,3,66,4],[69,0,69,1],[69,3,69,4],[70,0,70,1],[70,3,70,4],[76,0,76,1],[76,3,76,4],[77,0,77,1],[77,3,77,4],[78,0,78,1],[78,3,78,4],[79,0,79,1],[79,3,79,4],[91,0,91,1],[91,3,91,4],[94,0,94,1],[94,3,94,4],[95,0,95,1],[95,3,95,4],[101,0,101,1],[101,3,101,4],[102,0,102,1],[102,3,102,4],[103,0,103,1],[103,3,103,4],[104,0,104,1],[104,3,104,4],[116,0,116,1],[116,3,116,4],[119,0,119,1],[119,3,119,4],[120,0,120,1],[120,3,120,4],[126,0,126,1],[126,3,126,4],[127,0,127,1],[127,3,127,4],[128,0,128,1],[128,3,128,4],[129,0,129,1],[129,3,129,4],[141,0,141,1],[141,3,141,4],[144,0,144,1],[144,3,144,4],[145,0,145,1],[145,3,145,4]]}
["BIOMETEPE R.L.",null,null,"BIOMETEPE R.L."]
["Comprobante de pago de salario",null,null,"Comprobante de pago de salario"]
["DEL 01-DIC-19 AL 31-DIC-19",null,null,{"$f":"A3","v":"DEL 01-DIC-19 AL 31-DIC-19"}]
[{"$f":"planilla!B10","v":"Priscila Castillo Fonseca"},null,null,{"$f":"planilla!B11","v":"Ermenson Urtecho "}]
["DETALLE DE INGRESOS",null,null,"DETALLE DE INGRESOS"]
["Salarios",{"$f":"VLOOKUP(A4, planilla!$B$10:$I$15, 3, 0)","v":17813.79},null,"Salarios",{"$f":"VLOOKUP(D4, planilla!$B$10:$I$15, 3, FALSE())","v":16000.13}]
["Ingresos Totales",{"$f":"B6","v":17813.79},null,"Ingresos Totales",{"$f":"E6","v":16000.13}]
["MENOS: DEDUCCIONES",null,null,"MENOS: DEDUCCIONES"]
["Inss Laboral",{"$f":"VLOOKUP(A4, planilla!$B$10:$I$15, 4, FALSE())","v":1246.97},null,"Inss Laboral",{"$f":"VLOOKUP(D4, planilla!$B$10:$I$15, 4, FALSE())","v":1120.01}]
["IR",{"$f":"VLOOKUP(A4, planilla!$B$10:$I$15, 6, FALSE())","v":1235.02},null,"IR",{"$f":"VLOOKUP(D4, planilla!$B$10:$I$15, 6, FALSE())","v":982.02}]
["Deducciones Totales",{"$f":"SUM(B9:B10)","v":2481.99},null,"Deducciones Totales",{"$f":"SUM(E9:E10)","v":2102.03}]
["Neto a Recibir",{"$f":"B7-B11","v":15331.8},null,"Neto a Recibir",{"$f":"E7-E11","v":13898.1}]
[]
[]
[]
["Entrega Conforme:",null,null,"Entrega Conforme:"]
[]
[]
[]
["Recibe Conforme:",null,null,"Recibe Conforme:"]
{"$rows_left_out":127}
{"sheet":"comprobante","index":16,"n_rows":59,"n_cols":9,"rows_kept":59,"cut":false,"hidden":false,"merged":[[0,9,1,9],[0,10,1,10],[8,0,8,8],[25,2,25,7],[26,2,26,8],[27,2,27,8],[28,1,28,8],[30,2,30,3],[31,2,31,3],[34,1,34,3],[35,1,35,8],[37,2,37,5],[38,2,38,5],[39,2,39,5],[40,2,40,5],[41,2,41,5],[42,2,42,5],[43,2,43,5],[44,2,44,5],[45,2,45,5],[46,2,46,5],[47,2,47,5],[48,2,48,5],[49,2,49,5],[50,2,50,5],[51,2,51,5],[52,2,52,5],[55,0,55,2]]}
[]
[]
[]
[]
[]
[null,null,null,null,null,null,null,"Reembolso",{"$f":"IF(CE!C3=\"Reembolso\", \"X\", \"\")","v":""}]
[null,null,null,null,null,null,null,"Pago",{"$f":"IF(CE!C3=\"Pago\", \"X\", \"\")","v":"X"}]
[null,null,null,null,null,null,null,"Anticipo",{"$f":"IF(CE!C3=\"Anticipo\", \"X\", \"\")","v":""}]
["COMPROBANTE DE EGRESO (CORDOBAS)"]
[]
[]
[]
[]
[]
[]
[]
[]
[]
[]
[]
{"$rows_left_out":39}