{"text_format":"1","workbook":"xlsx","n_sheets":24,"sheets":["loginscreen","Inicio","Usuarios","Catalogo","Principales","Asientos","Reportes","Bancos","Registros","logins","stock","productos","querr1","categorias","cd","D","H","01","02","03","04","CKS","CKCTRL","LM"],"not_rendered":{"charts":0,"images":18,"macros":1,"external_links":0,"defined_names":26,"comments":0,"pivot_tables":0},"unopened":[],"bounds":{"document_bytes":16777216,"sheet_cells":100000,"rows_first":2000,"rows_last":500,"rows_between":2000,"halvings":0,"cell_chars":16384,"cell_head_chars":4096},"cells_cut":0,"cells_raw":0,"read":"whole","date_system":"1900"}

{"sheet":"loginscreen","index":0,"n_rows":0,"n_cols":0,"rows_kept":0,"cut":false,"hidden":false,"merged":[]}

{"sheet":"Inicio","index":1,"n_rows":18,"n_cols":4,"rows_kept":18,"cut":false,"hidden":false,"merged":[[2,6,17,9],[5,3,5,5],[7,3,7,5],[9,3,9,5],[15,3,15,5],[17,3,17,5],[3,3,3,4],[11,3,11,4]]}
[]
[]
[]
[null,"N° RUC:"]
[]
[null,"NOMBRE DEL NEGOCIO:",null,"IGLESIA ESTRELLA DE BELÉN"]
[]
[null,"LEMA:",null,"EL SHADAI"]
[]
[null,"DIRECCIÓN:",null,"SAN MARCOS"]
{"$rows_left_out":9}
{"sheet":"Usuarios","index":2,"n_rows":20,"n_cols":4,"rows_kept":20,"cut":false,"hidden":false,"merged":[[2,0,3,7],[13,1,13,2],[13,3,13,4],[8,1,8,2],[5,1,5,2],[5,3,5,4],[6,1,6,2],[7,1,7,2],[6,3,6,4],[7,3,7,4],[8,3,8,4]]}
[]
[]
["LISTA DE USUARIOS QUE FIGURARÁN EN LOS ESTADOS FINANCIEROS"]
[]
[]
[null,"FUNCIÓN",null,"NOMBRE DE USUARIO"]
[null,"Elaborado por:",null,"Berta María Mora Alvarado"]
[null,"Revisado por:"]
[null,"Autorizado por:",null,"Socorro Sandoval"]
[]
{"$rows_left_out":11}
{"sheet":"Catalogo","index":3,"n_rows":169,"n_cols":6,"rows_kept":169,"cut":false,"hidden":false,"merged":[[2,0,3,5]]}
[]
[]
["Crear aquí su Plan Contable"]
[]
[]
[null,"COD. CTA.","NOMBRE DE LA CUENTA","TIPO","NATURALEZA","USAR EN"]
[null,100000,"ACTIVOS","RUBRO","D","BG"]
[null,110000,"ACTIVOS CORRIENTES","CLASE","D","BG"]
[null,110100,"CAJA","PRINCIPAL","D","BG"]
[null,110101,"CAJA GENERAL","DETALLE","D","BG"]
{"$rows_left_out":160}
{"sheet":"Principales","index":4,"n_rows":18,"n_cols":14,"rows_kept":18,"cut":false,"hidden":false,"merged":[[2,0,2,11],[4,13,4,15],[5,13,15,15]]}
[]
[]
["Hojas de resumen - Anexos de Estados Financieros"]
[]
["CODIGO","NOMBRE DE LA CUENTA",null,null,null,null,null,null,null,null,null,null,null,"INSTRUCCIONES"]
[110000,"ACTIVOS CORRIENTES",null,null,null,null,null,null,null,null,null,null,null,"Seleccione el código de la cuenta que desea consultar y luego haga clic en:\n\"Ver resumen\""]
[120000,"ACTIVOS NO CORRIENTES"]
[120200,"EDIFICIOS"]
[130000,"DEPRECIACIÓN ACUMULADA"]
[210000,"PASIVOS CORRIENTES"]
{"$rows_left_out":9}
{"sheet":"Asientos","index":5,"n_rows":197,"n_cols":6,"rows_kept":197,"cut":false,"hidden":false,"merged":[]}
[]
[]
[]
["ASIENTO N°",117,null,null,"Total Débitos:",{"$f":"ROUND(SUM(E9:E97), 2)","v":0}]
[]
["FECHA:",null,null,null,"Total Créditos:",{"$f":"ROUND(SUM(F9:F97), 2)","v":0}]
[null,null,null,null,"Diferencia",{"$f":"ABS(total_debitos-total_creditos)","v":0}]
["CÓD. CTA.","DOC #","NOMBRE DE LA CUENTA","CONCEPTO","DEBE","HABER"]
[null,null,{"$f":"IF(A9<>\"\", VLOOKUP(A9, plan_cuentas, 2, FALSE), \"\")","v":""}]
[null,null,""]
{"$rows_left_out":188}
{"sheet":"Reportes","index":6,"n_rows":10,"n_cols":11,"rows_kept":10,"cut":false,"hidden":false,"merged":[[5,7,5,11],[2,0,2,11]]}
[]
[]
["Seleccione un reporte para visualizar"]
[]
[]
[null,"LISTA DE INFORMES DISPONIBLES",null,null,null,null,null,"DEFINA POR FAVOR LA FECHA DEL PERÍODO"]
[null,4,"Balanza Consolidada.",null,null,null,null,null,"Desde",null,"Hasta"]
[null,4,"Estado de Resultados.",null,null,null,null,null,"2016-10-02",null,"2016-10-29"]
[null,4,"Balance General.",null,null,null,null,null,{"$f":"DATE(YEAR(final_before), MONTH(final_before), 1)","v":"2016-10-01"},null,{"$f":"fecha_inicial-1","v":"2016-10-01"}]
[null,4,"Flujo de Caja"]
{"$rows_left_out":1}
{"sheet":"Bancos","index":7,"n_rows":3,"n_cols":3,"rows_kept":3,"cut":false,"hidden":false,"merged":[]}
["CODIGO","NOMBRE DE LA CUENTA","NUM CK"]
[110201,"BANCO 1|CTA CTE 1| NIO",0]
[110202,"BANCO 1|CTA CTE 1|USD",0]

{"sheet":"Registros","index":8,"n_rows":344,"n_cols":9,"rows_kept":344,"cut":false,"hidden":false,"merged":[[0,1,0,7]]}
[null,"Registros de Diario"]
["N° ASIENTO","FECHA","COD_CTA","DOC #","NOMBRE DE LA CUENTA","CONCEPTO","DEBITOS","CREDITOS","PRINCIPAL"]
[1,"2016-03-31",110101,null,{"$f":"IF(C3<>\"\", VLOOKUP(C3, plan_cuentas, 2, FALSE), \"\")","v":"CAJA GENERAL"},"SALDO FINAL DE LA CUENTA MARZO",2569.4499999999998,null,110100]
[1,"2016-03-31",310101,null,"APORTES DE MIEMBROS","SALDO FINAL DE LA CUENTA MARZO",null,2569.4499999999998,310100]
[2,"2016-04-02",110101,null,"CAJA GENERAL","OFRENDA GENERAL DEL DÍA",40,null,110100]
[2,"2016-04-02",410101,null,"OFRENDAS DE MIEMBROS","OFRENDA GENERAL DEL DÍA",null,40,410100]
[3,"2016-04-03",110101,null,"CAJA GENERAL","OFRENDA GENERAL DEL DÍA",186.5,null,110100]
[3,"2016-04-03",410101,null,"OFRENDAS DE MIEMBROS","OFRENDA GENERAL DEL DÍA",null,186.5,410100]
[4,"2016-04-07",110101,null,"CAJA GENERAL","OFRENDA GENERAL DEL DÍA",49,null,110100]
[4,"2016-04-07",410101,null,"OFRENDAS DE MIEMBROS","OFRENDA GENERAL DEL DÍA",null,49,410100]
{"$rows_left_out":335}
{"sheet":"logins","index":9,"n_rows":3,"n_cols":2,"rows_kept":3,"cut":false,"hidden":false,"merged":[]}
["USUARIO","PASSWORD"]
["yesly","0106_carrusel"]
["gmartinez","g_martinez"]

{"sheet":"stock","index":10,"n_rows":6,"n_cols":8,"rows_kept":6,"cut":false,"hidden":false,"merged":[]}
["FECHA","TRANSACCION","ORDEN","CODIGO_PRODUCTO","CONCEPTOS","CANTIDAD","COSTO_UNIT","COSTO_TOTAL"]
["2016-08-06","ENTRADA",1,11010101,"COMPRAS",50,8.5,425]
["2016-08-06","SALIDA",1,11010101,"VENTAS",-30,8.5,-255]
["2016-08-06","ENTRADA",2,11010101,"COMPRAS",100,7,700]
["2016-08-06","SALIDA",1,11010101,"VENTAS",-20,8.5,-170]
["2016-08-06","SALIDA",2,11010101,"VENTAS",-40,7,-280]

{"sheet":"productos","index":11,"n_rows":3,"n_cols":5,"rows_kept":3,"cut":false,"hidden":false,"merged":[]}
["CODIGO_PROD","CATEGORIA","GRUPO","DESCRIPCION_DEL_PRODUCTO","PRESENTACION"]
[11010101,"BEBIDAS","BEBIDAS GASEOSAS","BIG COLA","500 ML"]
[11010102,"BEBIDAS","BEBIDAS GASEOSAS","BIG COLA","1000 ML"]

{"sheet":"querr1","index":12,"n_rows":10,"n_cols":5,"rows_kept":10,"cut":false,"hidden":false,"merged":[[0,0,0,4],[1,0,1,4],[2,0,2,4],[3,0,3,4],[5,0,5,1],[5,3,5,4]]}
[{"$f":"bussiness_name","v":"IGLESIA ESTRELLA DE BELÉN"}]
[{"$f":"UPPER(address)","v":"SAN MARCOS"}]
[{"$f":"\"***** Tel: \" & tel & \" *****\"","v":"***** Tel:  *****"}]
["EXISTENCIAS DE PRODUCTOS POR ORDEN DE PEDIDO"]
[]
["PRODUCTO:",null,11010101,"BIG COLA 500 ML"]
["NUMERO DE ORDEN","COSTO UNITARIO","ENTRADAS","SALIDAS","EXISTENCIAS"]
[1,8.5,50,-50,0]
[2,7,100,-40,60]
["**** TOTALES *****",null,150,-90,60]
{"$rows_left_out":1}
{"sheet":"categorias","index":13,"n_rows":19,"n_cols":3,"rows_kept":19,"cut":false,"hidden":false,"merged":[]}
["CODIGO_CATEGORIA","NOMBRE_CATEGORIA"]
[110401,"BEBIDAS"]
[110402,"MATERIAS PRIMAS"]
[110403,"CIGARRILLOS"]
[]
[]
["CODIGO_CATEGORIA","CODIGO_SUB_CATEGORIA","NOMBRE_SUB_CATEGORIA"]
[110401,11040101,"BEBIDAS NATURALES"]
[110401,11040102,"BEBIDAS GASEOSAS"]
[110401,11040103,"BEBIDAS ALCOHOLICAS"]
{"$rows_left_out":10}
{"sheet":"cd","index":14,"n_rows":71,"n_cols":7,"rows_kept":71,"cut":false,"hidden":false,"merged":[]}
["FECHA","CUENTA","DIA","NOMBRE DE LA CUENTA","DESCRIPCIÓN DE LA CUENTA","DEBE","HABER"]
["2016-10-19",110101,{"$f":"WEEKDAY(A2, 2)","v":3},{"$f":"IF(B2<>\"\", VLOOKUP(B2, plan_cuentas, 2, FALSE), \"\")","v":"CAJA GENERAL"},"OFRENDA DEL DIA",58]
["2016-10-19",410101,3,"OFRENDAS DE MIEMBROS","OFRENDA DEL DIA",null,58]
["2016-10-20",110101,4,"CAJA GENERAL","OFRENDA DEL DIA",33]
["2016-10-20",610202,4,"MANTENIMIENTO DE EDIFICIOS","COMPRA CERÁMICA PARA LA ACERA DE LA IGLESIA",600]
["2016-10-20",410101,4,"OFRENDAS DE MIEMBROS","OFRENDA DEL DIA",null,33]
["2016-10-20",110101,4,"CAJA GENERAL","COMPRA CERÁMICA PARA LA ACERA DE LA IGLESIA",null,600]
["2016-10-22",110101,6,"CAJA GENERAL","DIEZMOS YESLY MORA Y JEREMY MORA",{"$f":"150+2800","v":2950}]
["2016-10-22",410401,6,"DIEZMOS DE MIEMBROS","YESLY MORA",null,2800]
["2016-10-22",410401,6,"DIEZMOS DE MIEMBROS","JEREMY MORA",null,150]
{"$rows_left_out":62}
{"sheet":"D","index":15,"n_rows":66,"n_cols":6,"rows_kept":66,"cut":false,"hidden":false,"merged":[[1,0,1,5],[2,0,2,5],[3,0,3,5],[4,0,4,5],[6,3,6,5],[7,5,8,5],[59,0,59,1],[63,0,63,1],[63,4,63,5],[64,0,64,1],[64,4,64,5],[7,0,8,0],[7,1,8,1],[7,2,8,2],[7,3,8,3],[7,4,8,4],[70,2,70,3],[65,0,65,1],[65,4,65,5],[66,0,66,1],[66,4,66,5],[68,2,68,3],[69,2,69,3]]}
[null,null,null,null,"Proteger"]
[{"$f":"bussiness_name","v":"IGLESIA ESTRELLA DE BELÉN"}]
[{"$f":"\"RESUMEN CONTABLE DE \"&B7","v":"RESUMEN CONTABLE DE "}]
[{"$f":"\"DEL \"&TEXT(fecha_inicial, \"DD\")&\" DE \"&UPPER(TEXT(fecha_inicial, \"MMMM\"))&\" DEL \" & TEXT(fecha_inicial, \"YYYY\") & \" AL \"&TEXT(fecha_final, \"DD\")&\" DE \"&UPPER(TEXT(fecha_final, \"MMMM\"))&\" DEL \"&TEXT(fecha_final, \"YYYY\")","v":"DEL 02 DE OCTUBRE DEL 2016 AL 29 DE OCTUBRE DEL 2016"}]
[{"$f":"address & \" *** Tel/Fax:  \" & tel & \" *** \" & email","v":"SAN MARCOS *** Tel/Fax:   *** "}]
[]
[null,{"$f":"UPPER(IF(ISBLANK(A7),\"\",IFERROR(VLOOKUP(A7,plan_cuentas,2,FALSE),\"Código de cuenta incorrecto\")))","v":""},null,{"$f":"\"MOVIMIENTOS DE \"&UPPER(TEXT(fecha_final, \"MMMM\"))","v":"MOVIMIENTOS DE OCTUBRE"}]
["CODIGO","NOMBRE DE LA CUENTA","SALDO INICIAL","DEBITOS","CREDITOS","SALDO FINAL"]
[]
[]
{"$rows_left_out":57}
{"sheet":"H","index":16,"n_rows":66,"n_cols":6,"rows_kept":66,"cut":false,"hidden":false,"merged":[[1,0,1,5],[2,0,2,5],[3,0,3,5],[4,0,4,5],[6,3,6,5],[7,5,8,5],[59,0,59,1],[63,0,63,1],[63,4,63,5],[64,0,64,1],[64,4,64,5],[7,0,8,0],[7,1,8,1],[7,2,8,2],[7,3,8,3],[7,4,8,4],[70,2,70,3],[65,0,65,1],[65,4,65,5],[66,0,66,1],[66,4,66,5],[68,2,68,3],[69,2,69,3]]}
[null,null,null,null,"Proteger"]
[{"$f":"bussiness_name","v":"IGLESIA ESTRELLA DE BELÉN"}]
[{"$f":"\"RESUMEN CONTABLE DE \"&B7","v":"RESUMEN CONTABLE DE "}]
[{"$f":"\"DEL \"&TEXT(fecha_inicial, \"DD\")&\" DE \"&UPPER(TEXT(fecha_inicial, \"MMMM\"))&\" DEL \" & TEXT(fecha_inicial, \"YYYY\") & \" AL \"&TEXT(fecha_final, \"DD\")&\" DE \"&UPPER(TEXT(fecha_final, \"MMMM\"))&\" DEL \"&TEXT(fecha_final, \"YYYY\")","v":"DEL 02 DE OCTUBRE DEL 2016 AL 29 DE OCTUBRE DEL 2016"}]
[{"$f":"address & \" *** Tel/Fax:  \" & tel & \" *** \" & email","v":"SAN MARCOS *** Tel/Fax:   *** "}]
[]
[null,{"$f":"UPPER(IF(ISBLANK(A7),\"\",IFERROR(VLOOKUP(A7,plan_cuentas,2,FALSE),\"Código de cuenta incorrecto\")))","v":""},null,{"$f":"\"MOVIMIENTOS DE \"&UPPER(TEXT(fecha_final, \"MMMM\"))","v":"MOVIMIENTOS DE OCTUBRE"}]
["CODIGO","NOMBRE DE LA CUENTA","SALDO INICIAL","DEBITOS","CREDITOS","SALDO FINAL"]
[]
[]
{"$rows_left_out":57}
{"sheet":"01","index":17,"n_rows":129,"n_cols":8,"rows_kept":129,"cut":false,"hidden":false,"merged":[[1,0,1,7],[122,0,122,1],[5,4,5,5],[5,2,5,3],[5,6,5,7],[5,0,6,0],[5,1,6,1],[2,0,2,7],[3,0,3,7],[4,0,4,7],[126,0,126,1],[128,2,128,4],[126,5,126,7],[127,0,127,1],[129,2,129,4],[127,5,127,7],[128,0,128,1],[128,5,128,7]]}
[null,null,null,null,"Proteger"]
[{"$f":"bussiness_name","v":"IGLESIA ESTRELLA DE BELÉN"}]
["BALANZA CONSOLIDADA DE SALDOS"]
[{"$f":"\"DEL \"&TEXT(fecha_inicial, \"DD\")&\" DE \"&UPPER(TEXT(fecha_inicial, \"MMMM\"))&\" DEL \" & TEXT(fecha_inicial, \"YYYY\") & \" AL \"&TEXT(fecha_final, \"DD\")&\" DE \"&UPPER(TEXT(fecha_final, \"MMMM\"))&\" DEL \"&TEXT(fecha_final, \"YYYY\")","v":"DEL 02 DE OCTUBRE DEL 2016 AL 29 DE OCTUBRE DEL 2016"}]
[{"$f":"address & \" *** Tel/Fax:  \" & tel & \" *** \" & email","v":"SAN MARCOS *** Tel/Fax:   *** "}]
["CÓDIGO CUENTA","DESCRIPCIÓN DE LA CUENTA","SALDO INICIAL",null,"MOVIMIENTOS DEL PERIÓDO",null,"SALDO FINAL"]
[null,null,"DEUDOR","ACREEDOR","DEUDOR","ACREEDOR","DEUDOR","ACREEDOR"]
[100000,{"$f":"IFERROR(IF(A8<>\"\", VLOOKUP(A8, plan_cuentas,2, FALSE), \"\"), \"CÓDIGO INCORRECTO\")","v":"ACTIVOS"},{"$f":"C9+C26","v":1233.6000000000004},0,4024.5,5110.09,148.01000000000022,0]
[110000,"ACTIVOS CORRIENTES",{"$f":"C10+C15+C19+C23","v":1233.6000000000004},{"$f":"D10+D15+D19+D23","v":0},4024.5,5110.09,148.01000000000022,0]
[110100,"CAJA",{"$f":"SUM(C11:C12)","v":1233.6000000000004},{"$f":"SUM(D11:D12)","v":0},4024.5,5110.09,148.01000000000022,0]
{"$rows_left_out":120}
{"sheet":"02","index":18,"n_rows":32,"n_cols":8,"rows_kept":32,"cut":false,"hidden":false,"merged":[[30,5,30,6],[31,5,31,6],[1,0,1,7],[2,0,2,7],[3,0,3,7],[4,0,4,7],[5,2,5,4],[5,5,5,7],[5,0,6,0],[5,1,6,1]]}
[null,null,null,null,"Proteger"]
[{"$f":"bussiness_name","v":"IGLESIA ESTRELLA DE BELÉN"}]
["ESTADO DE RESULTADOS CONSOLIDADO"]
[{"$f":"\"DEL \"&TEXT(fecha_inicial, \"DD\")&\" DE \"&UPPER(TEXT(fecha_inicial, \"MMMM\"))&\" DEL \" & TEXT(fecha_inicial, \"YYYY\") & \" AL \"&TEXT(fecha_final, \"DD\")&\" DE \"&UPPER(TEXT(fecha_final, \"MMMM\"))&\" DEL \"&TEXT(fecha_final, \"YYYY\")","v":"DEL 02 DE OCTUBRE DEL 2016 AL 29 DE OCTUBRE DEL 2016"}]
[{"$f":"address & \" *** Tel/Fax:  \" & tel & \" *** \" & email","v":"SAN MARCOS *** Tel/Fax:   *** "}]
["CÓDIGO CUENTA","DESCRIPCIÓN DE LA CUENTA","DETALLE DE RESULTADOS",null,null,"DATOS PARA ANÁLISIS FINANCIERO"]
[null,"DESCRIPCIÓN DE LA CUENTA","RESULTADO MES ANTERIOR","RESULTADO MES ACTUAL","RESULTADOS ACUMULADOS","VARIACIÓN ABSOLUTA","VARIACIÓN RELATIVA","%\nACTUAL"]
[400000,{"$f":"IF(A8<>\"\", IFERROR(VLOOKUP(A8, plan_cuentas, 2, FALSE), \"CÓDIGO INCORRECTO\"), \"\")","v":"INGRESOS"},{"$f":"C9","v":112.03999999999999},{"$f":"D9","v":3824.5},12479.27,3712.46,{"$f":"IFERROR(F8/C8, 0)","v":33.135130310603358},{"$f":"IFERROR(D8/$D$8, 0)","v":1}]
[410000,"INGRESOS EN EFECTIVO",{"$f":"SUM(C10:C13)","v":112.03999999999999},{"$f":"SUM(D10:D13)","v":3824.5},{"$f":"SUM(E10:E13)","v":12479.27},{"$f":"SUM(F10:F13)","v":3712.46},{"$f":"IFERROR(F9/C9, 0)","v":33.135130310603358},{"$f":"IFERROR(D9/$D$8, 0)","v":1}]
[410100,"OFRENDAS GENERALES",{"$f":"IF(A10<>\"\", IF(VLOOKUP(A10, plan_cuentas, 4, FALSE)=\"H\", SUMIFS(Registros!H:H, Registros!B:B, \">=\"&init_before, Registros!B:B, \"<=\" & final_before, Registros!I:I, \"=\"& '02'!A10)-SUMIFS(Registros!G:G, Registros!B:B, \">=\"&init_before, Registros!B:B, \"<=\" & final_before, Registros!I:I, \"=\"& '02'!A10), SUMIFS(Registros!G:G, Registros!B:B, \">=\"&init_before, Registros!B:B, \"<=\" & final_before, Registros!I:I, \"=\"& '02'!A10)-SUMIFS(Registros!H:H, Registros!B:B, \">=\"&init_before, Registros!B:B, \"<=\" & final_before, Registros!I:I, \"=\"& '02'!A10)), 0)","v":12.04},{"$f":"IF(A10<>\"\", IF(VLOOKUP(A10, plan_cuentas, 4, FALSE)=\"H\", SUMIFS(Registros!H:H, Registros!B:B, \">=\"&fecha_inicial, Registros!B:B, \"<=\" & fecha_final, Registros!I:I, \"=\"& '02'!A10)-SUMIFS(Registros!G:G, Registros!B:B, \">=\"& fecha_inicial, Registros!B:B, \"<=\" & fecha_final, Registros!I:I, \"=\"& '02'!A10), SUMIFS(Registros!G:G, Registros!B:B, \">=\"&fecha_inicial, Registros!B:B, \"<=\" & fecha_final, Registros!I:I, \"=\"& '02'!A10)-SUMIFS(Registros!H:H, Registros!B:B, \">=\"&fecha_inicial, Registros!B:B, \"<=\" & fecha_final, Registros!I:I, \"=\"& '02'!A10)), 0)","v":574.5},{"$f":"IF(A10<>\"\", IF(VLOOKUP(A10, plan_cuentas, 4, FALSE)=\"H\", SUMIFS(Registros!H:H, Registros!B:B, \"<=\" & fecha_final, Registros!I:I, \"=\" & A10)-SUMIFS(Registros!G:G, Registros!B:B, \"<=\" & fecha_final,  Registros!I:I, \"=\" & A10), SUMIFS(Registros!G:G, Registros!B:B, \"<=\" & fecha_final,  Registros!I:I, \"=\" & A10)-SUMIFS(Registros!H:H, Registros!B:B, \"<=\" & fecha_final, Registros!I:I, \"=\" & A10)), 0)","v":4672.2699999999995},{"$f":"D10-C10","v":562.46},{"$f":"IFERROR(F10/C10, 0)","v":46.715946843853828},{"$f":"IFERROR(D10/$D$8, 0)","v":0.15021571447248006}]
{"$rows_left_out":23}
{"sheet":"03","index":19,"n_rows":27,"n_cols":7,"rows_kept":27,"cut":false,"hidden":false,"merged":[[1,0,1,6],[2,0,2,6],[3,0,3,6],[4,0,4,6]]}
[null,null,null,null,"Proteger"]
[{"$f":"bussiness_name","v":"IGLESIA ESTRELLA DE BELÉN"}]
["BALANCE GENERAL CONSOLIDADO"]
[{"$f":"\" AL \"&TEXT(fecha_final, \"DD\")&\" DE \"&UPPER(TEXT(fecha_final, \"MMMM\"))&\" DEL \"&TEXT(fecha_final, \"YYYY\")","v":" AL 29 DE OCTUBRE DEL 2016"}]
[{"$f":"address & \" *** Tel/Fax:  \" & tel & \" *** \" & email","v":"SAN MARCOS *** Tel/Fax:   *** "}]
["CÓDIGO CUENTA","DESCRIPCIÓN DE LA CUENTA",null,null,"CÓDIGO CUENTA","DESCRIPCIÓN DE LA CUENTA"]
[100000,{"$f":"IF(A7<>\"\", IFERROR(VLOOKUP(A7, plan_cuentas, 2, FALSE), \"CÓDIGO INCORRECTO\"), \"\")","v":"ACTIVOS"},null,null,200000,{"$f":"IF(E7<>\"\", IFERROR(VLOOKUP(E7, plan_cuentas, 2, FALSE), \"CÓDIGO INCORRECTO\"), \"\")","v":"PASIVOS"}]
[110000,"ACTIVOS CORRIENTES",null,null,210000,"PASIVOS CORRIENTES"]
[110100,"CAJA",{"$f":"IF(A9<>\"\", IF(VLOOKUP(A9, plan_cuentas, 4, FALSE)=\"H\", SUMIFS(Registros!H:H, Registros!B:B, \"<=\" & fecha_final, Registros!I:I, \"=\"& '03'!A9)-SUMIFS(Registros!G:G, Registros!B:B, \"<=\" & fecha_final, Registros!I:I, \"=\"& '03'!A9), SUMIFS(Registros!G:G, Registros!B:B, \"<=\" & fecha_final, Registros!I:I, \"=\"& '03'!A9)-SUMIFS(Registros!H:H, Registros!B:B, \"<=\" & fecha_final, Registros!I:I, \"=\"& '03'!A9)), 0)","v":148.01000000000022},null,210100,"PROVEEDORES",{"$f":"IF(E9<>\"\", IF(VLOOKUP(E9, plan_cuentas, 4, FALSE)=\"H\", SUMIFS(Registros!H:H, Registros!B:B, \"<=\" & fecha_final, Registros!I:I, \"=\"& '03'!E9)-SUMIFS(Registros!G:G, Registros!B:B, \"<=\" & fecha_final, Registros!I:I, \"=\"& '03'!E9), SUMIFS(Registros!G:G, Registros!B:B, \"<=\" & fecha_final, Registros!I:I, \"=\"& '03'!E9)-SUMIFS(Registros!H:H, Registros!B:B, \"<=\" & fecha_final, Registros!I:I, \"=\"& '03'!E9)), 0)","v":0}]
[110400,{"$f":"IF(A10<>\"\", IFERROR(VLOOKUP(A10, plan_cuentas, 2, FALSE), \"CÓDIGO INCORRECTO\"), \"\")","v":"INVENTARIOS"},{"$f":"IF(A10<>\"\", IF(VLOOKUP(A10, plan_cuentas, 4, FALSE)=\"H\", SUMIFS(Registros!H:H, Registros!B:B, \"<=\" & fecha_final, Registros!I:I, \"=\"& '03'!A10)-SUMIFS(Registros!G:G, Registros!B:B, \"<=\" & fecha_final, Registros!I:I, \"=\"& '03'!A10), SUMIFS(Registros!G:G, Registros!B:B, \"<=\" & fecha_final, Registros!I:I, \"=\"& '03'!A10)-SUMIFS(Registros!H:H, Registros!B:B, \"<=\" & fecha_final, Registros!I:I, \"=\"& '03'!A10)), 0)","v":0},null,210200,"DOCUMENTOS POR PAGAR",{"$f":"IF(E10<>\"\", IF(VLOOKUP(E10, plan_cuentas, 4, FALSE)=\"H\", SUMIFS(Registros!H:H, Registros!B:B, \"<=\" & fecha_final, Registros!I:I, \"=\"& '03'!E10)-SUMIFS(Registros!G:G, Registros!B:B, \"<=\" & fecha_final, Registros!I:I, \"=\"& '03'!E10), SUMIFS(Registros!G:G, Registros!B:B, \"<=\" & fecha_final, Registros!I:I, \"=\"& '03'!E10)-SUMIFS(Registros!H:H, Registros!B:B, \"<=\" & fecha_final, Registros!I:I, \"=\"& '03'!E10)), 0)","v":0}]
{"$rows_left_out":18}
{"sheet":"04","index":20,"n_rows":46,"n_cols":6,"rows_kept":46,"cut":false,"hidden":false,"merged":[[1,0,1,5],[2,0,2,5],[3,0,3,5],[4,0,4,5]]}
[null,null,null,null,"Proteger"]
[{"$f":"bussiness_name","v":"IGLESIA ESTRELLA DE BELÉN"}]
["REPORTE DE TESORERÍA"]
[{"$f":"\"DEL \"&TEXT(fecha_inicial, \"DD\")&\" DE \"&UPPER(TEXT(fecha_inicial, \"MMMM\"))&\" DEL \" & TEXT(fecha_inicial, \"YYYY\") & \" AL \"&TEXT(fecha_final, \"DD\")&\" DE \"&UPPER(TEXT(fecha_final, \"MMMM\"))&\" DEL \"&TEXT(fecha_final, \"YYYY\")","v":"DEL 02 DE OCTUBRE DEL 2016 AL 29 DE OCTUBRE DEL 2016"}]
[{"$f":"address & \" *** Tel/Fax:  \" & tel & \" *** \" & email","v":"SAN MARCOS *** Tel/Fax:   *** "}]
[]
["CÓDIGO","INGRESOS TOTALES DEL MES",null,null,null,{"$f":"E8+E13","v":824.5}]
[410100,{"$f":"IFERROR(IF(A8<>\"\", VLOOKUP(A8, plan_cuentas,2, FALSE), \"\"), \"CÓDIGO INCORRECTO\")","v":"OFRENDAS GENERALES"},null,null,{"$f":"SUM(D9:D11)","v":774.5}]
[410101,"OFRENDAS DE MIEMBROS",null,{"$f":"IF(A9<>\"\", SUMIFS(Registros!H:H, Registros!B:B, \">=\" & fecha_inicial, Registros!B:B, \"<=\" & fecha_final, Registros!C:C, \"=\" &A9), 0)","v":474.5}]
[null,"REVERSION DE GASTO EN TRALADO CERAMICA",null,200]
{"$rows_left_out":37}
{"sheet":"CKS","index":21,"n_rows":4,"n_cols":1,"rows_kept":4,"cut":false,"hidden":false,"merged":[[1,0,1,4],[2,0,2,4],[3,0,3,4]]}
[]
[{"$f":"bussiness_name","v":"IGLESIA ESTRELLA DE BELÉN"}]
["CONTROL DE CHEQUES"]
[{"$f":"address & \"----TELÉFONO: ----\" & tel & \"----E-MAIL: ----\" & email","v":"SAN MARCOS----TELÉFONO: --------E-MAIL: ----"}]

{"sheet":"CKCTRL","index":22,"n_rows":6,"n_cols":6,"rows_kept":6,"cut":false,"hidden":false,"merged":[[1,0,1,4],[2,0,2,4],[3,0,3,4]]}
[]
[{"$f":"bussiness_name","v":"IGLESIA ESTRELLA DE BELÉN"}]
["CONTROL DE CHEQUES"]
[{"$f":"address & \"----TELÉFONO: ----\" & tel & \"----E-MAIL: ----\" & email","v":"SAN MARCOS----TELÉFONO: --------E-MAIL: ----"}]
[]
["No. ASIENTO","FECHA","No. CK","CUENTA BANCARIA","BENEFICIARIO","VALOR"]

{"sheet":"LM","index":23,"n_rows":14,"n_cols":5,"rows_kept":14,"cut":false,"hidden":false,"merged":[[1,0,1,4],[2,0,2,4],[3,0,3,4]]}
[]
[{"$f":"bussiness_name","v":"IGLESIA ESTRELLA DE BELÉN"}]
[{"$f":"\"LIBRO MAYOR DE \" & B6","v":"LIBRO MAYOR DE DIEZMOS DE MIEMBROS"}]
[{"$f":"address & \"----TELÉFONO: ----\" & tel & \"----E-MAIL: ----\" & email","v":"SAN MARCOS----TELÉFONO: --------E-MAIL: ----"}]
[]
[410401,{"$f":"UPPER(IF(A6<>\"\",VLOOKUP(A6,plan_cuentas,2,FALSE), \"\"))","v":"DIEZMOS DE MIEMBROS"}]
["FECHA","DESCRIPCIÓN DE LA TRANSACCIÓN","DÉBITOS","CRÉDITOS","SALDO"]
["2016-10-02","Saldo inicial de la cuenta",0,0,4377]
["2016-10-22","YESLY MORA",null,2800,7177]
["2016-10-22","JEREMY MORA",null,150,7327]
{"$rows_left_out":4}