{"text_format":"1","workbook":"xlsx","n_sheets":20,"sheets":["Inicio","Usuarios","Cuentas","Principales","Asientos","Registros","Reportes","Inventario","D","H","01","02","03","LM","1000","2000","3000","4000","5000","6000"],"not_rendered":{"charts":0,"images":15,"macros":1,"external_links":0,"defined_names":27,"comments":0,"pivot_tables":0},"unopened":[],"bounds":{"document_bytes":16777216,"sheet_cells":100000,"rows_first":2000,"rows_last":500,"rows_between":2000,"halvings":0,"cell_chars":16384,"cell_head_chars":4096},"cells_cut":0,"cells_raw":0,"read":"whole","date_system":"1900"}

{"sheet":"Inicio","index":0,"n_rows":23,"n_cols":3,"rows_kept":23,"cut":false,"hidden":false,"merged":[[7,0,8,5],[14,2,14,3],[18,2,18,3],[22,2,22,3]]}
[]
[]
[]
[]
[]
[]
[]
["Ingrese en esta sección los datos generales del negocio"]
[]
[]
[]
[]
[null,"N° RUC:","569-010682-0000R"]
[]
[null,"Nombre de la Empresa:","CONSULTORES DE OMETEPE"]
[]
[null,"Categoría Fiscal:","CUOTA FIJA"]
[]
[null,"Dirección:","Barrio el Progreso, San Jorge, Rivas."]
[]
[null,"Teléfono/Fax:",89040457]
[]
[null,"E-mail:","escribeme@radioometepe.com"]

{"sheet":"Usuarios","index":1,"n_rows":23,"n_cols":5,"rows_kept":23,"cut":false,"hidden":false,"merged":[[7,0,8,5],[10,2,10,3],[11,2,11,3],[12,2,12,3],[13,2,13,3]]}
[]
[]
[]
[]
[]
["INICIO","USUARIOS","PLAN DE CUENTAS","ASIENTOS","REPORTES"]
[]
["Ingrese en esta sección los datos de las personas que figurarán como signatarios en los reportes financieros"]
[]
[]
[null,"Facultad","Usuario",null,"Cargo"]
[null,"Elabora","Arlen de Jesús Baltodano López",null,"Auxiliar de Contabilidad"]
[null,"Revisa","Gersan Arguello Prado",null,"Contador General"]
[null,"Autoriza","Matilda Padilla Mayorga",null,"Gerente de Finanzas"]
[]
[]
[]
[]
[]
[]
["Elabora"]
["Revisa"]
["Autoriza"]

{"sheet":"Cuentas","index":2,"n_rows":103,"n_cols":6,"rows_kept":103,"cut":false,"hidden":false,"merged":[[10,2,10,3],[7,1,8,4]]}
[]
[]
[]
[]
[]
["INICIO","USUARIOS","PLAN DE CUENTAS","ASIENTOS","REPORTES"]
[]
[null,"En esta sección usted podrá personalizar su Plan de Cuentas. Cree, edite, elimine cuentas desde esta sección únicamente"]
[]
[]
[null,"CÓDIGO DE LA CUENTA","NOMBRE DE LA CUENTA",null,"NATURALEZA","TIPO"]
[null,1000,"ACTIVOS",null,"D","RUBRO"]
[null,1100,"ACTIVOS CIRCULANTES",null,"D","CLASE"]
[null,1101,"CAJA",null,"D","PRINCIPAL"]
[null,1102,"FONDO FIJO DE CAJA CHICA",null,"D","PRINCIPAL"]
[null,1103,"BANCOS",null,"D","PRINCIPAL"]
[null,1104,"INVERSIONES TEMPORALES",null,"D","PRINCIPAL"]
[null,1105,"CLIENTES",null,"D","PRINCIPAL"]
[null,1106,"DOCUMENTOS POR COBRAR",null,"D","PRINCIPAL"]
[null,1107,"CUENTAS POR COBRAR A EMPLEADOS",null,"D","PRINCIPAL"]
[null,1108,"IVA ACREDITABLE",null,"D","PRINCIPAL"]
[null,1109,"ANTICIPO DE IMPUESTOS",null,"D","PRINCIPAL"]
[null,1110,"INVENTARIOS",null,"D","PRINCIPAL"]
[null,1111,"ANTICIPO A PROVEEDORES",null,"D","PRINCIPAL"]
[null,1112,"RENTAS PAGADAS POR ANTICIPADO",null,"D","PRINCIPAL"]
[null,1113,"INTERESES PAGADOS POR ANTICIPADO",null,"D","PRINCIPAL"]
[]
[null,1200,"ACTIVOS FIJOS",null,"D","CLASE"]
[null,1201,"TERRENOS",null,"D","PRINCIPAL"]
[null,1202,"EDIFICIOS",null,"D","PRINCIPAL"]
[null,1203,"MAQUINARIA",null,"D","PRINCIPAL"]
[null,1204,"MOBILIARIO Y EQUIPO DE OFICINA",null,"D","PRINCIPAL"]
[null,1205,"MUEBLES Y ENSERES",null,"D","PRINCIPAL"]
[null,1206,"EQUIPO DE TRANSPORTE",null,"D","PRINCIPAL"]
[null,1207,"EQUIPO DE ENTREGA Y REPARTO",null,"D","PRINCIPAL"]
[]
[null,1300,"ACTIVOS INTANGIBLES",null,"D","CLASE"]
[null,1301,"DERECHOS DE AUTOR",null,"D","PRINCIPAL"]
[null,1302,"PATENTES",null,"D","PRINCIPAL"]
[null,1303,"MARCAS REGISTRADAS",null,"D","PRINCIPAL"]
[null,1304,"NOMBRES COMERCIALES",null,"D","PRINCIPAL"]
[null,1305,"CRÉDITO MERCANTIL",null,"D","PRINCIPAL"]
[null,1306,"GASTOS DE CONSTITUCIÓN",null,"D","PRINCIPAL"]
[null,1307,"GASTOS DE ORGANIZACIÓN",null,"D","PRINCIPAL"]
[null,1308,"GASTOS DE INSTALACIÓN",null,"D","PRINCIPAL"]
[null,1309,"GASTOS DE INVESTIGACIÓN",null,"D","PRINCIPAL"]
[]
[null,1400,"DEPRECIACIÓN Y AMORTIZACIÓN",null,"H","CLASE"]
[null,1401,"DEPRECIACIÓN ACUMULADA",null,"H","PRINCIPAL"]
[null,1402,"AMORTIZACIÓN DE INTANGIBLES",null,"H","PRINCIPAL"]
[]
[null,2000,"PASIVOS",null,"H","RUBRO"]
[null,2100,"PASIVOS CIRCULANTES",null,"H","CLASE"]
[null,2101,"PROVEEDORES",null,"H","PRINCIPAL"]
[null,2102,"DOCUMENTOS POR PAGAR",null,"H","PRINCIPAL"]
[null,2103,"ACREEDORES",null,"H","PRINCIPAL"]
[null,2104,"ACREEDORES BANCARIOS",null,"H","PRINCIPAL"]
[null,2105,"ANTICIPOS DE CLIENTES",null,"H","PRINCIPAL"]
[null,2106,"IVA POR PAGAR",null,"H","PRINCIPAL"]
[null,2107,"IR POR PAGAR",null,"H","PRINCIPAL"]
[null,2108,"RENTAS COBRADAS POR ANTICIPADO",null,"H","PRINCIPAL"]
[null,2109,"INTERESES COBRADOS POR ANTICIPADOS",null,"H","PRINCIPAL"]
[]
[null,2200,"PASIVOS FIJOS",null,"H","CLASE"]
[null,2201,"ACREEDORES HIPOTECARIOS",null,"H","PRINCIPAL"]
[null,2202,"ACREEDORES BANCARIOS",null,"H","PRINCIPAL"]
[null,2203,"DOCUMENTOS POR PAGAR L/P",null,"H","PRINCIPAL"]
[]
[null,3000,"CAPITAL CONTABLE",null,"H","RUBRO"]
[null,3100,"CAPITAL SOCIAL",null,"H","CLASE"]
[null,3101,"CAPITAL INICIAL",null,"H","PRINCIPAL"]
[null,3102,"APORTACIONES",null,"H","PRINCIPAL"]
[null,3103,"RESERVA",null,"H","PRINCIPAL"]
[null,3104,"UTILIDADES RETENIDAS",null,"H","PRINCIPAL"]
[null,3105,"UTILIDAD DEL EJERCICIO",null,"H","PRINCIPAL"]
[]
[null,4000,"INGRESOS",null,"H","RUBRO"]
[null,4100,"VENTAS DE CONTADO",null,"H","CLASE"]
[null,4101,"VENTA DE MERCANCÍAS AL CONTADO",null,"H","PRINCIPAL"]
[null,4102,"OTROS INGRESOS",null,"H","PRINCIPAL"]
[null,4200,"VENTAS DE CREDITO",null,"H","CLASE"]
[null,4201,"VENTA DE MERCANCÍAS AL CRÉDITO",null,"H","PRINCIPAL"]
[null,4202,"OTROS INGRESOS",null,"H","PRINCIPAL"]
[]
[null,5000,"COSTOS",null,"D","RUBRO"]
[null,5100,"COSTO DE VENTAS",null,"D","CLASE"]
[null,5101,"COSTO DE BIENES",null,"D","PRINCIPAL"]
[null,5102,"OTROS COSTOS",null,"D","PRINCIPAL"]
[]
[null,6000,"GASTOS",null,"D","RUBRO"]
[null,6100,"GASTOS OPERATIVOS",null,"D","CLASE"]
[null,6101,"GASTOS DE ADMINISTRACIÓN",null,"D","PRINCIPAL"]
[null,6102,"GASTOS DE VENTAS",null,"D","PRINCIPAL"]
[]
[null,6200,"DEPRECIACIÓN Y AMORTIZACIÓN",null,"D","CLASE"]
[null,6201,"GASTOS POR DEPRECIACIÓN",null,"D","PRINCIPAL"]
[null,6202,"GASTOS POR AMORTIZACIÓN",null,"D","PRINCIPAL"]
[]
[null,6300,"GASTOS FINANCIEROS",null,"D","CLASE"]
[null,6301,"GASTO POR INTERESES",null,"D","PRINCIPAL"]
[]
[null,6400,"IMPUESTOS",null,"D","CLASE"]
[null,6401,"IMPUESTOS SOBRE LA RENTA",null,"D","PRINCIPAL"]

{"sheet":"Principales","index":3,"n_rows":17,"n_cols":5,"rows_kept":17,"cut":false,"hidden":false,"merged":[[7,1,8,4],[10,2,10,3]]}
[]
[]
[]
[]
[]
["INICIO","USUARIOS","PLAN DE CUENTAS","ASIENTOS","REPORTES"]
[]
[null,"En esta sección usted podrá personalizar su Plan de Cuentas. Cree, edite, elimine cuentas desde esta sección únicamente"]
[]
[]
[null,"CODIGO DE CUENTA","NOMBRE DE LA CUENTA"]
[null,1000,"ACTIVOS"]
[null,2000,"PASIVOS"]
[null,3000,"CAPITAL CONTABLE"]
[null,4000,"INGRESOS"]
[null,5000,"COSTOS"]
[null,6000,"GASTOS"]

{"sheet":"Asientos","index":4,"n_rows":150,"n_cols":6,"rows_kept":150,"cut":false,"hidden":false,"merged":[]}
[]
[]
[]
[]
[]
[]
[]
["N° de Asiento",null,null,null,"Total Débitos:"]
[]
[0,null,null,null,"Total Créditos:"]
[]
[null,null,null,null,"Diferencia:"]
[]
["FECHA","CÓDIGO DE CUENTA","NOMBRE DE LA CUENTA","DESCRIPCIÓN","DÉBITOS","CRÉDITOS"]
[null,null,{"$f":"IF(ISBLANK(B15), \"\", IFERROR(VLOOKUP(B15, plan_cuentas, 2, FALSE), \"Código de cuenta incorrecto\"))","v":""}]
[null,null,""]
[null,null,""]
[null,null,""]
[null,null,""]
[null,null,""]
[null,null,""]
[null,null,""]
[null,null,""]
[null,null,""]
[null,null,""]
[null,null,""]
[null,null,""]
[null,null,""]
[null,null,""]
[null,null,""]
[null,null,""]
[null,null,""]
[null,null,""]
[null,null,""]
[null,null,""]
[null,null,""]
[null,null,""]
[null,null,""]
[null,null,""]
[null,null,""]
[null,null,""]
[null,null,""]
[null,null,""]
[null,null,""]
[null,null,""]
[null,null,""]
[null,null,{"$f":"IF(ISBLANK(B47), \"\", IFERROR(VLOOKUP(B47, plan_cuentas, 2, FALSE), \"Código de cuenta incorrecto\"))","v":""}]
[null,null,""]
[null,null,""]
[null,null,""]
[null,null,""]
[null,null,""]
[null,null,""]
[null,null,""]
[null,null,""]
[null,null,""]
[null,null,""]
[null,null,""]
[null,null,""]
[null,null,""]
[null,null,""]
[null,null,""]
[null,null,""]
[null,null,""]
[null,null,""]
[null,null,""]
[null,null,""]
[null,null,""]
[null,null,""]
[null,null,""]
[null,null,""]
[null,null,""]
[null,null,""]
[null,null,""]
[null,null,""]
[null,null,""]
[null,null,""]
[null,null,""]
[null,null,{"$f":"IF(ISBLANK(B79), \"\", IFERROR(VLOOKUP(B79, plan_cuentas, 2, FALSE), \"Código de cuenta incorrecto\"))","v":""}]
[null,null,""]
[null,null,""]
[null,null,""]
[null,null,""]
[null,null,""]
[null,null,""]
[null,null,""]
[null,null,""]
[null,null,""]
[null,null,""]
[null,null,""]
[null,null,""]
[null,null,""]
[null,null,""]
[null,null,""]
[null,null,""]
[null,null,""]
[null,null,""]
[null,null,""]
[null,null,""]
[null,null,""]
[null,null,""]
[null,null,""]
[null,null,""]
[null,null,""]
[null,null,""]
[null,null,""]
[null,null,""]
[null,null,""]
[null,null,""]
[null,null,""]
[null,null,{"$f":"IF(ISBLANK(B111), \"\", IFERROR(VLOOKUP(B111, plan_cuentas, 2, FALSE), \"Código de cuenta incorrecto\"))","v":""}]
[null,null,""]
[null,null,""]
[null,null,""]
[null,null,""]
[null,null,""]
[null,null,""]
[null,null,""]
[null,null,""]
[null,null,""]
[null,null,""]
[null,null,""]
[null,null,""]
[null,null,""]
[null,null,""]
[null,null,""]
[null,null,""]
[null,null,""]
[null,null,""]
[null,null,""]
[null,null,""]
[null,null,""]
[null,null,""]
[null,null,""]
[null,null,""]
[null,null,""]
[null,null,""]
[null,null,""]
[null,null,""]
[null,null,""]
[null,null,""]
[null,null,""]
[null,null,{"$f":"IF(ISBLANK(B143), \"\", IFERROR(VLOOKUP(B143, plan_cuentas, 2, FALSE), \"Código de cuenta incorrecto\"))","v":""}]
[null,null,""]
[null,null,""]
[null,null,""]
[null,null,""]
[null,null,""]
[null,null,""]
[null,null,""]

{"sheet":"Registros","index":5,"n_rows":16,"n_cols":8,"rows_kept":16,"cut":false,"hidden":false,"merged":[]}
["FECHA","CÓDIGO DE CUENTA","NOMBRE DE LA CUENTA","DESCRIPCIÓN","DÉBITOS","CRÉDITOS",1101,{"$f":"IF(ISBLANK(G1), 0, COUNTIFS(A:A, \">=\" & fecha_inicial,A:A, \"<=\" & fecha_final,B:B, \"=\" &G1))","v":0}]
["Asiento N° 1"]
["2012-08-31",1101,{"$f":"IF(ISBLANK(B3), \"\", IFERROR(VLOOKUP(B3, plan_cuentas, 2, FALSE), \"Código de cuenta incorrecto\"))","v":"CAJA"},"Apertura de la cuenta",10000]
["2012-08-31",1102,"FONDO FIJO DE CAJA CHICA","Apertura de la cuenta",1000]
["2012-08-31",1201,"TERRENOS","Apertura de la cuenta",20000]
["2012-08-31",1206,"EQUIPO DE TRANSPORTE","Apertura de la cuenta",30000]
["2012-08-31",3101,"CAPITAL INICIAL","Apertura de la cuenta",null,61000]
["Asiento N° 2"]
["2012-09-03",1112,{"$f":"IF(ISBLANK(B9), \"\", IFERROR(VLOOKUP(B9, plan_cuentas, 2, FALSE), \"Código de cuenta incorrecto\"))","v":"RENTAS PAGADAS POR ANTICIPADO"},"Apertura de la cuenta",500]
["2012-09-03",1101,"CAJA","Renta de local a cuenta de 09/12",null,500]
["Asiento N° 3"]
["2012-09-04",1101,{"$f":"IF(ISBLANK(B12), \"\", IFERROR(VLOOKUP(B12, plan_cuentas, 2, FALSE), \"Código de cuenta incorrecto\"))","v":"CAJA"},"Venta de productos",10000]
["2012-09-04",4101,"VENTA DE MERCANCÍAS AL CONTADO","Venta de productos",null,10000]
["Asiento N° 4"]
["2012-09-05",1103,{"$f":"IF(ISBLANK(B15), \"\", IFERROR(VLOOKUP(B15, plan_cuentas, 2, FALSE), \"Código de cuenta incorrecto\"))","v":"BANCOS"},"Depósito de caja",9500]
["2012-09-05",1101,"CAJA","Depósito a banco",null,9500]

{"sheet":"Reportes","index":6,"n_rows":15,"n_cols":5,"rows_kept":15,"cut":false,"hidden":false,"merged":[[6,0,7,5],[9,2,9,3],[9,4,9,6]]}
[]
[]
[]
[]
[]
[]
["Visualice o imprima los reportes que le genera el programa"]
[]
[]
[null,null,"Elija un tipo de reporte para visualizar",null,"Indique las fechas de los reportes"]
[]
[null,null,"01","Balanza de comprobación de saldos"]
[null,null,"02","Estado de Resultados","Fecha Inicial:"]
[null,null,"03","Balance General"]
[null,null,null,null,"Fecha Final:"]

{"sheet":"Inventario","index":7,"n_rows":39,"n_cols":4,"rows_kept":39,"cut":false,"hidden":false,"merged":[[4,2,4,4]]}
[]
[]
[]
[]
[null,null,"Control de Inventario - Kardex"]
[]
[null,null,"FECHA","2012-09-29"]
[]
[null,null,"CONCEPTO"]
[]
[null,null,"CANTIDAD"]
[]
[null,null,"C.U. S/FLETES"]
[]
[null,null,"C.U. C/FLETES"]
[]
[null,null,"COSTO TOTAL",{"$f":"D11*D15","v":0}]
[]
[]
[]
[]
[]
[]
[]
[]
[]
[]
[]
[]
[]
[]
[]
[]
[]
[]
["Compra de mercancías"]
["Venta de mercancías"]
["Devolución de clientes"]
["Devolución a proveedores"]

{"sheet":"D","index":8,"n_rows":87,"n_cols":6,"rows_kept":87,"cut":false,"hidden":false,"merged":[[1,0,1,5],[2,0,2,5],[3,0,3,5],[4,0,4,5],[6,3,6,5],[7,5,8,5],[74,0,74,1],[78,0,78,1],[78,4,78,5],[79,0,79,1],[79,4,79,5],[7,0,8,0],[7,1,8,1],[7,2,8,2],[7,3,8,3],[7,4,8,4],[86,2,86,3],[80,0,80,1],[80,4,80,5],[81,0,81,1],[81,4,81,5],[84,2,84,3],[85,2,85,3]]}
[null,null,null,null,"Proteger"]
[{"$f":"nombre_empresa","v":"CONSULTORES DE OMETEPE"}]
[{"$f":"\"RESUMEN CONTABLE DE \"&B7","v":"RESUMEN CONTABLE DE "}]
[{"$f":"\"DEL \"&TEXT(fecha_inicial, \"DD\")&\" DE \"&UPPER(TEXT(fecha_inicial, \"MMMM\"))&\" AL \"&TEXT(fecha_final, \"DD\")&\" DE \"&UPPER(TEXT(fecha_final, \"MMMM\"))&\" DE \"&TEXT(fecha_final, \"YYYY\")","v":"DEL 00 DE ENERO AL 00 DE ENERO DE 1900"}]
[{"$f":"direccion & \" *** Tel/Fax:  \" & tel_fax & \" *** \" & email","v":"Barrio el Progreso, San Jorge, Rivas. *** Tel/Fax:  89040457 *** escribeme@radioometepe.com"}]
[]
[null,{"$f":"UPPER(IF(ISBLANK(A7),\"\",IFERROR(VLOOKUP(A7,plan_cuentas,2,FALSE),\"Código de cuenta incorrecto\")))","v":""},null,{"$f":"\"MOVIMIENTOS DE \"&UPPER(TEXT(fecha_final, \"MMMM\"))","v":"MOVIMIENTOS DE ENERO"}]
["CODIGO","NOMBRE DE LA CUENTA","SALDO INICIAL","DEBITOS","CREDITOS","SALDO FINAL"]
[]
[]
[null,{"$f":"IF(A11<>\"\", IF(ISERROR(VLOOKUP(A11, plan_cuentas,2, FALSE)), \"Código de Cuenta Incorrecto\", UPPER(VLOOKUP(A11, plan_cuentas, 2, FALSE))), \"\")","v":""},{"$f":"SUM(C12:C26)","v":0},{"$f":"SUM(D12:D26)","v":0},0,{"$f":"C11+D11-E11","v":0}]
[null,{"$f":"IF(A12<>\"\", IF(ISERROR(VLOOKUP(A12, plan_cuentas,2, FALSE)), \"Código de Cuenta Incorrecto\", UPPER(VLOOKUP(A12, plan_cuentas, 2, FALSE))), \"\")","v":""},{"$f":"IF(ISBLANK(A12),0, SUMIFS(Registros!E:E,Registros!A:A,\"<\"&fecha_inicial,Registros!B:B,\"=\"&D!A12)) - IF(ISBLANK(A12),0, SUMIFS(Registros!F:F,Registros!A:A,\"<\"&fecha_inicial,Registros!B:B,\"=\"&D!A12))","v":0},{"$f":"IF(ISBLANK(A12), 0, SUMIFS(Registros!E:E, Registros!A:A, \">=\" & fecha_inicial, Registros!A:A, \"<=\" & fecha_final,  Registros!B:B, \"=\" & D!A12))","v":0},{"$f":"IF(ISBLANK(A12), 0, SUMIFS(Registros!F:F, Registros!A:A, \">=\" & fecha_inicial, Registros!A:A, \"<=\" & fecha_final,  Registros!B:B, \"=\" & D!A12))","v":0},{"$f":"C12+D12-E12","v":0}]
[null,{"$f":"IF(A13<>0, IF(ISERROR(VLOOKUP(A13, plan_cuentas,2, FALSE)), \"Código de Cuenta Incorrecto\", UPPER(VLOOKUP(A13, plan_cuentas, 2, FALSE))), \"\")","v":""},{"$f":"IF(ISBLANK(A13),0, SUMIFS(Registros!E:E,Registros!A:A,\"<\"&fecha_inicial,Registros!B:B,\"=\"&D!A13)) - IF(ISBLANK(A13),0, SUMIFS(Registros!F:F,Registros!A:A,\"<\"&fecha_inicial,Registros!B:B,\"=\"&D!A13))","v":0},{"$f":"IF(ISBLANK(A13), 0, SUMIFS(Registros!E:E, Registros!A:A, \">=\" & fecha_inicial, Registros!A:A, \"<=\" & fecha_final,  Registros!B:B, \"=\" & D!A13))","v":0},{"$f":"IF(ISBLANK(A13), 0, SUMIFS(Registros!F:F, Registros!A:A, \">=\" & fecha_inicial, Registros!A:A, \"<=\" & fecha_final,  Registros!B:B, \"=\" & D!A13))","v":0},0]
[null,"",{"$f":"IF(ISBLANK(A14),0, SUMIFS(Registros!E:E,Registros!A:A,\"<\"&fecha_inicial,Registros!B:B,\"=\"&D!A14)) - IF(ISBLANK(A14),0, SUMIFS(Registros!F:F,Registros!A:A,\"<\"&fecha_inicial,Registros!B:B,\"=\"&D!A14))","v":0},{"$f":"IF(ISBLANK(A14), 0, SUMIFS(Registros!E:E, Registros!A:A, \">=\" & fecha_inicial, Registros!A:A, \"<=\" & fecha_final,  Registros!B:B, \"=\" & D!A14))","v":0},{"$f":"IF(ISBLANK(A14), 0, SUMIFS(Registros!F:F, Registros!A:A, \">=\" & fecha_inicial, Registros!A:A, \"<=\" & fecha_final,  Registros!B:B, \"=\" & D!A14))","v":0},0]
[null,"",{"$f":"IF(ISBLANK(A15),0, SUMIFS(Registros!E:E,Registros!A:A,\"<\"&fecha_inicial,Registros!B:B,\"=\"&D!A15)) - IF(ISBLANK(A15),0, SUMIFS(Registros!F:F,Registros!A:A,\"<\"&fecha_inicial,Registros!B:B,\"=\"&D!A15))","v":0},{"$f":"IF(ISBLANK(A15), 0, SUMIFS(Registros!E:E, Registros!A:A, \">=\" & fecha_inicial, Registros!A:A, \"<=\" & fecha_final,  Registros!B:B, \"=\" & D!A15))","v":0},{"$f":"IF(ISBLANK(A15), 0, SUMIFS(Registros!F:F, Registros!A:A, \">=\" & fecha_inicial, Registros!A:A, \"<=\" & fecha_final,  Registros!B:B, \"=\" & D!A15))","v":0},0]
[null,"",{"$f":"IF(ISBLANK(A16),0, SUMIFS(Registros!E:E,Registros!A:A,\"<\"&fecha_inicial,Registros!B:B,\"=\"&D!A16)) - IF(ISBLANK(A16),0, SUMIFS(Registros!F:F,Registros!A:A,\"<\"&fecha_inicial,Registros!B:B,\"=\"&D!A16))","v":0},{"$f":"IF(ISBLANK(A16), 0, SUMIFS(Registros!E:E, Registros!A:A, \">=\" & fecha_inicial, Registros!A:A, \"<=\" & fecha_final,  Registros!B:B, \"=\" & D!A16))","v":0},{"$f":"IF(ISBLANK(A16), 0, SUMIFS(Registros!F:F, Registros!A:A, \">=\" & fecha_inicial, Registros!A:A, \"<=\" & fecha_final,  Registros!B:B, \"=\" & D!A16))","v":0},0]
[null,"",{"$f":"IF(ISBLANK(A17),0, SUMIFS(Registros!E:E,Registros!A:A,\"<\"&fecha_inicial,Registros!B:B,\"=\"&D!A17)) - IF(ISBLANK(A17),0, SUMIFS(Registros!F:F,Registros!A:A,\"<\"&fecha_inicial,Registros!B:B,\"=\"&D!A17))","v":0},{"$f":"IF(ISBLANK(A17), 0, SUMIFS(Registros!E:E, Registros!A:A, \">=\" & fecha_inicial, Registros!A:A, \"<=\" & fecha_final,  Registros!B:B, \"=\" & D!A17))","v":0},{"$f":"IF(ISBLANK(A17), 0, SUMIFS(Registros!F:F, Registros!A:A, \">=\" & fecha_inicial, Registros!A:A, \"<=\" & fecha_final,  Registros!B:B, \"=\" & D!A17))","v":0},0]
[null,"",{"$f":"IF(ISBLANK(A18),0, SUMIFS(Registros!E:E,Registros!A:A,\"<\"&fecha_inicial,Registros!B:B,\"=\"&D!A18)) - IF(ISBLANK(A18),0, SUMIFS(Registros!F:F,Registros!A:A,\"<\"&fecha_inicial,Registros!B:B,\"=\"&D!A18))","v":0},{"$f":"IF(ISBLANK(A18), 0, SUMIFS(Registros!E:E, Registros!A:A, \">=\" & fecha_inicial, Registros!A:A, \"<=\" & fecha_final,  Registros!B:B, \"=\" & D!A18))","v":0},{"$f":"IF(ISBLANK(A18), 0, SUMIFS(Registros!F:F, Registros!A:A, \">=\" & fecha_inicial, Registros!A:A, \"<=\" & fecha_final,  Registros!B:B, \"=\" & D!A18))","v":0},0]
[null,"",{"$f":"IF(ISBLANK(A19),0, SUMIFS(Registros!E:E,Registros!A:A,\"<\"&fecha_inicial,Registros!B:B,\"=\"&D!A19)) - IF(ISBLANK(A19),0, SUMIFS(Registros!F:F,Registros!A:A,\"<\"&fecha_inicial,Registros!B:B,\"=\"&D!A19))","v":0},{"$f":"IF(ISBLANK(A19), 0, SUMIFS(Registros!E:E, Registros!A:A, \">=\" & fecha_inicial, Registros!A:A, \"<=\" & fecha_final,  Registros!B:B, \"=\" & D!A19))","v":0},{"$f":"IF(ISBLANK(A19), 0, SUMIFS(Registros!F:F, Registros!A:A, \">=\" & fecha_inicial, Registros!A:A, \"<=\" & fecha_final,  Registros!B:B, \"=\" & D!A19))","v":0},0]
[null,"",{"$f":"IF(ISBLANK(A20),0, SUMIFS(Registros!E:E,Registros!A:A,\"<\"&fecha_inicial,Registros!B:B,\"=\"&D!A20)) - IF(ISBLANK(A20),0, SUMIFS(Registros!F:F,Registros!A:A,\"<\"&fecha_inicial,Registros!B:B,\"=\"&D!A20))","v":0},{"$f":"IF(ISBLANK(A20), 0, SUMIFS(Registros!E:E, Registros!A:A, \">=\" & fecha_inicial, Registros!A:A, \"<=\" & fecha_final,  Registros!B:B, \"=\" & D!A20))","v":0},{"$f":"IF(ISBLANK(A20), 0, SUMIFS(Registros!F:F, Registros!A:A, \">=\" & fecha_inicial, Registros!A:A, \"<=\" & fecha_final,  Registros!B:B, \"=\" & D!A20))","v":0},0]
[null,"",{"$f":"IF(ISBLANK(A21),0, SUMIFS(Registros!E:E,Registros!A:A,\"<\"&fecha_inicial,Registros!B:B,\"=\"&D!A21)) - IF(ISBLANK(A21),0, SUMIFS(Registros!F:F,Registros!A:A,\"<\"&fecha_inicial,Registros!B:B,\"=\"&D!A21))","v":0},{"$f":"IF(ISBLANK(A21), 0, SUMIFS(Registros!E:E, Registros!A:A, \">=\" & fecha_inicial, Registros!A:A, \"<=\" & fecha_final,  Registros!B:B, \"=\" & D!A21))","v":0},{"$f":"IF(ISBLANK(A21), 0, SUMIFS(Registros!F:F, Registros!A:A, \">=\" & fecha_inicial, Registros!A:A, \"<=\" & fecha_final,  Registros!B:B, \"=\" & D!A21))","v":0},0]
[null,"",{"$f":"IF(ISBLANK(A22),0, SUMIFS(Registros!E:E,Registros!A:A,\"<\"&fecha_inicial,Registros!B:B,\"=\"&D!A22)) - IF(ISBLANK(A22),0, SUMIFS(Registros!F:F,Registros!A:A,\"<\"&fecha_inicial,Registros!B:B,\"=\"&D!A22))","v":0},{"$f":"IF(ISBLANK(A22), 0, SUMIFS(Registros!E:E, Registros!A:A, \">=\" & fecha_inicial, Registros!A:A, \"<=\" & fecha_final,  Registros!B:B, \"=\" & D!A22))","v":0},{"$f":"IF(ISBLANK(A22), 0, SUMIFS(Registros!F:F, Registros!A:A, \">=\" & fecha_inicial, Registros!A:A, \"<=\" & fecha_final,  Registros!B:B, \"=\" & D!A22))","v":0},0]
[null,"",{"$f":"IF(ISBLANK(A23),0, SUMIFS(Registros!E:E,Registros!A:A,\"<\"&fecha_inicial,Registros!B:B,\"=\"&D!A23)) - IF(ISBLANK(A23),0, SUMIFS(Registros!F:F,Registros!A:A,\"<\"&fecha_inicial,Registros!B:B,\"=\"&D!A23))","v":0},{"$f":"IF(ISBLANK(A23), 0, SUMIFS(Registros!E:E, Registros!A:A, \">=\" & fecha_inicial, Registros!A:A, \"<=\" & fecha_final,  Registros!B:B, \"=\" & D!A23))","v":0},{"$f":"IF(ISBLANK(A23), 0, SUMIFS(Registros!F:F, Registros!A:A, \">=\" & fecha_inicial, Registros!A:A, \"<=\" & fecha_final,  Registros!B:B, \"=\" & D!A23))","v":0},0]
[null,"",{"$f":"IF(ISBLANK(A24),0, SUMIFS(Registros!E:E,Registros!A:A,\"<\"&fecha_inicial,Registros!B:B,\"=\"&D!A24)) - IF(ISBLANK(A24),0, SUMIFS(Registros!F:F,Registros!A:A,\"<\"&fecha_inicial,Registros!B:B,\"=\"&D!A24))","v":0},{"$f":"IF(ISBLANK(A24), 0, SUMIFS(Registros!E:E, Registros!A:A, \">=\" & fecha_inicial, Registros!A:A, \"<=\" & fecha_final,  Registros!B:B, \"=\" & D!A24))","v":0},{"$f":"IF(ISBLANK(A24), 0, SUMIFS(Registros!F:F, Registros!A:A, \">=\" & fecha_inicial, Registros!A:A, \"<=\" & fecha_final,  Registros!B:B, \"=\" & D!A24))","v":0},0]
[null,"",{"$f":"IF(ISBLANK(A25),0, SUMIFS(Registros!E:E,Registros!A:A,\"<\"&fecha_inicial,Registros!B:B,\"=\"&D!A25)) - IF(ISBLANK(A25),0, SUMIFS(Registros!F:F,Registros!A:A,\"<\"&fecha_inicial,Registros!B:B,\"=\"&D!A25))","v":0},{"$f":"IF(ISBLANK(A25), 0, SUMIFS(Registros!E:E, Registros!A:A, \">=\" & fecha_inicial, Registros!A:A, \"<=\" & fecha_final,  Registros!B:B, \"=\" & D!A25))","v":0},{"$f":"IF(ISBLANK(A25), 0, SUMIFS(Registros!F:F, Registros!A:A, \">=\" & fecha_inicial, Registros!A:A, \"<=\" & fecha_final,  Registros!B:B, \"=\" & D!A25))","v":0},0]
[null,"",{"$f":"IF(ISBLANK(A26),0, SUMIFS(Registros!E:E,Registros!A:A,\"<\"&fecha_inicial,Registros!B:B,\"=\"&D!A26)) - IF(ISBLANK(A26),0, SUMIFS(Registros!F:F,Registros!A:A,\"<\"&fecha_inicial,Registros!B:B,\"=\"&D!A26))","v":0},{"$f":"IF(ISBLANK(A26), 0, SUMIFS(Registros!E:E, Registros!A:A, \">=\" & fecha_inicial, Registros!A:A, \"<=\" & fecha_final,  Registros!B:B, \"=\" & D!A26))","v":0},{"$f":"IF(ISBLANK(A26), 0, SUMIFS(Registros!F:F, Registros!A:A, \">=\" & fecha_inicial, Registros!A:A, \"<=\" & fecha_final,  Registros!B:B, \"=\" & D!A26))","v":0},0]
[null,"",{"$f":"SUM(C28:C42)","v":0},{"$f":"SUM(D28:D42)","v":0},{"$f":"SUM(E28:E42)","v":0},0]
[null,"",{"$f":"IF(ISBLANK(A28),0, SUMIFS(Registros!E:E,Registros!A:A,\"<\"&fecha_inicial,Registros!B:B,\"=\"&D!A28)) - IF(ISBLANK(A28),0, SUMIFS(Registros!F:F,Registros!A:A,\"<\"&fecha_inicial,Registros!B:B,\"=\"&D!A28))","v":0},{"$f":"IF(ISBLANK(A28), 0, SUMIFS(Registros!E:E, Registros!A:A, \">=\" & fecha_inicial, Registros!A:A, \"<=\" & fecha_final,  Registros!B:B, \"=\" & D!A28))","v":0},{"$f":"IF(ISBLANK(A28), 0, SUMIFS(Registros!F:F, Registros!A:A, \">=\" & fecha_inicial, Registros!A:A, \"<=\" & fecha_final,  Registros!B:B, \"=\" & D!A28))","v":0},0]
[null,"",{"$f":"IF(ISBLANK(A29),0, SUMIFS(Registros!E:E,Registros!A:A,\"<\"&fecha_inicial,Registros!B:B,\"=\"&D!A29)) - IF(ISBLANK(A29),0, SUMIFS(Registros!F:F,Registros!A:A,\"<\"&fecha_inicial,Registros!B:B,\"=\"&D!A29))","v":0},{"$f":"IF(ISBLANK(A29), 0, SUMIFS(Registros!E:E, Registros!A:A, \">=\" & fecha_inicial, Registros!A:A, \"<=\" & fecha_final,  Registros!B:B, \"=\" & D!A29))","v":0},{"$f":"IF(ISBLANK(A29), 0, SUMIFS(Registros!F:F, Registros!A:A, \">=\" & fecha_inicial, Registros!A:A, \"<=\" & fecha_final,  Registros!B:B, \"=\" & D!A29))","v":0},0]
[null,"",{"$f":"IF(ISBLANK(A30),0, SUMIFS(Registros!E:E,Registros!A:A,\"<\"&fecha_inicial,Registros!B:B,\"=\"&D!A30)) - IF(ISBLANK(A30),0, SUMIFS(Registros!F:F,Registros!A:A,\"<\"&fecha_inicial,Registros!B:B,\"=\"&D!A30))","v":0},{"$f":"IF(ISBLANK(A30), 0, SUMIFS(Registros!E:E, Registros!A:A, \">=\" & fecha_inicial, Registros!A:A, \"<=\" & fecha_final,  Registros!B:B, \"=\" & D!A30))","v":0},{"$f":"IF(ISBLANK(A30), 0, SUMIFS(Registros!F:F, Registros!A:A, \">=\" & fecha_inicial, Registros!A:A, \"<=\" & fecha_final,  Registros!B:B, \"=\" & D!A30))","v":0},0]
[null,"",{"$f":"IF(ISBLANK(A31),0, SUMIFS(Registros!E:E,Registros!A:A,\"<\"&fecha_inicial,Registros!B:B,\"=\"&D!A31)) - IF(ISBLANK(A31),0, SUMIFS(Registros!F:F,Registros!A:A,\"<\"&fecha_inicial,Registros!B:B,\"=\"&D!A31))","v":0},{"$f":"IF(ISBLANK(A31), 0, SUMIFS(Registros!E:E, Registros!A:A, \">=\" & fecha_inicial, Registros!A:A, \"<=\" & fecha_final,  Registros!B:B, \"=\" & D!A31))","v":0},{"$f":"IF(ISBLANK(A31), 0, SUMIFS(Registros!F:F, Registros!A:A, \">=\" & fecha_inicial, Registros!A:A, \"<=\" & fecha_final,  Registros!B:B, \"=\" & D!A31))","v":0},0]
[null,"",{"$f":"IF(ISBLANK(A32),0, SUMIFS(Registros!E:E,Registros!A:A,\"<\"&fecha_inicial,Registros!B:B,\"=\"&D!A32)) - IF(ISBLANK(A32),0, SUMIFS(Registros!F:F,Registros!A:A,\"<\"&fecha_inicial,Registros!B:B,\"=\"&D!A32))","v":0},{"$f":"IF(ISBLANK(A32), 0, SUMIFS(Registros!E:E, Registros!A:A, \">=\" & fecha_inicial, Registros!A:A, \"<=\" & fecha_final,  Registros!B:B, \"=\" & D!A32))","v":0},{"$f":"IF(ISBLANK(A32), 0, SUMIFS(Registros!F:F, Registros!A:A, \">=\" & fecha_inicial, Registros!A:A, \"<=\" & fecha_final,  Registros!B:B, \"=\" & D!A32))","v":0},0]
[null,"",{"$f":"IF(ISBLANK(A33),0, SUMIFS(Registros!E:E,Registros!A:A,\"<\"&fecha_inicial,Registros!B:B,\"=\"&D!A33)) - IF(ISBLANK(A33),0, SUMIFS(Registros!F:F,Registros!A:A,\"<\"&fecha_inicial,Registros!B:B,\"=\"&D!A33))","v":0},{"$f":"IF(ISBLANK(A33), 0, SUMIFS(Registros!E:E, Registros!A:A, \">=\" & fecha_inicial, Registros!A:A, \"<=\" & fecha_final,  Registros!B:B, \"=\" & D!A33))","v":0},{"$f":"IF(ISBLANK(A33), 0, SUMIFS(Registros!F:F, Registros!A:A, \">=\" & fecha_inicial, Registros!A:A, \"<=\" & fecha_final,  Registros!B:B, \"=\" & D!A33))","v":0},0]
[null,"",{"$f":"IF(ISBLANK(A34),0, SUMIFS(Registros!E:E,Registros!A:A,\"<\"&fecha_inicial,Registros!B:B,\"=\"&D!A34)) - IF(ISBLANK(A34),0, SUMIFS(Registros!F:F,Registros!A:A,\"<\"&fecha_inicial,Registros!B:B,\"=\"&D!A34))","v":0},{"$f":"IF(ISBLANK(A34), 0, SUMIFS(Registros!E:E, Registros!A:A, \">=\" & fecha_inicial, Registros!A:A, \"<=\" & fecha_final,  Registros!B:B, \"=\" & D!A34))","v":0},{"$f":"IF(ISBLANK(A34), 0, SUMIFS(Registros!F:F, Registros!A:A, \">=\" & fecha_inicial, Registros!A:A, \"<=\" & fecha_final,  Registros!B:B, \"=\" & D!A34))","v":0},0]
[null,"",{"$f":"IF(ISBLANK(A35),0, SUMIFS(Registros!E:E,Registros!A:A,\"<\"&fecha_inicial,Registros!B:B,\"=\"&D!A35)) - IF(ISBLANK(A35),0, SUMIFS(Registros!F:F,Registros!A:A,\"<\"&fecha_inicial,Registros!B:B,\"=\"&D!A35))","v":0},{"$f":"IF(ISBLANK(A35), 0, SUMIFS(Registros!E:E, Registros!A:A, \">=\" & fecha_inicial, Registros!A:A, \"<=\" & fecha_final,  Registros!B:B, \"=\" & D!A35))","v":0},{"$f":"IF(ISBLANK(A35), 0, SUMIFS(Registros!F:F, Registros!A:A, \">=\" & fecha_inicial, Registros!A:A, \"<=\" & fecha_final,  Registros!B:B, \"=\" & D!A35))","v":0},0]
[null,"",{"$f":"IF(ISBLANK(A36),0, SUMIFS(Registros!E:E,Registros!A:A,\"<\"&fecha_inicial,Registros!B:B,\"=\"&D!A36)) - IF(ISBLANK(A36),0, SUMIFS(Registros!F:F,Registros!A:A,\"<\"&fecha_inicial,Registros!B:B,\"=\"&D!A36))","v":0},{"$f":"IF(ISBLANK(A36), 0, SUMIFS(Registros!E:E, Registros!A:A, \">=\" & fecha_inicial, Registros!A:A, \"<=\" & fecha_final,  Registros!B:B, \"=\" & D!A36))","v":0},{"$f":"IF(ISBLANK(A36), 0, SUMIFS(Registros!F:F, Registros!A:A, \">=\" & fecha_inicial, Registros!A:A, \"<=\" & fecha_final,  Registros!B:B, \"=\" & D!A36))","v":0},0]
[null,"",{"$f":"IF(ISBLANK(A37),0, SUMIFS(Registros!E:E,Registros!A:A,\"<\"&fecha_inicial,Registros!B:B,\"=\"&D!A37)) - IF(ISBLANK(A37),0, SUMIFS(Registros!F:F,Registros!A:A,\"<\"&fecha_inicial,Registros!B:B,\"=\"&D!A37))","v":0},{"$f":"IF(ISBLANK(A37), 0, SUMIFS(Registros!E:E, Registros!A:A, \">=\" & fecha_inicial, Registros!A:A, \"<=\" & fecha_final,  Registros!B:B, \"=\" & D!A37))","v":0},{"$f":"IF(ISBLANK(A37), 0, SUMIFS(Registros!F:F, Registros!A:A, \">=\" & fecha_inicial, Registros!A:A, \"<=\" & fecha_final,  Registros!B:B, \"=\" & D!A37))","v":0},0]
[null,"",{"$f":"IF(ISBLANK(A38),0, SUMIFS(Registros!E:E,Registros!A:A,\"<\"&fecha_inicial,Registros!B:B,\"=\"&D!A38)) - IF(ISBLANK(A38),0, SUMIFS(Registros!F:F,Registros!A:A,\"<\"&fecha_inicial,Registros!B:B,\"=\"&D!A38))","v":0},{"$f":"IF(ISBLANK(A38), 0, SUMIFS(Registros!E:E, Registros!A:A, \">=\" & fecha_inicial, Registros!A:A, \"<=\" & fecha_final,  Registros!B:B, \"=\" & D!A38))","v":0},{"$f":"IF(ISBLANK(A38), 0, SUMIFS(Registros!F:F, Registros!A:A, \">=\" & fecha_inicial, Registros!A:A, \"<=\" & fecha_final,  Registros!B:B, \"=\" & D!A38))","v":0},0]
[null,"",{"$f":"IF(ISBLANK(A39),0, SUMIFS(Registros!E:E,Registros!A:A,\"<\"&fecha_inicial,Registros!B:B,\"=\"&D!A39)) - IF(ISBLANK(A39),0, SUMIFS(Registros!F:F,Registros!A:A,\"<\"&fecha_inicial,Registros!B:B,\"=\"&D!A39))","v":0},{"$f":"IF(ISBLANK(A39), 0, SUMIFS(Registros!E:E, Registros!A:A, \">=\" & fecha_inicial, Registros!A:A, \"<=\" & fecha_final,  Registros!B:B, \"=\" & D!A39))","v":0},{"$f":"IF(ISBLANK(A39), 0, SUMIFS(Registros!F:F, Registros!A:A, \">=\" & fecha_inicial, Registros!A:A, \"<=\" & fecha_final,  Registros!B:B, \"=\" & D!A39))","v":0},0]
[null,"",{"$f":"IF(ISBLANK(A40),0, SUMIFS(Registros!E:E,Registros!A:A,\"<\"&fecha_inicial,Registros!B:B,\"=\"&D!A40)) - IF(ISBLANK(A40),0, SUMIFS(Registros!F:F,Registros!A:A,\"<\"&fecha_inicial,Registros!B:B,\"=\"&D!A40))","v":0},{"$f":"IF(ISBLANK(A40), 0, SUMIFS(Registros!E:E, Registros!A:A, \">=\" & fecha_inicial, Registros!A:A, \"<=\" & fecha_final,  Registros!B:B, \"=\" & D!A40))","v":0},{"$f":"IF(ISBLANK(A40), 0, SUMIFS(Registros!F:F, Registros!A:A, \">=\" & fecha_inicial, Registros!A:A, \"<=\" & fecha_final,  Registros!B:B, \"=\" & D!A40))","v":0},0]
[null,"",{"$f":"IF(ISBLANK(A41),0, SUMIFS(Registros!E:E,Registros!A:A,\"<\"&fecha_inicial,Registros!B:B,\"=\"&D!A41)) - IF(ISBLANK(A41),0, SUMIFS(Registros!F:F,Registros!A:A,\"<\"&fecha_inicial,Registros!B:B,\"=\"&D!A41))","v":0},{"$f":"IF(ISBLANK(A41), 0, SUMIFS(Registros!E:E, Registros!A:A, \">=\" & fecha_inicial, Registros!A:A, \"<=\" & fecha_final,  Registros!B:B, \"=\" & D!A41))","v":0},{"$f":"IF(ISBLANK(A41), 0, SUMIFS(Registros!F:F, Registros!A:A, \">=\" & fecha_inicial, Registros!A:A, \"<=\" & fecha_final,  Registros!B:B, \"=\" & D!A41))","v":0},0]
[null,"",{"$f":"IF(ISBLANK(A42),0, SUMIFS(Registros!E:E,Registros!A:A,\"<\"&fecha_inicial,Registros!B:B,\"=\"&D!A42)) - IF(ISBLANK(A42),0, SUMIFS(Registros!F:F,Registros!A:A,\"<\"&fecha_inicial,Registros!B:B,\"=\"&D!A42))","v":0},{"$f":"IF(ISBLANK(A42), 0, SUMIFS(Registros!E:E, Registros!A:A, \">=\" & fecha_inicial, Registros!A:A, \"<=\" & fecha_final,  Registros!B:B, \"=\" & D!A42))","v":0},{"$f":"IF(ISBLANK(A42), 0, SUMIFS(Registros!F:F, Registros!A:A, \">=\" & fecha_inicial, Registros!A:A, \"<=\" & fecha_final,  Registros!B:B, \"=\" & D!A42))","v":0},0]
[null,{"$f":"IF(A43<>0, IF(ISERROR(VLOOKUP(A43, plan_cuentas,2, FALSE)), \"Código de Cuenta Incorrecto\", UPPER(VLOOKUP(A43, plan_cuentas, 2, FALSE))), \"\")","v":""},{"$f":"SUM(C44:C58)","v":0},{"$f":"SUM(D44:D58)","v":0},0,0]
[null,"",{"$f":"IF(ISBLANK(A44),0, SUMIFS(Registros!E:E,Registros!A:A,\"<\"&fecha_inicial,Registros!B:B,\"=\"&D!A44)) - IF(ISBLANK(A44),0, SUMIFS(Registros!F:F,Registros!A:A,\"<\"&fecha_inicial,Registros!B:B,\"=\"&D!A44))","v":0},{"$f":"IF(ISBLANK(A44), 0, SUMIFS(Registros!E:E, Registros!A:A, \">=\" & fecha_inicial, Registros!A:A, \"<=\" & fecha_final,  Registros!B:B, \"=\" & D!A44))","v":0},{"$f":"IF(ISBLANK(A44), 0, SUMIFS(Registros!F:F, Registros!A:A, \">=\" & fecha_inicial, Registros!A:A, \"<=\" & fecha_final,  Registros!B:B, \"=\" & D!A44))","v":0},0]
[null,"",{"$f":"IF(ISBLANK(A45),0, SUMIFS(Registros!E:E,Registros!A:A,\"<\"&fecha_inicial,Registros!B:B,\"=\"&D!A45)) - IF(ISBLANK(A45),0, SUMIFS(Registros!F:F,Registros!A:A,\"<\"&fecha_inicial,Registros!B:B,\"=\"&D!A45))","v":0},{"$f":"IF(ISBLANK(A45), 0, SUMIFS(Registros!E:E, Registros!A:A, \">=\" & fecha_inicial, Registros!A:A, \"<=\" & fecha_final,  Registros!B:B, \"=\" & D!A45))","v":0},{"$f":"IF(ISBLANK(A45), 0, SUMIFS(Registros!F:F, Registros!A:A, \">=\" & fecha_inicial, Registros!A:A, \"<=\" & fecha_final,  Registros!B:B, \"=\" & D!A45))","v":0},0]
[null,"",{"$f":"IF(ISBLANK(A46),0, SUMIFS(Registros!E:E,Registros!A:A,\"<\"&fecha_inicial,Registros!B:B,\"=\"&D!A46)) - IF(ISBLANK(A46),0, SUMIFS(Registros!F:F,Registros!A:A,\"<\"&fecha_inicial,Registros!B:B,\"=\"&D!A46))","v":0},{"$f":"IF(ISBLANK(A46), 0, SUMIFS(Registros!E:E, Registros!A:A, \">=\" & fecha_inicial, Registros!A:A, \"<=\" & fecha_final,  Registros!B:B, \"=\" & D!A46))","v":0},{"$f":"IF(ISBLANK(A46), 0, SUMIFS(Registros!F:F, Registros!A:A, \">=\" & fecha_inicial, Registros!A:A, \"<=\" & fecha_final,  Registros!B:B, \"=\" & D!A46))","v":0},0]
[null,"",{"$f":"IF(ISBLANK(A47),0, SUMIFS(Registros!E:E,Registros!A:A,\"<\"&fecha_inicial,Registros!B:B,\"=\"&D!A47)) - IF(ISBLANK(A47),0, SUMIFS(Registros!F:F,Registros!A:A,\"<\"&fecha_inicial,Registros!B:B,\"=\"&D!A47))","v":0},{"$f":"IF(ISBLANK(A47), 0, SUMIFS(Registros!E:E, Registros!A:A, \">=\" & fecha_inicial, Registros!A:A, \"<=\" & fecha_final,  Registros!B:B, \"=\" & D!A47))","v":0},{"$f":"IF(ISBLANK(A47), 0, SUMIFS(Registros!F:F, Registros!A:A, \">=\" & fecha_inicial, Registros!A:A, \"<=\" & fecha_final,  Registros!B:B, \"=\" & D!A47))","v":0},0]
[null,"",{"$f":"IF(ISBLANK(A48),0, SUMIFS(Registros!E:E,Registros!A:A,\"<\"&fecha_inicial,Registros!B:B,\"=\"&D!A48)) - IF(ISBLANK(A48),0, SUMIFS(Registros!F:F,Registros!A:A,\"<\"&fecha_inicial,Registros!B:B,\"=\"&D!A48))","v":0},{"$f":"IF(ISBLANK(A48), 0, SUMIFS(Registros!E:E, Registros!A:A, \">=\" & fecha_inicial, Registros!A:A, \"<=\" & fecha_final,  Registros!B:B, \"=\" & D!A48))","v":0},{"$f":"IF(ISBLANK(A48), 0, SUMIFS(Registros!F:F, Registros!A:A, \">=\" & fecha_inicial, Registros!A:A, \"<=\" & fecha_final,  Registros!B:B, \"=\" & D!A48))","v":0},0]
[null,"",{"$f":"IF(ISBLANK(A49),0, SUMIFS(Registros!E:E,Registros!A:A,\"<\"&fecha_inicial,Registros!B:B,\"=\"&D!A49)) - IF(ISBLANK(A49),0, SUMIFS(Registros!F:F,Registros!A:A,\"<\"&fecha_inicial,Registros!B:B,\"=\"&D!A49))","v":0},{"$f":"IF(ISBLANK(A49), 0, SUMIFS(Registros!E:E, Registros!A:A, \">=\" & fecha_inicial, Registros!A:A, \"<=\" & fecha_final,  Registros!B:B, \"=\" & D!A49))","v":0},{"$f":"IF(ISBLANK(A49), 0, SUMIFS(Registros!F:F, Registros!A:A, \">=\" & fecha_inicial, Registros!A:A, \"<=\" & fecha_final,  Registros!B:B, \"=\" & D!A49))","v":0},0]
[null,"",{"$f":"IF(ISBLANK(A50),0, SUMIFS(Registros!E:E,Registros!A:A,\"<\"&fecha_inicial,Registros!B:B,\"=\"&D!A50)) - IF(ISBLANK(A50),0, SUMIFS(Registros!F:F,Registros!A:A,\"<\"&fecha_inicial,Registros!B:B,\"=\"&D!A50))","v":0},{"$f":"IF(ISBLANK(A50), 0, SUMIFS(Registros!E:E, Registros!A:A, \">=\" & fecha_inicial, Registros!A:A, \"<=\" & fecha_final,  Registros!B:B, \"=\" & D!A50))","v":0},{"$f":"IF(ISBLANK(A50), 0, SUMIFS(Registros!F:F, Registros!A:A, \">=\" & fecha_inicial, Registros!A:A, \"<=\" & fecha_final,  Registros!B:B, \"=\" & D!A50))","v":0},0]
[null,"",{"$f":"IF(ISBLANK(A51),0, SUMIFS(Registros!E:E,Registros!A:A,\"<\"&fecha_inicial,Registros!B:B,\"=\"&D!A51)) - IF(ISBLANK(A51),0, SUMIFS(Registros!F:F,Registros!A:A,\"<\"&fecha_inicial,Registros!B:B,\"=\"&D!A51))","v":0},{"$f":"IF(ISBLANK(A51), 0, SUMIFS(Registros!E:E, Registros!A:A, \">=\" & fecha_inicial, Registros!A:A, \"<=\" & fecha_final,  Registros!B:B, \"=\" & D!A51))","v":0},{"$f":"IF(ISBLANK(A51), 0, SUMIFS(Registros!F:F, Registros!A:A, \">=\" & fecha_inicial, Registros!A:A, \"<=\" & fecha_final,  Registros!B:B, \"=\" & D!A51))","v":0},0]
[null,"",{"$f":"IF(ISBLANK(A52),0, SUMIFS(Registros!E:E,Registros!A:A,\"<\"&fecha_inicial,Registros!B:B,\"=\"&D!A52)) - IF(ISBLANK(A52),0, SUMIFS(Registros!F:F,Registros!A:A,\"<\"&fecha_inicial,Registros!B:B,\"=\"&D!A52))","v":0},{"$f":"IF(ISBLANK(A52), 0, SUMIFS(Registros!E:E, Registros!A:A, \">=\" & fecha_inicial, Registros!A:A, \"<=\" & fecha_final,  Registros!B:B, \"=\" & D!A52))","v":0},{"$f":"IF(ISBLANK(A52), 0, SUMIFS(Registros!F:F, Registros!A:A, \">=\" & fecha_inicial, Registros!A:A, \"<=\" & fecha_final,  Registros!B:B, \"=\" & D!A52))","v":0},0]
[null,"",{"$f":"IF(ISBLANK(A53),0, SUMIFS(Registros!E:E,Registros!A:A,\"<\"&fecha_inicial,Registros!B:B,\"=\"&D!A53)) - IF(ISBLANK(A53),0, SUMIFS(Registros!F:F,Registros!A:A,\"<\"&fecha_inicial,Registros!B:B,\"=\"&D!A53))","v":0},{"$f":"IF(ISBLANK(A53), 0, SUMIFS(Registros!E:E, Registros!A:A, \">=\" & fecha_inicial, Registros!A:A, \"<=\" & fecha_final,  Registros!B:B, \"=\" & D!A53))","v":0},{"$f":"IF(ISBLANK(A53), 0, SUMIFS(Registros!F:F, Registros!A:A, \">=\" & fecha_inicial, Registros!A:A, \"<=\" & fecha_final,  Registros!B:B, \"=\" & D!A53))","v":0},0]
[null,"",{"$f":"IF(ISBLANK(A54),0, SUMIFS(Registros!E:E,Registros!A:A,\"<\"&fecha_inicial,Registros!B:B,\"=\"&D!A54)) - IF(ISBLANK(A54),0, SUMIFS(Registros!F:F,Registros!A:A,\"<\"&fecha_inicial,Registros!B:B,\"=\"&D!A54))","v":0},{"$f":"IF(ISBLANK(A54), 0, SUMIFS(Registros!E:E, Registros!A:A, \">=\" & fecha_inicial, Registros!A:A, \"<=\" & fecha_final,  Registros!B:B, \"=\" & D!A54))","v":0},{"$f":"IF(ISBLANK(A54), 0, SUMIFS(Registros!F:F, Registros!A:A, \">=\" & fecha_inicial, Registros!A:A, \"<=\" & fecha_final,  Registros!B:B, \"=\" & D!A54))","v":0},0]
[null,"",{"$f":"IF(ISBLANK(A55),0, SUMIFS(Registros!E:E,Registros!A:A,\"<\"&fecha_inicial,Registros!B:B,\"=\"&D!A55)) - IF(ISBLANK(A55),0, SUMIFS(Registros!F:F,Registros!A:A,\"<\"&fecha_inicial,Registros!B:B,\"=\"&D!A55))","v":0},{"$f":"IF(ISBLANK(A55), 0, SUMIFS(Registros!E:E, Registros!A:A, \">=\" & fecha_inicial, Registros!A:A, \"<=\" & fecha_final,  Registros!B:B, \"=\" & D!A55))","v":0},{"$f":"IF(ISBLANK(A55), 0, SUMIFS(Registros!F:F, Registros!A:A, \">=\" & fecha_inicial, Registros!A:A, \"<=\" & fecha_final,  Registros!B:B, \"=\" & D!A55))","v":0},0]
[null,"",{"$f":"IF(ISBLANK(A56),0, SUMIFS(Registros!E:E,Registros!A:A,\"<\"&fecha_inicial,Registros!B:B,\"=\"&D!A56)) - IF(ISBLANK(A56),0, SUMIFS(Registros!F:F,Registros!A:A,\"<\"&fecha_inicial,Registros!B:B,\"=\"&D!A56))","v":0},{"$f":"IF(ISBLANK(A56), 0, SUMIFS(Registros!E:E, Registros!A:A, \">=\" & fecha_inicial, Registros!A:A, \"<=\" & fecha_final,  Registros!B:B, \"=\" & D!A56))","v":0},{"$f":"IF(ISBLANK(A56), 0, SUMIFS(Registros!F:F, Registros!A:A, \">=\" & fecha_inicial, Registros!A:A, \"<=\" & fecha_final,  Registros!B:B, \"=\" & D!A56))","v":0},0]
[null,"",{"$f":"IF(ISBLANK(A57),0, SUMIFS(Registros!E:E,Registros!A:A,\"<\"&fecha_inicial,Registros!B:B,\"=\"&D!A57)) - IF(ISBLANK(A57),0, SUMIFS(Registros!F:F,Registros!A:A,\"<\"&fecha_inicial,Registros!B:B,\"=\"&D!A57))","v":0},{"$f":"IF(ISBLANK(A57), 0, SUMIFS(Registros!E:E, Registros!A:A, \">=\" & fecha_inicial, Registros!A:A, \"<=\" & fecha_final,  Registros!B:B, \"=\" & D!A57))","v":0},{"$f":"IF(ISBLANK(A57), 0, SUMIFS(Registros!F:F, Registros!A:A, \">=\" & fecha_inicial, Registros!A:A, \"<=\" & fecha_final,  Registros!B:B, \"=\" & D!A57))","v":0},0]
[null,"",{"$f":"IF(ISBLANK(A58),0, SUMIFS(Registros!E:E,Registros!A:A,\"<\"&fecha_inicial,Registros!B:B,\"=\"&D!A58)) - IF(ISBLANK(A58),0, SUMIFS(Registros!F:F,Registros!A:A,\"<\"&fecha_inicial,Registros!B:B,\"=\"&D!A58))","v":0},{"$f":"IF(ISBLANK(A58), 0, SUMIFS(Registros!E:E, Registros!A:A, \">=\" & fecha_inicial, Registros!A:A, \"<=\" & fecha_final,  Registros!B:B, \"=\" & D!A58))","v":0},{"$f":"IF(ISBLANK(A58), 0, SUMIFS(Registros!F:F, Registros!A:A, \">=\" & fecha_inicial, Registros!A:A, \"<=\" & fecha_final,  Registros!B:B, \"=\" & D!A58))","v":0},0]
[null,"",{"$f":"SUM(C60:C74)","v":0},{"$f":"SUM(D60:D74)","v":0},0,0]
[null,"",{"$f":"IF(ISBLANK(A60),0, SUMIFS(Registros!E:E,Registros!A:A,\"<\"&fecha_inicial,Registros!B:B,\"=\"&D!A60)) - IF(ISBLANK(A60),0, SUMIFS(Registros!F:F,Registros!A:A,\"<\"&fecha_inicial,Registros!B:B,\"=\"&D!A60))","v":0},{"$f":"IF(ISBLANK(A60), 0, SUMIFS(Registros!E:E, Registros!A:A, \">=\" & fecha_inicial, Registros!A:A, \"<=\" & fecha_final,  Registros!B:B, \"=\" & D!A60))","v":0},{"$f":"IF(ISBLANK(A60), 0, SUMIFS(Registros!F:F, Registros!A:A, \">=\" & fecha_inicial, Registros!A:A, \"<=\" & fecha_final,  Registros!B:B, \"=\" & D!A60))","v":0},0]
[null,"",{"$f":"IF(ISBLANK(A61),0, SUMIFS(Registros!E:E,Registros!A:A,\"<\"&fecha_inicial,Registros!B:B,\"=\"&D!A61)) - IF(ISBLANK(A61),0, SUMIFS(Registros!F:F,Registros!A:A,\"<\"&fecha_inicial,Registros!B:B,\"=\"&D!A61))","v":0},{"$f":"IF(ISBLANK(A61), 0, SUMIFS(Registros!E:E, Registros!A:A, \">=\" & fecha_inicial, Registros!A:A, \"<=\" & fecha_final,  Registros!B:B, \"=\" & D!A61))","v":0},{"$f":"IF(ISBLANK(A61), 0, SUMIFS(Registros!F:F, Registros!A:A, \">=\" & fecha_inicial, Registros!A:A, \"<=\" & fecha_final,  Registros!B:B, \"=\" & D!A61))","v":0},0]
[null,"",{"$f":"IF(ISBLANK(A62),0, SUMIFS(Registros!E:E,Registros!A:A,\"<\"&fecha_inicial,Registros!B:B,\"=\"&D!A62)) - IF(ISBLANK(A62),0, SUMIFS(Registros!F:F,Registros!A:A,\"<\"&fecha_inicial,Registros!B:B,\"=\"&D!A62))","v":0},{"$f":"IF(ISBLANK(A62), 0, SUMIFS(Registros!E:E, Registros!A:A, \">=\" & fecha_inicial, Registros!A:A, \"<=\" & fecha_final,  Registros!B:B, \"=\" & D!A62))","v":0},{"$f":"IF(ISBLANK(A62), 0, SUMIFS(Registros!F:F, Registros!A:A, \">=\" & fecha_inicial, Registros!A:A, \"<=\" & fecha_final,  Registros!B:B, \"=\" & D!A62))","v":0},0]
[null,"",{"$f":"IF(ISBLANK(A63),0, SUMIFS(Registros!E:E,Registros!A:A,\"<\"&fecha_inicial,Registros!B:B,\"=\"&D!A63)) - IF(ISBLANK(A63),0, SUMIFS(Registros!F:F,Registros!A:A,\"<\"&fecha_inicial,Registros!B:B,\"=\"&D!A63))","v":0},{"$f":"IF(ISBLANK(A63), 0, SUMIFS(Registros!E:E, Registros!A:A, \">=\" & fecha_inicial, Registros!A:A, \"<=\" & fecha_final,  Registros!B:B, \"=\" & D!A63))","v":0},{"$f":"IF(ISBLANK(A63), 0, SUMIFS(Registros!F:F, Registros!A:A, \">=\" & fecha_inicial, Registros!A:A, \"<=\" & fecha_final,  Registros!B:B, \"=\" & D!A63))","v":0},0]
[null,"",{"$f":"IF(ISBLANK(A64),0, SUMIFS(Registros!E:E,Registros!A:A,\"<\"&fecha_inicial,Registros!B:B,\"=\"&D!A64)) - IF(ISBLANK(A64),0, SUMIFS(Registros!F:F,Registros!A:A,\"<\"&fecha_inicial,Registros!B:B,\"=\"&D!A64))","v":0},{"$f":"IF(ISBLANK(A64), 0, SUMIFS(Registros!E:E, Registros!A:A, \">=\" & fecha_inicial, Registros!A:A, \"<=\" & fecha_final,  Registros!B:B, \"=\" & D!A64))","v":0},{"$f":"IF(ISBLANK(A64), 0, SUMIFS(Registros!F:F, Registros!A:A, \">=\" & fecha_inicial, Registros!A:A, \"<=\" & fecha_final,  Registros!B:B, \"=\" & D!A64))","v":0},0]
[null,"",{"$f":"IF(ISBLANK(A65),0, SUMIFS(Registros!E:E,Registros!A:A,\"<\"&fecha_inicial,Registros!B:B,\"=\"&D!A65)) - IF(ISBLANK(A65),0, SUMIFS(Registros!F:F,Registros!A:A,\"<\"&fecha_inicial,Registros!B:B,\"=\"&D!A65))","v":0},{"$f":"IF(ISBLANK(A65), 0, SUMIFS(Registros!E:E, Registros!A:A, \">=\" & fecha_inicial, Registros!A:A, \"<=\" & fecha_final,  Registros!B:B, \"=\" & D!A65))","v":0},{"$f":"IF(ISBLANK(A65), 0, SUMIFS(Registros!F:F, Registros!A:A, \">=\" & fecha_inicial, Registros!A:A, \"<=\" & fecha_final,  Registros!B:B, \"=\" & D!A65))","v":0},0]
[null,"",{"$f":"IF(ISBLANK(A66),0, SUMIFS(Registros!E:E,Registros!A:A,\"<\"&fecha_inicial,Registros!B:B,\"=\"&D!A66)) - IF(ISBLANK(A66),0, SUMIFS(Registros!F:F,Registros!A:A,\"<\"&fecha_inicial,Registros!B:B,\"=\"&D!A66))","v":0},{"$f":"IF(ISBLANK(A66), 0, SUMIFS(Registros!E:E, Registros!A:A, \">=\" & fecha_inicial, Registros!A:A, \"<=\" & fecha_final,  Registros!B:B, \"=\" & D!A66))","v":0},{"$f":"IF(ISBLANK(A66), 0, SUMIFS(Registros!F:F, Registros!A:A, \">=\" & fecha_inicial, Registros!A:A, \"<=\" & fecha_final,  Registros!B:B, \"=\" & D!A66))","v":0},0]
[null,"",{"$f":"IF(ISBLANK(A67),0, SUMIFS(Registros!E:E,Registros!A:A,\"<\"&fecha_inicial,Registros!B:B,\"=\"&D!A67)) - IF(ISBLANK(A67),0, SUMIFS(Registros!F:F,Registros!A:A,\"<\"&fecha_inicial,Registros!B:B,\"=\"&D!A67))","v":0},{"$f":"IF(ISBLANK(A67), 0, SUMIFS(Registros!E:E, Registros!A:A, \">=\" & fecha_inicial, Registros!A:A, \"<=\" & fecha_final,  Registros!B:B, \"=\" & D!A67))","v":0},{"$f":"IF(ISBLANK(A67), 0, SUMIFS(Registros!F:F, Registros!A:A, \">=\" & fecha_inicial, Registros!A:A, \"<=\" & fecha_final,  Registros!B:B, \"=\" & D!A67))","v":0},0]
[null,"",{"$f":"IF(ISBLANK(A68),0, SUMIFS(Registros!E:E,Registros!A:A,\"<\"&fecha_inicial,Registros!B:B,\"=\"&D!A68)) - IF(ISBLANK(A68),0, SUMIFS(Registros!F:F,Registros!A:A,\"<\"&fecha_inicial,Registros!B:B,\"=\"&D!A68))","v":0},{"$f":"IF(ISBLANK(A68), 0, SUMIFS(Registros!E:E, Registros!A:A, \">=\" & fecha_inicial, Registros!A:A, \"<=\" & fecha_final,  Registros!B:B, \"=\" & D!A68))","v":0},{"$f":"IF(ISBLANK(A68), 0, SUMIFS(Registros!F:F, Registros!A:A, \">=\" & fecha_inicial, Registros!A:A, \"<=\" & fecha_final,  Registros!B:B, \"=\" & D!A68))","v":0},0]
[null,"",{"$f":"IF(ISBLANK(A69),0, SUMIFS(Registros!E:E,Registros!A:A,\"<\"&fecha_inicial,Registros!B:B,\"=\"&D!A69)) - IF(ISBLANK(A69),0, SUMIFS(Registros!F:F,Registros!A:A,\"<\"&fecha_inicial,Registros!B:B,\"=\"&D!A69))","v":0},{"$f":"IF(ISBLANK(A69), 0, SUMIFS(Registros!E:E, Registros!A:A, \">=\" & fecha_inicial, Registros!A:A, \"<=\" & fecha_final,  Registros!B:B, \"=\" & D!A69))","v":0},{"$f":"IF(ISBLANK(A69), 0, SUMIFS(Registros!F:F, Registros!A:A, \">=\" & fecha_inicial, Registros!A:A, \"<=\" & fecha_final,  Registros!B:B, \"=\" & D!A69))","v":0},0]
[null,"",{"$f":"IF(ISBLANK(A70),0, SUMIFS(Registros!E:E,Registros!A:A,\"<\"&fecha_inicial,Registros!B:B,\"=\"&D!A70)) - IF(ISBLANK(A70),0, SUMIFS(Registros!F:F,Registros!A:A,\"<\"&fecha_inicial,Registros!B:B,\"=\"&D!A70))","v":0},{"$f":"IF(ISBLANK(A70), 0, SUMIFS(Registros!E:E, Registros!A:A, \">=\" & fecha_inicial, Registros!A:A, \"<=\" & fecha_final,  Registros!B:B, \"=\" & D!A70))","v":0},{"$f":"IF(ISBLANK(A70), 0, SUMIFS(Registros!F:F, Registros!A:A, \">=\" & fecha_inicial, Registros!A:A, \"<=\" & fecha_final,  Registros!B:B, \"=\" & D!A70))","v":0},0]
[null,"",{"$f":"IF(ISBLANK(A71),0, SUMIFS(Registros!E:E,Registros!A:A,\"<\"&fecha_inicial,Registros!B:B,\"=\"&D!A71)) - IF(ISBLANK(A71),0, SUMIFS(Registros!F:F,Registros!A:A,\"<\"&fecha_inicial,Registros!B:B,\"=\"&D!A71))","v":0},{"$f":"IF(ISBLANK(A71), 0, SUMIFS(Registros!E:E, Registros!A:A, \">=\" & fecha_inicial, Registros!A:A, \"<=\" & fecha_final,  Registros!B:B, \"=\" & D!A71))","v":0},{"$f":"IF(ISBLANK(A71), 0, SUMIFS(Registros!F:F, Registros!A:A, \">=\" & fecha_inicial, Registros!A:A, \"<=\" & fecha_final,  Registros!B:B, \"=\" & D!A71))","v":0},0]
[null,"",{"$f":"IF(ISBLANK(A72),0, SUMIFS(Registros!E:E,Registros!A:A,\"<\"&fecha_inicial,Registros!B:B,\"=\"&D!A72)) - IF(ISBLANK(A72),0, SUMIFS(Registros!F:F,Registros!A:A,\"<\"&fecha_inicial,Registros!B:B,\"=\"&D!A72))","v":0},{"$f":"IF(ISBLANK(A72), 0, SUMIFS(Registros!E:E, Registros!A:A, \">=\" & fecha_inicial, Registros!A:A, \"<=\" & fecha_final,  Registros!B:B, \"=\" & D!A72))","v":0},{"$f":"IF(ISBLANK(A72), 0, SUMIFS(Registros!F:F, Registros!A:A, \">=\" & fecha_inicial, Registros!A:A, \"<=\" & fecha_final,  Registros!B:B, \"=\" & D!A72))","v":0},0]
[null,"",{"$f":"IF(ISBLANK(A73),0, SUMIFS(Registros!E:E,Registros!A:A,\"<\"&fecha_inicial,Registros!B:B,\"=\"&D!A73)) - IF(ISBLANK(A73),0, SUMIFS(Registros!F:F,Registros!A:A,\"<\"&fecha_inicial,Registros!B:B,\"=\"&D!A73))","v":0},{"$f":"IF(ISBLANK(A73), 0, SUMIFS(Registros!E:E, Registros!A:A, \">=\" & fecha_inicial, Registros!A:A, \"<=\" & fecha_final,  Registros!B:B, \"=\" & D!A73))","v":0},{"$f":"IF(ISBLANK(A73), 0, SUMIFS(Registros!F:F, Registros!A:A, \">=\" & fecha_inicial, Registros!A:A, \"<=\" & fecha_final,  Registros!B:B, \"=\" & D!A73))","v":0},0]
[null,"",{"$f":"IF(ISBLANK(A74),0, SUMIFS(Registros!E:E,Registros!A:A,\"<\"&fecha_inicial,Registros!B:B,\"=\"&D!A74)) - IF(ISBLANK(A74),0, SUMIFS(Registros!F:F,Registros!A:A,\"<\"&fecha_inicial,Registros!B:B,\"=\"&D!A74))","v":0},{"$f":"IF(ISBLANK(A74), 0, SUMIFS(Registros!E:E, Registros!A:A, \">=\" & fecha_inicial, Registros!A:A, \"<=\" & fecha_final,  Registros!B:B, \"=\" & D!A74))","v":0},{"$f":"IF(ISBLANK(A74), 0, SUMIFS(Registros!F:F, Registros!A:A, \">=\" & fecha_inicial, Registros!A:A, \"<=\" & fecha_final,  Registros!B:B, \"=\" & D!A74))","v":0},0]
[{"$f":"\"SALDO FINAL DE LA CUENTA AL \" &TEXT(fecha_final, \"dd\")&\" DE \"&UPPER(TEXT(fecha_final, \"MMMM\"))&\" DEL \"& TEXT(fecha_final, \"YYYY\")","v":"SALDO FINAL DE LA CUENTA AL 00 DE ENERO DEL 1900"},null,{"$f":"C11+C27+C43+C59","v":0},{"$f":"D11+D27+D43+D59","v":0},{"$f":"E11+E27+E43+E59","v":0},{"$f":"C75+D75-E75","v":0}]
[]
[]
[]
[]
["ELABORA",null,null,null,"REVISA"]
[{"$f":"VLOOKUP(A80, Usuarios!B12:E14, 2, FALSE)","v":"Arlen de Jesús Baltodano López"},null,null,null,{"$f":"VLOOKUP(E80, Usuarios!B12:E14, 2, FALSE)","v":"Gersan Arguello Prado"}]
[{"$f":"VLOOKUP(A80, Usuarios!B12:E14, 4, FALSE)","v":"Auxiliar de Contabilidad"},null,null,null,{"$f":"VLOOKUP(E80, Usuarios!B12:E14, 4, FALSE)","v":"Contador General"}]
[]
[]
[null,null,"AUTORIZA"]
[null,null,{"$f":"VLOOKUP(C85, Usuarios!B12:E14, 2, FALSE)","v":"Matilda Padilla Mayorga"}]
[null,null,{"$f":"VLOOKUP(C85, Usuarios!B12:E14, 4, FALSE)","v":"Gerente de Finanzas"}]

{"sheet":"H","index":9,"n_rows":87,"n_cols":6,"rows_kept":87,"cut":false,"hidden":false,"merged":[[1,0,1,5],[2,0,2,5],[3,0,3,5],[4,0,4,5],[6,3,6,5],[7,5,8,5],[74,0,74,1],[78,0,78,1],[78,4,78,5],[79,0,79,1],[79,4,79,5],[7,0,8,0],[7,1,8,1],[7,2,8,2],[7,3,8,3],[7,4,8,4],[86,2,86,3],[80,0,80,1],[80,4,80,5],[81,0,81,1],[81,4,81,5],[84,2,84,3],[85,2,85,3]]}
[null,null,null,null,"Proteger"]
[{"$f":"nombre_empresa","v":"CONSULTORES DE OMETEPE"}]
[{"$f":"\"RESUMEN CONTABLE DE \"&B7","v":"RESUMEN CONTABLE DE "}]
[{"$f":"\"DEL \"&TEXT(fecha_inicial, \"DD\")&\" DE \"&UPPER(TEXT(fecha_inicial, \"MMMM\"))&\" AL \"&TEXT(fecha_final, \"DD\")&\" DE \"&UPPER(TEXT(fecha_final, \"MMMM\"))&\" DE \"&TEXT(fecha_final, \"YYYY\")","v":"DEL 00 DE ENERO AL 00 DE ENERO DE 1900"}]
[{"$f":"direccion & \" *** Tel/Fax:  \" & tel_fax & \" *** \" & email","v":"Barrio el Progreso, San Jorge, Rivas. *** Tel/Fax:  89040457 *** escribeme@radioometepe.com"}]
[]
[null,{"$f":"UPPER(IF(ISBLANK(A7),\"\",IFERROR(VLOOKUP(A7,plan_cuentas,2,FALSE),\"Código de cuenta incorrecto\")))","v":""},null,{"$f":"\"MOVIMIENTOS DE \"&UPPER(TEXT(fecha_final, \"MMMM\"))","v":"MOVIMIENTOS DE ENERO"}]
["CODIGO","NOMBRE DE LA CUENTA","SALDO INICIAL","DEBITOS","CREDITOS","SALDO FINAL"]
[]
[]
[null,{"$f":"IF(A11<>0, IF(ISERROR(VLOOKUP(A11, plan_cuentas,2, FALSE)), \"Código de Cuenta Incorrecto\", UPPER(VLOOKUP(A11, plan_cuentas, 2, FALSE))), \"\")","v":""},{"$f":"SUM(C12:C26)","v":0},{"$f":"SUM(D12:D26)","v":0},0,{"$f":"C11-D11+E11","v":0}]
[null,"",{"$f":"IF(ISBLANK(A12),0, SUMIFS(Registros!F:F,Registros!A:A,\"<\"&fecha_inicial,Registros!B:B,\"=\"&H!A12)) - IF(ISBLANK(A12),0, SUMIFS(Registros!E:E,Registros!A:A,\"<\"&fecha_inicial,Registros!B:B,\"=\"&H!A12))","v":0},{"$f":"IF(ISBLANK(A12), 0, SUMIFS(Registros!E:E, Registros!A:A, \">=\" & fecha_inicial, Registros!A:A, \"<=\" & fecha_final,  Registros!B:B, \"=\" & H!A12))","v":0},{"$f":"IF(ISBLANK(A12), 0, SUMIFS(Registros!F:F, Registros!A:A, \">=\" & fecha_inicial, Registros!A:A, \"<=\" & fecha_final,  Registros!B:B, \"=\" & H!A12))","v":0},{"$f":"C12-D12+E12","v":0}]
[null,"",{"$f":"IF(ISBLANK(A13),0, SUMIFS(Registros!F:F,Registros!A:A,\"<\"&fecha_inicial,Registros!B:B,\"=\"&H!A13)) - IF(ISBLANK(A13),0, SUMIFS(Registros!E:E,Registros!A:A,\"<\"&fecha_inicial,Registros!B:B,\"=\"&H!A13))","v":0},{"$f":"IF(ISBLANK(A13), 0, SUMIFS(Registros!E:E, Registros!A:A, \">=\" & fecha_inicial, Registros!A:A, \"<=\" & fecha_final,  Registros!B:B, \"=\" & H!A13))","v":0},{"$f":"IF(ISBLANK(A13), 0, SUMIFS(Registros!F:F, Registros!A:A, \">=\" & fecha_inicial, Registros!A:A, \"<=\" & fecha_final,  Registros!B:B, \"=\" & H!A13))","v":0},0]
[null,"",{"$f":"IF(ISBLANK(A14),0, SUMIFS(Registros!F:F,Registros!A:A,\"<\"&fecha_inicial,Registros!B:B,\"=\"&H!A14)) - IF(ISBLANK(A14),0, SUMIFS(Registros!E:E,Registros!A:A,\"<\"&fecha_inicial,Registros!B:B,\"=\"&H!A14))","v":0},{"$f":"IF(ISBLANK(A14), 0, SUMIFS(Registros!E:E, Registros!A:A, \">=\" & fecha_inicial, Registros!A:A, \"<=\" & fecha_final,  Registros!B:B, \"=\" & H!A14))","v":0},{"$f":"IF(ISBLANK(A14), 0, SUMIFS(Registros!F:F, Registros!A:A, \">=\" & fecha_inicial, Registros!A:A, \"<=\" & fecha_final,  Registros!B:B, \"=\" & H!A14))","v":0},0]
[null,"",{"$f":"IF(ISBLANK(A15),0, SUMIFS(Registros!F:F,Registros!A:A,\"<\"&fecha_inicial,Registros!B:B,\"=\"&H!A15)) - IF(ISBLANK(A15),0, SUMIFS(Registros!E:E,Registros!A:A,\"<\"&fecha_inicial,Registros!B:B,\"=\"&H!A15))","v":0},{"$f":"IF(ISBLANK(A15), 0, SUMIFS(Registros!E:E, Registros!A:A, \">=\" & fecha_inicial, Registros!A:A, \"<=\" & fecha_final,  Registros!B:B, \"=\" & H!A15))","v":0},{"$f":"IF(ISBLANK(A15), 0, SUMIFS(Registros!F:F, Registros!A:A, \">=\" & fecha_inicial, Registros!A:A, \"<=\" & fecha_final,  Registros!B:B, \"=\" & H!A15))","v":0},0]
[null,"",{"$f":"IF(ISBLANK(A16),0, SUMIFS(Registros!F:F,Registros!A:A,\"<\"&fecha_inicial,Registros!B:B,\"=\"&H!A16)) - IF(ISBLANK(A16),0, SUMIFS(Registros!E:E,Registros!A:A,\"<\"&fecha_inicial,Registros!B:B,\"=\"&H!A16))","v":0},{"$f":"IF(ISBLANK(A16), 0, SUMIFS(Registros!E:E, Registros!A:A, \">=\" & fecha_inicial, Registros!A:A, \"<=\" & fecha_final,  Registros!B:B, \"=\" & H!A16))","v":0},{"$f":"IF(ISBLANK(A16), 0, SUMIFS(Registros!F:F, Registros!A:A, \">=\" & fecha_inicial, Registros!A:A, \"<=\" & fecha_final,  Registros!B:B, \"=\" & H!A16))","v":0},0]
[null,"",{"$f":"IF(ISBLANK(A17),0, SUMIFS(Registros!F:F,Registros!A:A,\"<\"&fecha_inicial,Registros!B:B,\"=\"&H!A17)) - IF(ISBLANK(A17),0, SUMIFS(Registros!E:E,Registros!A:A,\"<\"&fecha_inicial,Registros!B:B,\"=\"&H!A17))","v":0},{"$f":"IF(ISBLANK(A17), 0, SUMIFS(Registros!E:E, Registros!A:A, \">=\" & fecha_inicial, Registros!A:A, \"<=\" & fecha_final,  Registros!B:B, \"=\" & H!A17))","v":0},{"$f":"IF(ISBLANK(A17), 0, SUMIFS(Registros!F:F, Registros!A:A, \">=\" & fecha_inicial, Registros!A:A, \"<=\" & fecha_final,  Registros!B:B, \"=\" & H!A17))","v":0},0]
[null,"",{"$f":"IF(ISBLANK(A18),0, SUMIFS(Registros!F:F,Registros!A:A,\"<\"&fecha_inicial,Registros!B:B,\"=\"&H!A18)) - IF(ISBLANK(A18),0, SUMIFS(Registros!E:E,Registros!A:A,\"<\"&fecha_inicial,Registros!B:B,\"=\"&H!A18))","v":0},{"$f":"IF(ISBLANK(A18), 0, SUMIFS(Registros!E:E, Registros!A:A, \">=\" & fecha_inicial, Registros!A:A, \"<=\" & fecha_final,  Registros!B:B, \"=\" & H!A18))","v":0},{"$f":"IF(ISBLANK(A18), 0, SUMIFS(Registros!F:F, Registros!A:A, \">=\" & fecha_inicial, Registros!A:A, \"<=\" & fecha_final,  Registros!B:B, \"=\" & H!A18))","v":0},0]
[null,"",{"$f":"IF(ISBLANK(A19),0, SUMIFS(Registros!F:F,Registros!A:A,\"<\"&fecha_inicial,Registros!B:B,\"=\"&H!A19)) - IF(ISBLANK(A19),0, SUMIFS(Registros!E:E,Registros!A:A,\"<\"&fecha_inicial,Registros!B:B,\"=\"&H!A19))","v":0},{"$f":"IF(ISBLANK(A19), 0, SUMIFS(Registros!E:E, Registros!A:A, \">=\" & fecha_inicial, Registros!A:A, \"<=\" & fecha_final,  Registros!B:B, \"=\" & H!A19))","v":0},{"$f":"IF(ISBLANK(A19), 0, SUMIFS(Registros!F:F, Registros!A:A, \">=\" & fecha_inicial, Registros!A:A, \"<=\" & fecha_final,  Registros!B:B, \"=\" & H!A19))","v":0},0]
[null,"",{"$f":"IF(ISBLANK(A20),0, SUMIFS(Registros!F:F,Registros!A:A,\"<\"&fecha_inicial,Registros!B:B,\"=\"&H!A20)) - IF(ISBLANK(A20),0, SUMIFS(Registros!E:E,Registros!A:A,\"<\"&fecha_inicial,Registros!B:B,\"=\"&H!A20))","v":0},{"$f":"IF(ISBLANK(A20), 0, SUMIFS(Registros!E:E, Registros!A:A, \">=\" & fecha_inicial, Registros!A:A, \"<=\" & fecha_final,  Registros!B:B, \"=\" & H!A20))","v":0},{"$f":"IF(ISBLANK(A20), 0, SUMIFS(Registros!F:F, Registros!A:A, \">=\" & fecha_inicial, Registros!A:A, \"<=\" & fecha_final,  Registros!B:B, \"=\" & H!A20))","v":0},0]
[null,"",{"$f":"IF(ISBLANK(A21),0, SUMIFS(Registros!F:F,Registros!A:A,\"<\"&fecha_inicial,Registros!B:B,\"=\"&H!A21)) - IF(ISBLANK(A21),0, SUMIFS(Registros!E:E,Registros!A:A,\"<\"&fecha_inicial,Registros!B:B,\"=\"&H!A21))","v":0},{"$f":"IF(ISBLANK(A21), 0, SUMIFS(Registros!E:E, Registros!A:A, \">=\" & fecha_inicial, Registros!A:A, \"<=\" & fecha_final,  Registros!B:B, \"=\" & H!A21))","v":0},{"$f":"IF(ISBLANK(A21), 0, SUMIFS(Registros!F:F, Registros!A:A, \">=\" & fecha_inicial, Registros!A:A, \"<=\" & fecha_final,  Registros!B:B, \"=\" & H!A21))","v":0},0]
[null,"",{"$f":"IF(ISBLANK(A22),0, SUMIFS(Registros!F:F,Registros!A:A,\"<\"&fecha_inicial,Registros!B:B,\"=\"&H!A22)) - IF(ISBLANK(A22),0, SUMIFS(Registros!E:E,Registros!A:A,\"<\"&fecha_inicial,Registros!B:B,\"=\"&H!A22))","v":0},{"$f":"IF(ISBLANK(A22), 0, SUMIFS(Registros!E:E, Registros!A:A, \">=\" & fecha_inicial, Registros!A:A, \"<=\" & fecha_final,  Registros!B:B, \"=\" & H!A22))","v":0},{"$f":"IF(ISBLANK(A22), 0, SUMIFS(Registros!F:F, Registros!A:A, \">=\" & fecha_inicial, Registros!A:A, \"<=\" & fecha_final,  Registros!B:B, \"=\" & H!A22))","v":0},0]
[null,"",{"$f":"IF(ISBLANK(A23),0, SUMIFS(Registros!F:F,Registros!A:A,\"<\"&fecha_inicial,Registros!B:B,\"=\"&H!A23)) - IF(ISBLANK(A23),0, SUMIFS(Registros!E:E,Registros!A:A,\"<\"&fecha_inicial,Registros!B:B,\"=\"&H!A23))","v":0},{"$f":"IF(ISBLANK(A23), 0, SUMIFS(Registros!E:E, Registros!A:A, \">=\" & fecha_inicial, Registros!A:A, \"<=\" & fecha_final,  Registros!B:B, \"=\" & H!A23))","v":0},{"$f":"IF(ISBLANK(A23), 0, SUMIFS(Registros!F:F, Registros!A:A, \">=\" & fecha_inicial, Registros!A:A, \"<=\" & fecha_final,  Registros!B:B, \"=\" & H!A23))","v":0},0]
[null,"",{"$f":"IF(ISBLANK(A24),0, SUMIFS(Registros!F:F,Registros!A:A,\"<\"&fecha_inicial,Registros!B:B,\"=\"&H!A24)) - IF(ISBLANK(A24),0, SUMIFS(Registros!E:E,Registros!A:A,\"<\"&fecha_inicial,Registros!B:B,\"=\"&H!A24))","v":0},{"$f":"IF(ISBLANK(A24), 0, SUMIFS(Registros!E:E, Registros!A:A, \">=\" & fecha_inicial, Registros!A:A, \"<=\" & fecha_final,  Registros!B:B, \"=\" & H!A24))","v":0},{"$f":"IF(ISBLANK(A24), 0, SUMIFS(Registros!F:F, Registros!A:A, \">=\" & fecha_inicial, Registros!A:A, \"<=\" & fecha_final,  Registros!B:B, \"=\" & H!A24))","v":0},0]
[null,"",{"$f":"IF(ISBLANK(A25),0, SUMIFS(Registros!F:F,Registros!A:A,\"<\"&fecha_inicial,Registros!B:B,\"=\"&H!A25)) - IF(ISBLANK(A25),0, SUMIFS(Registros!E:E,Registros!A:A,\"<\"&fecha_inicial,Registros!B:B,\"=\"&H!A25))","v":0},{"$f":"IF(ISBLANK(A25), 0, SUMIFS(Registros!E:E, Registros!A:A, \">=\" & fecha_inicial, Registros!A:A, \"<=\" & fecha_final,  Registros!B:B, \"=\" & H!A25))","v":0},{"$f":"IF(ISBLANK(A25), 0, SUMIFS(Registros!F:F, Registros!A:A, \">=\" & fecha_inicial, Registros!A:A, \"<=\" & fecha_final,  Registros!B:B, \"=\" & H!A25))","v":0},0]
[null,"",{"$f":"IF(ISBLANK(A26),0, SUMIFS(Registros!F:F,Registros!A:A,\"<\"&fecha_inicial,Registros!B:B,\"=\"&H!A26)) - IF(ISBLANK(A26),0, SUMIFS(Registros!E:E,Registros!A:A,\"<\"&fecha_inicial,Registros!B:B,\"=\"&H!A26))","v":0},{"$f":"IF(ISBLANK(A26), 0, SUMIFS(Registros!E:E, Registros!A:A, \">=\" & fecha_inicial, Registros!A:A, \"<=\" & fecha_final,  Registros!B:B, \"=\" & H!A26))","v":0},{"$f":"IF(ISBLANK(A26), 0, SUMIFS(Registros!F:F, Registros!A:A, \">=\" & fecha_inicial, Registros!A:A, \"<=\" & fecha_final,  Registros!B:B, \"=\" & H!A26))","v":0},0]
[null,"",{"$f":"SUM(C28:C42)","v":0},{"$f":"SUM(D28:D42)","v":0},{"$f":"SUM(E28:E42)","v":0},0]
[null,"",{"$f":"IF(ISBLANK(A28),0, SUMIFS(Registros!F:F,Registros!A:A,\"<\"&fecha_inicial,Registros!B:B,\"=\"&H!A28)) - IF(ISBLANK(A28),0, SUMIFS(Registros!E:E,Registros!A:A,\"<\"&fecha_inicial,Registros!B:B,\"=\"&H!A28))","v":0},{"$f":"IF(ISBLANK(A28), 0, SUMIFS(Registros!E:E, Registros!A:A, \">=\" & fecha_inicial, Registros!A:A, \"<=\" & fecha_final,  Registros!B:B, \"=\" & H!A28))","v":0},{"$f":"IF(ISBLANK(A28), 0, SUMIFS(Registros!F:F, Registros!A:A, \">=\" & fecha_inicial, Registros!A:A, \"<=\" & fecha_final,  Registros!B:B, \"=\" & H!A28))","v":0},0]
[null,"",{"$f":"IF(ISBLANK(A29),0, SUMIFS(Registros!F:F,Registros!A:A,\"<\"&fecha_inicial,Registros!B:B,\"=\"&H!A29)) - IF(ISBLANK(A29),0, SUMIFS(Registros!E:E,Registros!A:A,\"<\"&fecha_inicial,Registros!B:B,\"=\"&H!A29))","v":0},{"$f":"IF(ISBLANK(A29), 0, SUMIFS(Registros!E:E, Registros!A:A, \">=\" & fecha_inicial, Registros!A:A, \"<=\" & fecha_final,  Registros!B:B, \"=\" & H!A29))","v":0},{"$f":"IF(ISBLANK(A29), 0, SUMIFS(Registros!F:F, Registros!A:A, \">=\" & fecha_inicial, Registros!A:A, \"<=\" & fecha_final,  Registros!B:B, \"=\" & H!A29))","v":0},0]
[null,"",{"$f":"IF(ISBLANK(A30),0, SUMIFS(Registros!F:F,Registros!A:A,\"<\"&fecha_inicial,Registros!B:B,\"=\"&H!A30)) - IF(ISBLANK(A30),0, SUMIFS(Registros!E:E,Registros!A:A,\"<\"&fecha_inicial,Registros!B:B,\"=\"&H!A30))","v":0},{"$f":"IF(ISBLANK(A30), 0, SUMIFS(Registros!E:E, Registros!A:A, \">=\" & fecha_inicial, Registros!A:A, \"<=\" & fecha_final,  Registros!B:B, \"=\" & H!A30))","v":0},{"$f":"IF(ISBLANK(A30), 0, SUMIFS(Registros!F:F, Registros!A:A, \">=\" & fecha_inicial, Registros!A:A, \"<=\" & fecha_final,  Registros!B:B, \"=\" & H!A30))","v":0},0]
[null,"",{"$f":"IF(ISBLANK(A31),0, SUMIFS(Registros!F:F,Registros!A:A,\"<\"&fecha_inicial,Registros!B:B,\"=\"&H!A31)) - IF(ISBLANK(A31),0, SUMIFS(Registros!E:E,Registros!A:A,\"<\"&fecha_inicial,Registros!B:B,\"=\"&H!A31))","v":0},{"$f":"IF(ISBLANK(A31), 0, SUMIFS(Registros!E:E, Registros!A:A, \">=\" & fecha_inicial, Registros!A:A, \"<=\" & fecha_final,  Registros!B:B, \"=\" & H!A31))","v":0},{"$f":"IF(ISBLANK(A31), 0, SUMIFS(Registros!F:F, Registros!A:A, \">=\" & fecha_inicial, Registros!A:A, \"<=\" & fecha_final,  Registros!B:B, \"=\" & H!A31))","v":0},0]
[null,"",{"$f":"IF(ISBLANK(A32),0, SUMIFS(Registros!F:F,Registros!A:A,\"<\"&fecha_inicial,Registros!B:B,\"=\"&H!A32)) - IF(ISBLANK(A32),0, SUMIFS(Registros!E:E,Registros!A:A,\"<\"&fecha_inicial,Registros!B:B,\"=\"&H!A32))","v":0},{"$f":"IF(ISBLANK(A32), 0, SUMIFS(Registros!E:E, Registros!A:A, \">=\" & fecha_inicial, Registros!A:A, \"<=\" & fecha_final,  Registros!B:B, \"=\" & H!A32))","v":0},{"$f":"IF(ISBLANK(A32), 0, SUMIFS(Registros!F:F, Registros!A:A, \">=\" & fecha_inicial, Registros!A:A, \"<=\" & fecha_final,  Registros!B:B, \"=\" & H!A32))","v":0},0]
[null,"",{"$f":"IF(ISBLANK(A33),0, SUMIFS(Registros!F:F,Registros!A:A,\"<\"&fecha_inicial,Registros!B:B,\"=\"&H!A33)) - IF(ISBLANK(A33),0, SUMIFS(Registros!E:E,Registros!A:A,\"<\"&fecha_inicial,Registros!B:B,\"=\"&H!A33))","v":0},{"$f":"IF(ISBLANK(A33), 0, SUMIFS(Registros!E:E, Registros!A:A, \">=\" & fecha_inicial, Registros!A:A, \"<=\" & fecha_final,  Registros!B:B, \"=\" & H!A33))","v":0},{"$f":"IF(ISBLANK(A33), 0, SUMIFS(Registros!F:F, Registros!A:A, \">=\" & fecha_inicial, Registros!A:A, \"<=\" & fecha_final,  Registros!B:B, \"=\" & H!A33))","v":0},0]
[null,"",{"$f":"IF(ISBLANK(A34),0, SUMIFS(Registros!F:F,Registros!A:A,\"<\"&fecha_inicial,Registros!B:B,\"=\"&H!A34)) - IF(ISBLANK(A34),0, SUMIFS(Registros!E:E,Registros!A:A,\"<\"&fecha_inicial,Registros!B:B,\"=\"&H!A34))","v":0},{"$f":"IF(ISBLANK(A34), 0, SUMIFS(Registros!E:E, Registros!A:A, \">=\" & fecha_inicial, Registros!A:A, \"<=\" & fecha_final,  Registros!B:B, \"=\" & H!A34))","v":0},{"$f":"IF(ISBLANK(A34), 0, SUMIFS(Registros!F:F, Registros!A:A, \">=\" & fecha_inicial, Registros!A:A, \"<=\" & fecha_final,  Registros!B:B, \"=\" & H!A34))","v":0},0]
[null,"",{"$f":"IF(ISBLANK(A35),0, SUMIFS(Registros!F:F,Registros!A:A,\"<\"&fecha_inicial,Registros!B:B,\"=\"&H!A35)) - IF(ISBLANK(A35),0, SUMIFS(Registros!E:E,Registros!A:A,\"<\"&fecha_inicial,Registros!B:B,\"=\"&H!A35))","v":0},{"$f":"IF(ISBLANK(A35), 0, SUMIFS(Registros!E:E, Registros!A:A, \">=\" & fecha_inicial, Registros!A:A, \"<=\" & fecha_final,  Registros!B:B, \"=\" & H!A35))","v":0},{"$f":"IF(ISBLANK(A35), 0, SUMIFS(Registros!F:F, Registros!A:A, \">=\" & fecha_inicial, Registros!A:A, \"<=\" & fecha_final,  Registros!B:B, \"=\" & H!A35))","v":0},0]
[null,"",{"$f":"IF(ISBLANK(A36),0, SUMIFS(Registros!F:F,Registros!A:A,\"<\"&fecha_inicial,Registros!B:B,\"=\"&H!A36)) - IF(ISBLANK(A36),0, SUMIFS(Registros!E:E,Registros!A:A,\"<\"&fecha_inicial,Registros!B:B,\"=\"&H!A36))","v":0},{"$f":"IF(ISBLANK(A36), 0, SUMIFS(Registros!E:E, Registros!A:A, \">=\" & fecha_inicial, Registros!A:A, \"<=\" & fecha_final,  Registros!B:B, \"=\" & H!A36))","v":0},{"$f":"IF(ISBLANK(A36), 0, SUMIFS(Registros!F:F, Registros!A:A, \">=\" & fecha_inicial, Registros!A:A, \"<=\" & fecha_final,  Registros!B:B, \"=\" & H!A36))","v":0},0]
[null,"",{"$f":"IF(ISBLANK(A37),0, SUMIFS(Registros!F:F,Registros!A:A,\"<\"&fecha_inicial,Registros!B:B,\"=\"&H!A37)) - IF(ISBLANK(A37),0, SUMIFS(Registros!E:E,Registros!A:A,\"<\"&fecha_inicial,Registros!B:B,\"=\"&H!A37))","v":0},{"$f":"IF(ISBLANK(A37), 0, SUMIFS(Registros!E:E, Registros!A:A, \">=\" & fecha_inicial, Registros!A:A, \"<=\" & fecha_final,  Registros!B:B, \"=\" & H!A37))","v":0},{"$f":"IF(ISBLANK(A37), 0, SUMIFS(Registros!F:F, Registros!A:A, \">=\" & fecha_inicial, Registros!A:A, \"<=\" & fecha_final,  Registros!B:B, \"=\" & H!A37))","v":0},0]
[null,"",{"$f":"IF(ISBLANK(A38),0, SUMIFS(Registros!F:F,Registros!A:A,\"<\"&fecha_inicial,Registros!B:B,\"=\"&H!A38)) - IF(ISBLANK(A38),0, SUMIFS(Registros!E:E,Registros!A:A,\"<\"&fecha_inicial,Registros!B:B,\"=\"&H!A38))","v":0},{"$f":"IF(ISBLANK(A38), 0, SUMIFS(Registros!E:E, Registros!A:A, \">=\" & fecha_inicial, Registros!A:A, \"<=\" & fecha_final,  Registros!B:B, \"=\" & H!A38))","v":0},{"$f":"IF(ISBLANK(A38), 0, SUMIFS(Registros!F:F, Registros!A:A, \">=\" & fecha_inicial, Registros!A:A, \"<=\" & fecha_final,  Registros!B:B, \"=\" & H!A38))","v":0},0]
[null,"",{"$f":"IF(ISBLANK(A39),0, SUMIFS(Registros!F:F,Registros!A:A,\"<\"&fecha_inicial,Registros!B:B,\"=\"&H!A39)) - IF(ISBLANK(A39),0, SUMIFS(Registros!E:E,Registros!A:A,\"<\"&fecha_inicial,Registros!B:B,\"=\"&H!A39))","v":0},{"$f":"IF(ISBLANK(A39), 0, SUMIFS(Registros!E:E, Registros!A:A, \">=\" & fecha_inicial, Registros!A:A, \"<=\" & fecha_final,  Registros!B:B, \"=\" & H!A39))","v":0},{"$f":"IF(ISBLANK(A39), 0, SUMIFS(Registros!F:F, Registros!A:A, \">=\" & fecha_inicial, Registros!A:A, \"<=\" & fecha_final,  Registros!B:B, \"=\" & H!A39))","v":0},0]
[null,"",{"$f":"IF(ISBLANK(A40),0, SUMIFS(Registros!F:F,Registros!A:A,\"<\"&fecha_inicial,Registros!B:B,\"=\"&H!A40)) - IF(ISBLANK(A40),0, SUMIFS(Registros!E:E,Registros!A:A,\"<\"&fecha_inicial,Registros!B:B,\"=\"&H!A40))","v":0},{"$f":"IF(ISBLANK(A40), 0, SUMIFS(Registros!E:E, Registros!A:A, \">=\" & fecha_inicial, Registros!A:A, \"<=\" & fecha_final,  Registros!B:B, \"=\" & H!A40))","v":0},{"$f":"IF(ISBLANK(A40), 0, SUMIFS(Registros!F:F, Registros!A:A, \">=\" & fecha_inicial, Registros!A:A, \"<=\" & fecha_final,  Registros!B:B, \"=\" & H!A40))","v":0},0]
[null,"",{"$f":"IF(ISBLANK(A41),0, SUMIFS(Registros!F:F,Registros!A:A,\"<\"&fecha_inicial,Registros!B:B,\"=\"&H!A41)) - IF(ISBLANK(A41),0, SUMIFS(Registros!E:E,Registros!A:A,\"<\"&fecha_inicial,Registros!B:B,\"=\"&H!A41))","v":0},{"$f":"IF(ISBLANK(A41), 0, SUMIFS(Registros!E:E, Registros!A:A, \">=\" & fecha_inicial, Registros!A:A, \"<=\" & fecha_final,  Registros!B:B, \"=\" & H!A41))","v":0},{"$f":"IF(ISBLANK(A41), 0, SUMIFS(Registros!F:F, Registros!A:A, \">=\" & fecha_inicial, Registros!A:A, \"<=\" & fecha_final,  Registros!B:B, \"=\" & H!A41))","v":0},0]
[null,"",{"$f":"IF(ISBLANK(A42),0, SUMIFS(Registros!F:F,Registros!A:A,\"<\"&fecha_inicial,Registros!B:B,\"=\"&H!A42)) - IF(ISBLANK(A42),0, SUMIFS(Registros!E:E,Registros!A:A,\"<\"&fecha_inicial,Registros!B:B,\"=\"&H!A42))","v":0},{"$f":"IF(ISBLANK(A42), 0, SUMIFS(Registros!E:E, Registros!A:A, \">=\" & fecha_inicial, Registros!A:A, \"<=\" & fecha_final,  Registros!B:B, \"=\" & H!A42))","v":0},{"$f":"IF(ISBLANK(A42), 0, SUMIFS(Registros!F:F, Registros!A:A, \">=\" & fecha_inicial, Registros!A:A, \"<=\" & fecha_final,  Registros!B:B, \"=\" & H!A42))","v":0},0]
[null,"",{"$f":"SUM(C44:C58)","v":0},{"$f":"SUM(D44:D58)","v":0},0,0]
[null,"",{"$f":"IF(ISBLANK(A44),0, SUMIFS(Registros!F:F,Registros!A:A,\"<\"&fecha_inicial,Registros!B:B,\"=\"&H!A44)) - IF(ISBLANK(A44),0, SUMIFS(Registros!E:E,Registros!A:A,\"<\"&fecha_inicial,Registros!B:B,\"=\"&H!A44))","v":0},{"$f":"IF(ISBLANK(A44), 0, SUMIFS(Registros!E:E, Registros!A:A, \">=\" & fecha_inicial, Registros!A:A, \"<=\" & fecha_final,  Registros!B:B, \"=\" & H!A44))","v":0},{"$f":"IF(ISBLANK(A44), 0, SUMIFS(Registros!F:F, Registros!A:A, \">=\" & fecha_inicial, Registros!A:A, \"<=\" & fecha_final,  Registros!B:B, \"=\" & H!A44))","v":0},0]
[null,"",{"$f":"IF(ISBLANK(A45),0, SUMIFS(Registros!F:F,Registros!A:A,\"<\"&fecha_inicial,Registros!B:B,\"=\"&H!A45)) - IF(ISBLANK(A45),0, SUMIFS(Registros!E:E,Registros!A:A,\"<\"&fecha_inicial,Registros!B:B,\"=\"&H!A45))","v":0},{"$f":"IF(ISBLANK(A45), 0, SUMIFS(Registros!E:E, Registros!A:A, \">=\" & fecha_inicial, Registros!A:A, \"<=\" & fecha_final,  Registros!B:B, \"=\" & H!A45))","v":0},{"$f":"IF(ISBLANK(A45), 0, SUMIFS(Registros!F:F, Registros!A:A, \">=\" & fecha_inicial, Registros!A:A, \"<=\" & fecha_final,  Registros!B:B, \"=\" & H!A45))","v":0},0]
[null,"",{"$f":"IF(ISBLANK(A46),0, SUMIFS(Registros!F:F,Registros!A:A,\"<\"&fecha_inicial,Registros!B:B,\"=\"&H!A46)) - IF(ISBLANK(A46),0, SUMIFS(Registros!E:E,Registros!A:A,\"<\"&fecha_inicial,Registros!B:B,\"=\"&H!A46))","v":0},{"$f":"IF(ISBLANK(A46), 0, SUMIFS(Registros!E:E, Registros!A:A, \">=\" & fecha_inicial, Registros!A:A, \"<=\" & fecha_final,  Registros!B:B, \"=\" & H!A46))","v":0},{"$f":"IF(ISBLANK(A46), 0, SUMIFS(Registros!F:F, Registros!A:A, \">=\" & fecha_inicial, Registros!A:A, \"<=\" & fecha_final,  Registros!B:B, \"=\" & H!A46))","v":0},0]
[null,"",{"$f":"IF(ISBLANK(A47),0, SUMIFS(Registros!F:F,Registros!A:A,\"<\"&fecha_inicial,Registros!B:B,\"=\"&H!A47)) - IF(ISBLANK(A47),0, SUMIFS(Registros!E:E,Registros!A:A,\"<\"&fecha_inicial,Registros!B:B,\"=\"&H!A47))","v":0},{"$f":"IF(ISBLANK(A47), 0, SUMIFS(Registros!E:E, Registros!A:A, \">=\" & fecha_inicial, Registros!A:A, \"<=\" & fecha_final,  Registros!B:B, \"=\" & H!A47))","v":0},{"$f":"IF(ISBLANK(A47), 0, SUMIFS(Registros!F:F, Registros!A:A, \">=\" & fecha_inicial, Registros!A:A, \"<=\" & fecha_final,  Registros!B:B, \"=\" & H!A47))","v":0},0]
[null,"",{"$f":"IF(ISBLANK(A48),0, SUMIFS(Registros!F:F,Registros!A:A,\"<\"&fecha_inicial,Registros!B:B,\"=\"&H!A48)) - IF(ISBLANK(A48),0, SUMIFS(Registros!E:E,Registros!A:A,\"<\"&fecha_inicial,Registros!B:B,\"=\"&H!A48))","v":0},{"$f":"IF(ISBLANK(A48), 0, SUMIFS(Registros!E:E, Registros!A:A, \">=\" & fecha_inicial, Registros!A:A, \"<=\" & fecha_final,  Registros!B:B, \"=\" & H!A48))","v":0},{"$f":"IF(ISBLANK(A48), 0, SUMIFS(Registros!F:F, Registros!A:A, \">=\" & fecha_inicial, Registros!A:A, \"<=\" & fecha_final,  Registros!B:B, \"=\" & H!A48))","v":0},0]
[null,"",{"$f":"IF(ISBLANK(A49),0, SUMIFS(Registros!F:F,Registros!A:A,\"<\"&fecha_inicial,Registros!B:B,\"=\"&H!A49)) - IF(ISBLANK(A49),0, SUMIFS(Registros!E:E,Registros!A:A,\"<\"&fecha_inicial,Registros!B:B,\"=\"&H!A49))","v":0},{"$f":"IF(ISBLANK(A49), 0, SUMIFS(Registros!E:E, Registros!A:A, \">=\" & fecha_inicial, Registros!A:A, \"<=\" & fecha_final,  Registros!B:B, \"=\" & H!A49))","v":0},{"$f":"IF(ISBLANK(A49), 0, SUMIFS(Registros!F:F, Registros!A:A, \">=\" & fecha_inicial, Registros!A:A, \"<=\" & fecha_final,  Registros!B:B, \"=\" & H!A49))","v":0},0]
[null,"",{"$f":"IF(ISBLANK(A50),0, SUMIFS(Registros!F:F,Registros!A:A,\"<\"&fecha_inicial,Registros!B:B,\"=\"&H!A50)) - IF(ISBLANK(A50),0, SUMIFS(Registros!E:E,Registros!A:A,\"<\"&fecha_inicial,Registros!B:B,\"=\"&H!A50))","v":0},{"$f":"IF(ISBLANK(A50), 0, SUMIFS(Registros!E:E, Registros!A:A, \">=\" & fecha_inicial, Registros!A:A, \"<=\" & fecha_final,  Registros!B:B, \"=\" & H!A50))","v":0},{"$f":"IF(ISBLANK(A50), 0, SUMIFS(Registros!F:F, Registros!A:A, \">=\" & fecha_inicial, Registros!A:A, \"<=\" & fecha_final,  Registros!B:B, \"=\" & H!A50))","v":0},0]
[null,"",{"$f":"IF(ISBLANK(A51),0, SUMIFS(Registros!F:F,Registros!A:A,\"<\"&fecha_inicial,Registros!B:B,\"=\"&H!A51)) - IF(ISBLANK(A51),0, SUMIFS(Registros!E:E,Registros!A:A,\"<\"&fecha_inicial,Registros!B:B,\"=\"&H!A51))","v":0},{"$f":"IF(ISBLANK(A51), 0, SUMIFS(Registros!E:E, Registros!A:A, \">=\" & fecha_inicial, Registros!A:A, \"<=\" & fecha_final,  Registros!B:B, \"=\" & H!A51))","v":0},{"$f":"IF(ISBLANK(A51), 0, SUMIFS(Registros!F:F, Registros!A:A, \">=\" & fecha_inicial, Registros!A:A, \"<=\" & fecha_final,  Registros!B:B, \"=\" & H!A51))","v":0},0]
[null,"",{"$f":"IF(ISBLANK(A52),0, SUMIFS(Registros!F:F,Registros!A:A,\"<\"&fecha_inicial,Registros!B:B,\"=\"&H!A52)) - IF(ISBLANK(A52),0, SUMIFS(Registros!E:E,Registros!A:A,\"<\"&fecha_inicial,Registros!B:B,\"=\"&H!A52))","v":0},{"$f":"IF(ISBLANK(A52), 0, SUMIFS(Registros!E:E, Registros!A:A, \">=\" & fecha_inicial, Registros!A:A, \"<=\" & fecha_final,  Registros!B:B, \"=\" & H!A52))","v":0},{"$f":"IF(ISBLANK(A52), 0, SUMIFS(Registros!F:F, Registros!A:A, \">=\" & fecha_inicial, Registros!A:A, \"<=\" & fecha_final,  Registros!B:B, \"=\" & H!A52))","v":0},0]
[null,"",{"$f":"IF(ISBLANK(A53),0, SUMIFS(Registros!F:F,Registros!A:A,\"<\"&fecha_inicial,Registros!B:B,\"=\"&H!A53)) - IF(ISBLANK(A53),0, SUMIFS(Registros!E:E,Registros!A:A,\"<\"&fecha_inicial,Registros!B:B,\"=\"&H!A53))","v":0},{"$f":"IF(ISBLANK(A53), 0, SUMIFS(Registros!E:E, Registros!A:A, \">=\" & fecha_inicial, Registros!A:A, \"<=\" & fecha_final,  Registros!B:B, \"=\" & H!A53))","v":0},{"$f":"IF(ISBLANK(A53), 0, SUMIFS(Registros!F:F, Registros!A:A, \">=\" & fecha_inicial, Registros!A:A, \"<=\" & fecha_final,  Registros!B:B, \"=\" & H!A53))","v":0},0]
[null,"",{"$f":"IF(ISBLANK(A54),0, SUMIFS(Registros!F:F,Registros!A:A,\"<\"&fecha_inicial,Registros!B:B,\"=\"&H!A54)) - IF(ISBLANK(A54),0, SUMIFS(Registros!E:E,Registros!A:A,\"<\"&fecha_inicial,Registros!B:B,\"=\"&H!A54))","v":0},{"$f":"IF(ISBLANK(A54), 0, SUMIFS(Registros!E:E, Registros!A:A, \">=\" & fecha_inicial, Registros!A:A, \"<=\" & fecha_final,  Registros!B:B, \"=\" & H!A54))","v":0},{"$f":"IF(ISBLANK(A54), 0, SUMIFS(Registros!F:F, Registros!A:A, \">=\" & fecha_inicial, Registros!A:A, \"<=\" & fecha_final,  Registros!B:B, \"=\" & H!A54))","v":0},0]
[null,"",{"$f":"IF(ISBLANK(A55),0, SUMIFS(Registros!F:F,Registros!A:A,\"<\"&fecha_inicial,Registros!B:B,\"=\"&H!A55)) - IF(ISBLANK(A55),0, SUMIFS(Registros!E:E,Registros!A:A,\"<\"&fecha_inicial,Registros!B:B,\"=\"&H!A55))","v":0},{"$f":"IF(ISBLANK(A55), 0, SUMIFS(Registros!E:E, Registros!A:A, \">=\" & fecha_inicial, Registros!A:A, \"<=\" & fecha_final,  Registros!B:B, \"=\" & H!A55))","v":0},{"$f":"IF(ISBLANK(A55), 0, SUMIFS(Registros!F:F, Registros!A:A, \">=\" & fecha_inicial, Registros!A:A, \"<=\" & fecha_final,  Registros!B:B, \"=\" & H!A55))","v":0},0]
[null,"",{"$f":"IF(ISBLANK(A56),0, SUMIFS(Registros!F:F,Registros!A:A,\"<\"&fecha_inicial,Registros!B:B,\"=\"&H!A56)) - IF(ISBLANK(A56),0, SUMIFS(Registros!E:E,Registros!A:A,\"<\"&fecha_inicial,Registros!B:B,\"=\"&H!A56))","v":0},{"$f":"IF(ISBLANK(A56), 0, SUMIFS(Registros!E:E, Registros!A:A, \">=\" & fecha_inicial, Registros!A:A, \"<=\" & fecha_final,  Registros!B:B, \"=\" & H!A56))","v":0},{"$f":"IF(ISBLANK(A56), 0, SUMIFS(Registros!F:F, Registros!A:A, \">=\" & fecha_inicial, Registros!A:A, \"<=\" & fecha_final,  Registros!B:B, \"=\" & H!A56))","v":0},0]
[null,"",{"$f":"IF(ISBLANK(A57),0, SUMIFS(Registros!F:F,Registros!A:A,\"<\"&fecha_inicial,Registros!B:B,\"=\"&H!A57)) - IF(ISBLANK(A57),0, SUMIFS(Registros!E:E,Registros!A:A,\"<\"&fecha_inicial,Registros!B:B,\"=\"&H!A57))","v":0},{"$f":"IF(ISBLANK(A57), 0, SUMIFS(Registros!E:E, Registros!A:A, \">=\" & fecha_inicial, Registros!A:A, \"<=\" & fecha_final,  Registros!B:B, \"=\" & H!A57))","v":0},{"$f":"IF(ISBLANK(A57), 0, SUMIFS(Registros!F:F, Registros!A:A, \">=\" & fecha_inicial, Registros!A:A, \"<=\" & fecha_final,  Registros!B:B, \"=\" & H!A57))","v":0},0]
[null,"",{"$f":"IF(ISBLANK(A58),0, SUMIFS(Registros!F:F,Registros!A:A,\"<\"&fecha_inicial,Registros!B:B,\"=\"&H!A58)) - IF(ISBLANK(A58),0, SUMIFS(Registros!E:E,Registros!A:A,\"<\"&fecha_inicial,Registros!B:B,\"=\"&H!A58))","v":0},{"$f":"IF(ISBLANK(A58), 0, SUMIFS(Registros!E:E, Registros!A:A, \">=\" & fecha_inicial, Registros!A:A, \"<=\" & fecha_final,  Registros!B:B, \"=\" & H!A58))","v":0},{"$f":"IF(ISBLANK(A58), 0, SUMIFS(Registros!F:F, Registros!A:A, \">=\" & fecha_inicial, Registros!A:A, \"<=\" & fecha_final,  Registros!B:B, \"=\" & H!A58))","v":0},0]
[null,"",{"$f":"SUM(C60:C74)","v":0},{"$f":"SUM(D60:D74)","v":0},0,0]
[null,"",{"$f":"IF(ISBLANK(A60),0, SUMIFS(Registros!F:F,Registros!A:A,\"<\"&fecha_inicial,Registros!B:B,\"=\"&H!A60)) - IF(ISBLANK(A60),0, SUMIFS(Registros!E:E,Registros!A:A,\"<\"&fecha_inicial,Registros!B:B,\"=\"&H!A60))","v":0},{"$f":"IF(ISBLANK(A60), 0, SUMIFS(Registros!E:E, Registros!A:A, \">=\" & fecha_inicial, Registros!A:A, \"<=\" & fecha_final,  Registros!B:B, \"=\" & H!A60))","v":0},{"$f":"IF(ISBLANK(A60), 0, SUMIFS(Registros!F:F, Registros!A:A, \">=\" & fecha_inicial, Registros!A:A, \"<=\" & fecha_final,  Registros!B:B, \"=\" & H!A60))","v":0},0]
[null,"",{"$f":"IF(ISBLANK(A61),0, SUMIFS(Registros!F:F,Registros!A:A,\"<\"&fecha_inicial,Registros!B:B,\"=\"&H!A61)) - IF(ISBLANK(A61),0, SUMIFS(Registros!E:E,Registros!A:A,\"<\"&fecha_inicial,Registros!B:B,\"=\"&H!A61))","v":0},{"$f":"IF(ISBLANK(A61), 0, SUMIFS(Registros!E:E, Registros!A:A, \">=\" & fecha_inicial, Registros!A:A, \"<=\" & fecha_final,  Registros!B:B, \"=\" & H!A61))","v":0},{"$f":"IF(ISBLANK(A61), 0, SUMIFS(Registros!F:F, Registros!A:A, \">=\" & fecha_inicial, Registros!A:A, \"<=\" & fecha_final,  Registros!B:B, \"=\" & H!A61))","v":0},0]
[null,"",{"$f":"IF(ISBLANK(A62),0, SUMIFS(Registros!F:F,Registros!A:A,\"<\"&fecha_inicial,Registros!B:B,\"=\"&H!A62)) - IF(ISBLANK(A62),0, SUMIFS(Registros!E:E,Registros!A:A,\"<\"&fecha_inicial,Registros!B:B,\"=\"&H!A62))","v":0},{"$f":"IF(ISBLANK(A62), 0, SUMIFS(Registros!E:E, Registros!A:A, \">=\" & fecha_inicial, Registros!A:A, \"<=\" & fecha_final,  Registros!B:B, \"=\" & H!A62))","v":0},{"$f":"IF(ISBLANK(A62), 0, SUMIFS(Registros!F:F, Registros!A:A, \">=\" & fecha_inicial, Registros!A:A, \"<=\" & fecha_final,  Registros!B:B, \"=\" & H!A62))","v":0},0]
[null,"",{"$f":"IF(ISBLANK(A63),0, SUMIFS(Registros!F:F,Registros!A:A,\"<\"&fecha_inicial,Registros!B:B,\"=\"&H!A63)) - IF(ISBLANK(A63),0, SUMIFS(Registros!E:E,Registros!A:A,\"<\"&fecha_inicial,Registros!B:B,\"=\"&H!A63))","v":0},{"$f":"IF(ISBLANK(A63), 0, SUMIFS(Registros!E:E, Registros!A:A, \">=\" & fecha_inicial, Registros!A:A, \"<=\" & fecha_final,  Registros!B:B, \"=\" & H!A63))","v":0},{"$f":"IF(ISBLANK(A63), 0, SUMIFS(Registros!F:F, Registros!A:A, \">=\" & fecha_inicial, Registros!A:A, \"<=\" & fecha_final,  Registros!B:B, \"=\" & H!A63))","v":0},0]
[null,"",{"$f":"IF(ISBLANK(A64),0, SUMIFS(Registros!F:F,Registros!A:A,\"<\"&fecha_inicial,Registros!B:B,\"=\"&H!A64)) - IF(ISBLANK(A64),0, SUMIFS(Registros!E:E,Registros!A:A,\"<\"&fecha_inicial,Registros!B:B,\"=\"&H!A64))","v":0},{"$f":"IF(ISBLANK(A64), 0, SUMIFS(Registros!E:E, Registros!A:A, \">=\" & fecha_inicial, Registros!A:A, \"<=\" & fecha_final,  Registros!B:B, \"=\" & H!A64))","v":0},{"$f":"IF(ISBLANK(A64), 0, SUMIFS(Registros!F:F, Registros!A:A, \">=\" & fecha_inicial, Registros!A:A, \"<=\" & fecha_final,  Registros!B:B, \"=\" & H!A64))","v":0},0]
[null,"",{"$f":"IF(ISBLANK(A65),0, SUMIFS(Registros!F:F,Registros!A:A,\"<\"&fecha_inicial,Registros!B:B,\"=\"&H!A65)) - IF(ISBLANK(A65),0, SUMIFS(Registros!E:E,Registros!A:A,\"<\"&fecha_inicial,Registros!B:B,\"=\"&H!A65))","v":0},{"$f":"IF(ISBLANK(A65), 0, SUMIFS(Registros!E:E, Registros!A:A, \">=\" & fecha_inicial, Registros!A:A, \"<=\" & fecha_final,  Registros!B:B, \"=\" & H!A65))","v":0},{"$f":"IF(ISBLANK(A65), 0, SUMIFS(Registros!F:F, Registros!A:A, \">=\" & fecha_inicial, Registros!A:A, \"<=\" & fecha_final,  Registros!B:B, \"=\" & H!A65))","v":0},0]
[null,"",{"$f":"IF(ISBLANK(A66),0, SUMIFS(Registros!F:F,Registros!A:A,\"<\"&fecha_inicial,Registros!B:B,\"=\"&H!A66)) - IF(ISBLANK(A66),0, SUMIFS(Registros!E:E,Registros!A:A,\"<\"&fecha_inicial,Registros!B:B,\"=\"&H!A66))","v":0},{"$f":"IF(ISBLANK(A66), 0, SUMIFS(Registros!E:E, Registros!A:A, \">=\" & fecha_inicial, Registros!A:A, \"<=\" & fecha_final,  Registros!B:B, \"=\" & H!A66))","v":0},{"$f":"IF(ISBLANK(A66), 0, SUMIFS(Registros!F:F, Registros!A:A, \">=\" & fecha_inicial, Registros!A:A, \"<=\" & fecha_final,  Registros!B:B, \"=\" & H!A66))","v":0},0]
[null,"",{"$f":"IF(ISBLANK(A67),0, SUMIFS(Registros!F:F,Registros!A:A,\"<\"&fecha_inicial,Registros!B:B,\"=\"&H!A67)) - IF(ISBLANK(A67),0, SUMIFS(Registros!E:E,Registros!A:A,\"<\"&fecha_inicial,Registros!B:B,\"=\"&H!A67))","v":0},{"$f":"IF(ISBLANK(A67), 0, SUMIFS(Registros!E:E, Registros!A:A, \">=\" & fecha_inicial, Registros!A:A, \"<=\" & fecha_final,  Registros!B:B, \"=\" & H!A67))","v":0},{"$f":"IF(ISBLANK(A67), 0, SUMIFS(Registros!F:F, Registros!A:A, \">=\" & fecha_inicial, Registros!A:A, \"<=\" & fecha_final,  Registros!B:B, \"=\" & H!A67))","v":0},0]
[null,"",{"$f":"IF(ISBLANK(A68),0, SUMIFS(Registros!F:F,Registros!A:A,\"<\"&fecha_inicial,Registros!B:B,\"=\"&H!A68)) - IF(ISBLANK(A68),0, SUMIFS(Registros!E:E,Registros!A:A,\"<\"&fecha_inicial,Registros!B:B,\"=\"&H!A68))","v":0},{"$f":"IF(ISBLANK(A68), 0, SUMIFS(Registros!E:E, Registros!A:A, \">=\" & fecha_inicial, Registros!A:A, \"<=\" & fecha_final,  Registros!B:B, \"=\" & H!A68))","v":0},{"$f":"IF(ISBLANK(A68), 0, SUMIFS(Registros!F:F, Registros!A:A, \">=\" & fecha_inicial, Registros!A:A, \"<=\" & fecha_final,  Registros!B:B, \"=\" & H!A68))","v":0},0]
[null,"",{"$f":"IF(ISBLANK(A69),0, SUMIFS(Registros!F:F,Registros!A:A,\"<\"&fecha_inicial,Registros!B:B,\"=\"&H!A69)) - IF(ISBLANK(A69),0, SUMIFS(Registros!E:E,Registros!A:A,\"<\"&fecha_inicial,Registros!B:B,\"=\"&H!A69))","v":0},{"$f":"IF(ISBLANK(A69), 0, SUMIFS(Registros!E:E, Registros!A:A, \">=\" & fecha_inicial, Registros!A:A, \"<=\" & fecha_final,  Registros!B:B, \"=\" & H!A69))","v":0},{"$f":"IF(ISBLANK(A69), 0, SUMIFS(Registros!F:F, Registros!A:A, \">=\" & fecha_inicial, Registros!A:A, \"<=\" & fecha_final,  Registros!B:B, \"=\" & H!A69))","v":0},0]
[null,"",{"$f":"IF(ISBLANK(A70),0, SUMIFS(Registros!F:F,Registros!A:A,\"<\"&fecha_inicial,Registros!B:B,\"=\"&H!A70)) - IF(ISBLANK(A70),0, SUMIFS(Registros!E:E,Registros!A:A,\"<\"&fecha_inicial,Registros!B:B,\"=\"&H!A70))","v":0},{"$f":"IF(ISBLANK(A70), 0, SUMIFS(Registros!E:E, Registros!A:A, \">=\" & fecha_inicial, Registros!A:A, \"<=\" & fecha_final,  Registros!B:B, \"=\" & H!A70))","v":0},{"$f":"IF(ISBLANK(A70), 0, SUMIFS(Registros!F:F, Registros!A:A, \">=\" & fecha_inicial, Registros!A:A, \"<=\" & fecha_final,  Registros!B:B, \"=\" & H!A70))","v":0},0]
[null,"",{"$f":"IF(ISBLANK(A71),0, SUMIFS(Registros!F:F,Registros!A:A,\"<\"&fecha_inicial,Registros!B:B,\"=\"&H!A71)) - IF(ISBLANK(A71),0, SUMIFS(Registros!E:E,Registros!A:A,\"<\"&fecha_inicial,Registros!B:B,\"=\"&H!A71))","v":0},{"$f":"IF(ISBLANK(A71), 0, SUMIFS(Registros!E:E, Registros!A:A, \">=\" & fecha_inicial, Registros!A:A, \"<=\" & fecha_final,  Registros!B:B, \"=\" & H!A71))","v":0},{"$f":"IF(ISBLANK(A71), 0, SUMIFS(Registros!F:F, Registros!A:A, \">=\" & fecha_inicial, Registros!A:A, \"<=\" & fecha_final,  Registros!B:B, \"=\" & H!A71))","v":0},0]
[null,"",{"$f":"IF(ISBLANK(A72),0, SUMIFS(Registros!F:F,Registros!A:A,\"<\"&fecha_inicial,Registros!B:B,\"=\"&H!A72)) - IF(ISBLANK(A72),0, SUMIFS(Registros!E:E,Registros!A:A,\"<\"&fecha_inicial,Registros!B:B,\"=\"&H!A72))","v":0},{"$f":"IF(ISBLANK(A72), 0, SUMIFS(Registros!E:E, Registros!A:A, \">=\" & fecha_inicial, Registros!A:A, \"<=\" & fecha_final,  Registros!B:B, \"=\" & H!A72))","v":0},{"$f":"IF(ISBLANK(A72), 0, SUMIFS(Registros!F:F, Registros!A:A, \">=\" & fecha_inicial, Registros!A:A, \"<=\" & fecha_final,  Registros!B:B, \"=\" & H!A72))","v":0},0]
[null,"",{"$f":"IF(ISBLANK(A73),0, SUMIFS(Registros!F:F,Registros!A:A,\"<\"&fecha_inicial,Registros!B:B,\"=\"&H!A73)) - IF(ISBLANK(A73),0, SUMIFS(Registros!E:E,Registros!A:A,\"<\"&fecha_inicial,Registros!B:B,\"=\"&H!A73))","v":0},{"$f":"IF(ISBLANK(A73), 0, SUMIFS(Registros!E:E, Registros!A:A, \">=\" & fecha_inicial, Registros!A:A, \"<=\" & fecha_final,  Registros!B:B, \"=\" & H!A73))","v":0},{"$f":"IF(ISBLANK(A73), 0, SUMIFS(Registros!F:F, Registros!A:A, \">=\" & fecha_inicial, Registros!A:A, \"<=\" & fecha_final,  Registros!B:B, \"=\" & H!A73))","v":0},0]
[null,"",{"$f":"IF(ISBLANK(A74),0, SUMIFS(Registros!F:F,Registros!A:A,\"<\"&fecha_inicial,Registros!B:B,\"=\"&H!A74)) - IF(ISBLANK(A74),0, SUMIFS(Registros!E:E,Registros!A:A,\"<\"&fecha_inicial,Registros!B:B,\"=\"&H!A74))","v":0},{"$f":"IF(ISBLANK(A74), 0, SUMIFS(Registros!E:E, Registros!A:A, \">=\" & fecha_inicial, Registros!A:A, \"<=\" & fecha_final,  Registros!B:B, \"=\" & H!A74))","v":0},{"$f":"IF(ISBLANK(A74), 0, SUMIFS(Registros!F:F, Registros!A:A, \">=\" & fecha_inicial, Registros!A:A, \"<=\" & fecha_final,  Registros!B:B, \"=\" & H!A74))","v":0},0]
[{"$f":"\"SALDO FINAL DE LA CUENTA AL \" &TEXT(fecha_final, \"dd\")&\" DE \"&UPPER(TEXT(fecha_final, \"MMMM\"))&\" DEL \"& TEXT(fecha_final, \"YYYY\")","v":"SALDO FINAL DE LA CUENTA AL 00 DE ENERO DEL 1900"},null,{"$f":"C11+C27+C43+C59","v":0},{"$f":"D11+D27+D43+D59","v":0},{"$f":"E11+E27+E43+E59","v":0},{"$f":"C75-D75+E75","v":0}]
[]
[]
[]
[]
["ELABORA",null,null,null,"REVISA"]
[{"$f":"VLOOKUP(A80, Usuarios!B12:E14, 2, FALSE)","v":"Arlen de Jesús Baltodano López"},null,null,null,{"$f":"VLOOKUP(E80, Usuarios!B12:E14, 2, FALSE)","v":"Gersan Arguello Prado"}]
[{"$f":"VLOOKUP(A80, Usuarios!B12:E14, 4, FALSE)","v":"Auxiliar de Contabilidad"},null,null,null,{"$f":"VLOOKUP(E80, Usuarios!B12:E14, 4, FALSE)","v":"Contador General"}]
[]
[]
[null,null,"AUTORIZA"]
[null,null,{"$f":"VLOOKUP(C85, Usuarios!B12:E14, 2, FALSE)","v":"Matilda Padilla Mayorga"}]
[null,null,{"$f":"VLOOKUP(C85, Usuarios!B12:E14, 4, FALSE)","v":"Gerente de Finanzas"}]

{"sheet":"01","index":10,"n_rows":155,"n_cols":8,"rows_kept":155,"cut":false,"hidden":false,"merged":[[154,2,154,4],[142,0,142,1],[149,5,149,7],[150,5,150,7],[151,5,151,7],[152,2,152,4],[153,2,153,4],[2,0,2,7],[3,0,3,7],[4,0,4,7],[5,0,5,7],[7,0,8,0],[7,1,8,1],[7,2,7,3],[7,4,7,5],[7,6,7,7]]}
[]
[]
[{"$f":"nombre_empresa","v":"CONSULTORES DE OMETEPE"}]
["BALANZA DE COMPROBACIÓN DE SALDOS CONSOLIDADA"]
[{"$f":"D!A4","v":"DEL 00 DE ENERO AL 00 DE ENERO DE 1900"}]
[{"$f":"D!A5","v":"Barrio el Progreso, San Jorge, Rivas. *** Tel/Fax:  89040457 *** escribeme@radioometepe.com"}]
[]
["CODIGO DE CUENTA","NOMBRE DE LA CUENTA","SALDOS INICIALES",null,"MOVIMIENTOS DEL MES",null,"SALDOS FINALES"]
[null,null,"DEBE","HABER","DEBE","HABER","DEBE","HABER"]
[]
[1000,{"$f":"IF(ISBLANK(A11), \"\", IFERROR(VLOOKUP(A11, plan_cuentas, 2, FALSE), \"Código de cuenta incorrecto\"))","v":"ACTIVOS"},{"$f":"C12+C28+C44","v":0},null,{"$f":"E12+E28+E44","v":0},{"$f":"F12+F28+F44","v":0},{"$f":"G12+G28+G44","v":0}]
[1100,"ACTIVOS CIRCULANTES",{"$f":"SUM(C13:C27)","v":0},null,{"$f":"SUM(E13:E27)","v":0},{"$f":"SUM(F13:F27)","v":0},{"$f":"SUM(G13:G27)","v":0}]
[1101,"CAJA",{"$f":"IF(ISBLANK(A13),0, SUMIFS(Registros!E:E,Registros!A:A,\"<\"&fecha_inicial,Registros!B:B,\"=\"&A13)) - IF(ISBLANK(A13),0, SUMIFS(Registros!F:F,Registros!A:A,\"<\"&fecha_inicial,Registros!B:B,\"=\"&A13))","v":0},null,{"$f":"IF(ISBLANK(A13), 0, SUMIFS(Registros!E:E, Registros!A:A, \">=\" & fecha_inicial, Registros!A:A, \"<=\" & fecha_final,  Registros!B:B, \"=\" & A13))","v":0},{"$f":"IF(ISBLANK(A13), 0, SUMIFS(Registros!F:F, Registros!A:A, \">=\" & fecha_inicial, Registros!A:A, \"<=\" & fecha_final,  Registros!B:B, \"=\" & A13))","v":0},{"$f":"C13+E13-F13","v":0}]
[1102,"FONDO FIJO DE CAJA CHICA",{"$f":"IF(ISBLANK(A14),0, SUMIFS(Registros!E:E,Registros!A:A,\"<\"&fecha_inicial,Registros!B:B,\"=\"&A14)) - IF(ISBLANK(A14),0, SUMIFS(Registros!F:F,Registros!A:A,\"<\"&fecha_inicial,Registros!B:B,\"=\"&A14))","v":0},null,{"$f":"IF(ISBLANK(A14), 0, SUMIFS(Registros!E:E, Registros!A:A, \">=\" & fecha_inicial, Registros!A:A, \"<=\" & fecha_final,  Registros!B:B, \"=\" & A14))","v":0},{"$f":"IF(ISBLANK(A14), 0, SUMIFS(Registros!F:F, Registros!A:A, \">=\" & fecha_inicial, Registros!A:A, \"<=\" & fecha_final,  Registros!B:B, \"=\" & A14))","v":0},{"$f":"C14+E14-F14","v":0}]
[1103,"BANCOS",{"$f":"IF(ISBLANK(A15),0, SUMIFS(Registros!E:E,Registros!A:A,\"<\"&fecha_inicial,Registros!B:B,\"=\"&A15)) - IF(ISBLANK(A15),0, SUMIFS(Registros!F:F,Registros!A:A,\"<\"&fecha_inicial,Registros!B:B,\"=\"&A15))","v":0},null,{"$f":"IF(ISBLANK(A15), 0, SUMIFS(Registros!E:E, Registros!A:A, \">=\" & fecha_inicial, Registros!A:A, \"<=\" & fecha_final,  Registros!B:B, \"=\" & A15))","v":0},{"$f":"IF(ISBLANK(A15), 0, SUMIFS(Registros!F:F, Registros!A:A, \">=\" & fecha_inicial, Registros!A:A, \"<=\" & fecha_final,  Registros!B:B, \"=\" & A15))","v":0},0]
[1104,"INVERSIONES TEMPORALES",{"$f":"IF(ISBLANK(A16),0, SUMIFS(Registros!E:E,Registros!A:A,\"<\"&fecha_inicial,Registros!B:B,\"=\"&A16)) - IF(ISBLANK(A16),0, SUMIFS(Registros!F:F,Registros!A:A,\"<\"&fecha_inicial,Registros!B:B,\"=\"&A16))","v":0},null,{"$f":"IF(ISBLANK(A16), 0, SUMIFS(Registros!E:E, Registros!A:A, \">=\" & fecha_inicial, Registros!A:A, \"<=\" & fecha_final,  Registros!B:B, \"=\" & A16))","v":0},{"$f":"IF(ISBLANK(A16), 0, SUMIFS(Registros!F:F, Registros!A:A, \">=\" & fecha_inicial, Registros!A:A, \"<=\" & fecha_final,  Registros!B:B, \"=\" & A16))","v":0},0]
[1105,"CLIENTES",{"$f":"IF(ISBLANK(A17),0, SUMIFS(Registros!E:E,Registros!A:A,\"<\"&fecha_inicial,Registros!B:B,\"=\"&A17)) - IF(ISBLANK(A17),0, SUMIFS(Registros!F:F,Registros!A:A,\"<\"&fecha_inicial,Registros!B:B,\"=\"&A17))","v":0},null,{"$f":"IF(ISBLANK(A17), 0, SUMIFS(Registros!E:E, Registros!A:A, \">=\" & fecha_inicial, Registros!A:A, \"<=\" & fecha_final,  Registros!B:B, \"=\" & A17))","v":0},{"$f":"IF(ISBLANK(A17), 0, SUMIFS(Registros!F:F, Registros!A:A, \">=\" & fecha_inicial, Registros!A:A, \"<=\" & fecha_final,  Registros!B:B, \"=\" & A17))","v":0},0]
[1106,"DOCUMENTOS POR COBRAR",{"$f":"IF(ISBLANK(A18),0, SUMIFS(Registros!E:E,Registros!A:A,\"<\"&fecha_inicial,Registros!B:B,\"=\"&A18)) - IF(ISBLANK(A18),0, SUMIFS(Registros!F:F,Registros!A:A,\"<\"&fecha_inicial,Registros!B:B,\"=\"&A18))","v":0},null,{"$f":"IF(ISBLANK(A18), 0, SUMIFS(Registros!E:E, Registros!A:A, \">=\" & fecha_inicial, Registros!A:A, \"<=\" & fecha_final,  Registros!B:B, \"=\" & A18))","v":0},{"$f":"IF(ISBLANK(A18), 0, SUMIFS(Registros!F:F, Registros!A:A, \">=\" & fecha_inicial, Registros!A:A, \"<=\" & fecha_final,  Registros!B:B, \"=\" & A18))","v":0},0]
[1107,"CUENTAS POR COBRAR A EMPLEADOS",{"$f":"IF(ISBLANK(A19),0, SUMIFS(Registros!E:E,Registros!A:A,\"<\"&fecha_inicial,Registros!B:B,\"=\"&A19)) - IF(ISBLANK(A19),0, SUMIFS(Registros!F:F,Registros!A:A,\"<\"&fecha_inicial,Registros!B:B,\"=\"&A19))","v":0},null,{"$f":"IF(ISBLANK(A19), 0, SUMIFS(Registros!E:E, Registros!A:A, \">=\" & fecha_inicial, Registros!A:A, \"<=\" & fecha_final,  Registros!B:B, \"=\" & A19))","v":0},{"$f":"IF(ISBLANK(A19), 0, SUMIFS(Registros!F:F, Registros!A:A, \">=\" & fecha_inicial, Registros!A:A, \"<=\" & fecha_final,  Registros!B:B, \"=\" & A19))","v":0},0]
[1108,"IVA ACREDITABLE",{"$f":"IF(ISBLANK(A20),0, SUMIFS(Registros!E:E,Registros!A:A,\"<\"&fecha_inicial,Registros!B:B,\"=\"&A20)) - IF(ISBLANK(A20),0, SUMIFS(Registros!F:F,Registros!A:A,\"<\"&fecha_inicial,Registros!B:B,\"=\"&A20))","v":0},null,{"$f":"IF(ISBLANK(A20), 0, SUMIFS(Registros!E:E, Registros!A:A, \">=\" & fecha_inicial, Registros!A:A, \"<=\" & fecha_final,  Registros!B:B, \"=\" & A20))","v":0},{"$f":"IF(ISBLANK(A20), 0, SUMIFS(Registros!F:F, Registros!A:A, \">=\" & fecha_inicial, Registros!A:A, \"<=\" & fecha_final,  Registros!B:B, \"=\" & A20))","v":0},0]
[1109,"ANTICIPO DE IMPUESTOS",{"$f":"IF(ISBLANK(A21),0, SUMIFS(Registros!E:E,Registros!A:A,\"<\"&fecha_inicial,Registros!B:B,\"=\"&A21)) - IF(ISBLANK(A21),0, SUMIFS(Registros!F:F,Registros!A:A,\"<\"&fecha_inicial,Registros!B:B,\"=\"&A21))","v":0},null,{"$f":"IF(ISBLANK(A21), 0, SUMIFS(Registros!E:E, Registros!A:A, \">=\" & fecha_inicial, Registros!A:A, \"<=\" & fecha_final,  Registros!B:B, \"=\" & A21))","v":0},{"$f":"IF(ISBLANK(A21), 0, SUMIFS(Registros!F:F, Registros!A:A, \">=\" & fecha_inicial, Registros!A:A, \"<=\" & fecha_final,  Registros!B:B, \"=\" & A21))","v":0},0]
[1110,"INVENTARIOS",{"$f":"IF(ISBLANK(A22),0, SUMIFS(Registros!E:E,Registros!A:A,\"<\"&fecha_inicial,Registros!B:B,\"=\"&A22)) - IF(ISBLANK(A22),0, SUMIFS(Registros!F:F,Registros!A:A,\"<\"&fecha_inicial,Registros!B:B,\"=\"&A22))","v":0},null,{"$f":"IF(ISBLANK(A22), 0, SUMIFS(Registros!E:E, Registros!A:A, \">=\" & fecha_inicial, Registros!A:A, \"<=\" & fecha_final,  Registros!B:B, \"=\" & A22))","v":0},{"$f":"IF(ISBLANK(A22), 0, SUMIFS(Registros!F:F, Registros!A:A, \">=\" & fecha_inicial, Registros!A:A, \"<=\" & fecha_final,  Registros!B:B, \"=\" & A22))","v":0},0]
[1111,"ANTICIPO A PROVEEDORES",{"$f":"IF(ISBLANK(A23),0, SUMIFS(Registros!E:E,Registros!A:A,\"<\"&fecha_inicial,Registros!B:B,\"=\"&A23)) - IF(ISBLANK(A23),0, SUMIFS(Registros!F:F,Registros!A:A,\"<\"&fecha_inicial,Registros!B:B,\"=\"&A23))","v":0},null,{"$f":"IF(ISBLANK(A23), 0, SUMIFS(Registros!E:E, Registros!A:A, \">=\" & fecha_inicial, Registros!A:A, \"<=\" & fecha_final,  Registros!B:B, \"=\" & A23))","v":0},{"$f":"IF(ISBLANK(A23), 0, SUMIFS(Registros!F:F, Registros!A:A, \">=\" & fecha_inicial, Registros!A:A, \"<=\" & fecha_final,  Registros!B:B, \"=\" & A23))","v":0},0]
[1112,"RENTAS PAGADAS POR ANTICIPADO",{"$f":"IF(ISBLANK(A24),0, SUMIFS(Registros!E:E,Registros!A:A,\"<\"&fecha_inicial,Registros!B:B,\"=\"&A24)) - IF(ISBLANK(A24),0, SUMIFS(Registros!F:F,Registros!A:A,\"<\"&fecha_inicial,Registros!B:B,\"=\"&A24))","v":0},null,{"$f":"IF(ISBLANK(A24), 0, SUMIFS(Registros!E:E, Registros!A:A, \">=\" & fecha_inicial, Registros!A:A, \"<=\" & fecha_final,  Registros!B:B, \"=\" & A24))","v":0},{"$f":"IF(ISBLANK(A24), 0, SUMIFS(Registros!F:F, Registros!A:A, \">=\" & fecha_inicial, Registros!A:A, \"<=\" & fecha_final,  Registros!B:B, \"=\" & A24))","v":0},0]
[1113,"INTERESES PAGADOS POR ANTICIPADO",{"$f":"IF(ISBLANK(A25),0, SUMIFS(Registros!E:E,Registros!A:A,\"<\"&fecha_inicial,Registros!B:B,\"=\"&A25)) - IF(ISBLANK(A25),0, SUMIFS(Registros!F:F,Registros!A:A,\"<\"&fecha_inicial,Registros!B:B,\"=\"&A25))","v":0},null,{"$f":"IF(ISBLANK(A25), 0, SUMIFS(Registros!E:E, Registros!A:A, \">=\" & fecha_inicial, Registros!A:A, \"<=\" & fecha_final,  Registros!B:B, \"=\" & A25))","v":0},{"$f":"IF(ISBLANK(A25), 0, SUMIFS(Registros!F:F, Registros!A:A, \">=\" & fecha_inicial, Registros!A:A, \"<=\" & fecha_final,  Registros!B:B, \"=\" & A25))","v":0},0]
[1114,"Código de cuenta incorrecto",{"$f":"IF(ISBLANK(A26),0, SUMIFS(Registros!E:E,Registros!A:A,\"<\"&fecha_inicial,Registros!B:B,\"=\"&A26)) - IF(ISBLANK(A26),0, SUMIFS(Registros!F:F,Registros!A:A,\"<\"&fecha_inicial,Registros!B:B,\"=\"&A26))","v":0},null,{"$f":"IF(ISBLANK(A26), 0, SUMIFS(Registros!E:E, Registros!A:A, \">=\" & fecha_inicial, Registros!A:A, \"<=\" & fecha_final,  Registros!B:B, \"=\" & A26))","v":0},{"$f":"IF(ISBLANK(A26), 0, SUMIFS(Registros!F:F, Registros!A:A, \">=\" & fecha_inicial, Registros!A:A, \"<=\" & fecha_final,  Registros!B:B, \"=\" & A26))","v":0},0]
[1115,"Código de cuenta incorrecto",{"$f":"IF(ISBLANK(A27),0, SUMIFS(Registros!E:E,Registros!A:A,\"<\"&fecha_inicial,Registros!B:B,\"=\"&A27)) - IF(ISBLANK(A27),0, SUMIFS(Registros!F:F,Registros!A:A,\"<\"&fecha_inicial,Registros!B:B,\"=\"&A27))","v":0},null,{"$f":"IF(ISBLANK(A27), 0, SUMIFS(Registros!E:E, Registros!A:A, \">=\" & fecha_inicial, Registros!A:A, \"<=\" & fecha_final,  Registros!B:B, \"=\" & A27))","v":0},{"$f":"IF(ISBLANK(A27), 0, SUMIFS(Registros!F:F, Registros!A:A, \">=\" & fecha_inicial, Registros!A:A, \"<=\" & fecha_final,  Registros!B:B, \"=\" & A27))","v":0},0]
[1200,"ACTIVOS FIJOS",{"$f":"SUM(C29:C43)","v":0},null,{"$f":"SUM(E29:E43)","v":0},{"$f":"SUM(F29:F43)","v":0},{"$f":"SUM(G29:G43)","v":0}]
[1201,"TERRENOS",{"$f":"IF(ISBLANK(A29),0, SUMIFS(Registros!E:E,Registros!A:A,\"<\"&fecha_inicial,Registros!B:B,\"=\"&A29)) - IF(ISBLANK(A29),0, SUMIFS(Registros!F:F,Registros!A:A,\"<\"&fecha_inicial,Registros!B:B,\"=\"&A29))","v":0},null,{"$f":"IF(ISBLANK(A29), 0, SUMIFS(Registros!E:E, Registros!A:A, \">=\" & fecha_inicial, Registros!A:A, \"<=\" & fecha_final,  Registros!B:B, \"=\" & A29))","v":0},{"$f":"IF(ISBLANK(A29), 0, SUMIFS(Registros!F:F, Registros!A:A, \">=\" & fecha_inicial, Registros!A:A, \"<=\" & fecha_final,  Registros!B:B, \"=\" & A29))","v":0},{"$f":"C29+E29-F29","v":0}]
[1202,"EDIFICIOS",{"$f":"IF(ISBLANK(A30),0, SUMIFS(Registros!E:E,Registros!A:A,\"<\"&fecha_inicial,Registros!B:B,\"=\"&A30)) - IF(ISBLANK(A30),0, SUMIFS(Registros!F:F,Registros!A:A,\"<\"&fecha_inicial,Registros!B:B,\"=\"&A30))","v":0},null,{"$f":"IF(ISBLANK(A30), 0, SUMIFS(Registros!E:E, Registros!A:A, \">=\" & fecha_inicial, Registros!A:A, \"<=\" & fecha_final,  Registros!B:B, \"=\" & A30))","v":0},{"$f":"IF(ISBLANK(A30), 0, SUMIFS(Registros!F:F, Registros!A:A, \">=\" & fecha_inicial, Registros!A:A, \"<=\" & fecha_final,  Registros!B:B, \"=\" & A30))","v":0},{"$f":"C30+E30-F30","v":0}]
[1203,"MAQUINARIA",{"$f":"IF(ISBLANK(A31),0, SUMIFS(Registros!E:E,Registros!A:A,\"<\"&fecha_inicial,Registros!B:B,\"=\"&A31)) - IF(ISBLANK(A31),0, SUMIFS(Registros!F:F,Registros!A:A,\"<\"&fecha_inicial,Registros!B:B,\"=\"&A31))","v":0},null,{"$f":"IF(ISBLANK(A31), 0, SUMIFS(Registros!E:E, Registros!A:A, \">=\" & fecha_inicial, Registros!A:A, \"<=\" & fecha_final,  Registros!B:B, \"=\" & A31))","v":0},{"$f":"IF(ISBLANK(A31), 0, SUMIFS(Registros!F:F, Registros!A:A, \">=\" & fecha_inicial, Registros!A:A, \"<=\" & fecha_final,  Registros!B:B, \"=\" & A31))","v":0},0]
[1204,"MOBILIARIO Y EQUIPO DE OFICINA",{"$f":"IF(ISBLANK(A32),0, SUMIFS(Registros!E:E,Registros!A:A,\"<\"&fecha_inicial,Registros!B:B,\"=\"&A32)) - IF(ISBLANK(A32),0, SUMIFS(Registros!F:F,Registros!A:A,\"<\"&fecha_inicial,Registros!B:B,\"=\"&A32))","v":0},null,{"$f":"IF(ISBLANK(A32), 0, SUMIFS(Registros!E:E, Registros!A:A, \">=\" & fecha_inicial, Registros!A:A, \"<=\" & fecha_final,  Registros!B:B, \"=\" & A32))","v":0},{"$f":"IF(ISBLANK(A32), 0, SUMIFS(Registros!F:F, Registros!A:A, \">=\" & fecha_inicial, Registros!A:A, \"<=\" & fecha_final,  Registros!B:B, \"=\" & A32))","v":0},0]
[1205,"MUEBLES Y ENSERES",{"$f":"IF(ISBLANK(A33),0, SUMIFS(Registros!E:E,Registros!A:A,\"<\"&fecha_inicial,Registros!B:B,\"=\"&A33)) - IF(ISBLANK(A33),0, SUMIFS(Registros!F:F,Registros!A:A,\"<\"&fecha_inicial,Registros!B:B,\"=\"&A33))","v":0},null,{"$f":"IF(ISBLANK(A33), 0, SUMIFS(Registros!E:E, Registros!A:A, \">=\" & fecha_inicial, Registros!A:A, \"<=\" & fecha_final,  Registros!B:B, \"=\" & A33))","v":0},{"$f":"IF(ISBLANK(A33), 0, SUMIFS(Registros!F:F, Registros!A:A, \">=\" & fecha_inicial, Registros!A:A, \"<=\" & fecha_final,  Registros!B:B, \"=\" & A33))","v":0},0]
[1206,"EQUIPO DE TRANSPORTE",{"$f":"IF(ISBLANK(A34),0, SUMIFS(Registros!E:E,Registros!A:A,\"<\"&fecha_inicial,Registros!B:B,\"=\"&A34)) - IF(ISBLANK(A34),0, SUMIFS(Registros!F:F,Registros!A:A,\"<\"&fecha_inicial,Registros!B:B,\"=\"&A34))","v":0},null,{"$f":"IF(ISBLANK(A34), 0, SUMIFS(Registros!E:E, Registros!A:A, \">=\" & fecha_inicial, Registros!A:A, \"<=\" & fecha_final,  Registros!B:B, \"=\" & A34))","v":0},{"$f":"IF(ISBLANK(A34), 0, SUMIFS(Registros!F:F, Registros!A:A, \">=\" & fecha_inicial, Registros!A:A, \"<=\" & fecha_final,  Registros!B:B, \"=\" & A34))","v":0},0]
[1207,"EQUIPO DE ENTREGA Y REPARTO",{"$f":"IF(ISBLANK(A35),0, SUMIFS(Registros!E:E,Registros!A:A,\"<\"&fecha_inicial,Registros!B:B,\"=\"&A35)) - IF(ISBLANK(A35),0, SUMIFS(Registros!F:F,Registros!A:A,\"<\"&fecha_inicial,Registros!B:B,\"=\"&A35))","v":0},null,{"$f":"IF(ISBLANK(A35), 0, SUMIFS(Registros!E:E, Registros!A:A, \">=\" & fecha_inicial, Registros!A:A, \"<=\" & fecha_final,  Registros!B:B, \"=\" & A35))","v":0},{"$f":"IF(ISBLANK(A35), 0, SUMIFS(Registros!F:F, Registros!A:A, \">=\" & fecha_inicial, Registros!A:A, \"<=\" & fecha_final,  Registros!B:B, \"=\" & A35))","v":0},0]
[1208,"Código de cuenta incorrecto",{"$f":"IF(ISBLANK(A36),0, SUMIFS(Registros!E:E,Registros!A:A,\"<\"&fecha_inicial,Registros!B:B,\"=\"&A36)) - IF(ISBLANK(A36),0, SUMIFS(Registros!F:F,Registros!A:A,\"<\"&fecha_inicial,Registros!B:B,\"=\"&A36))","v":0},null,{"$f":"IF(ISBLANK(A36), 0, SUMIFS(Registros!E:E, Registros!A:A, \">=\" & fecha_inicial, Registros!A:A, \"<=\" & fecha_final,  Registros!B:B, \"=\" & A36))","v":0},{"$f":"IF(ISBLANK(A36), 0, SUMIFS(Registros!F:F, Registros!A:A, \">=\" & fecha_inicial, Registros!A:A, \"<=\" & fecha_final,  Registros!B:B, \"=\" & A36))","v":0},0]
[1209,"Código de cuenta incorrecto",{"$f":"IF(ISBLANK(A37),0, SUMIFS(Registros!E:E,Registros!A:A,\"<\"&fecha_inicial,Registros!B:B,\"=\"&A37)) - IF(ISBLANK(A37),0, SUMIFS(Registros!F:F,Registros!A:A,\"<\"&fecha_inicial,Registros!B:B,\"=\"&A37))","v":0},null,{"$f":"IF(ISBLANK(A37), 0, SUMIFS(Registros!E:E, Registros!A:A, \">=\" & fecha_inicial, Registros!A:A, \"<=\" & fecha_final,  Registros!B:B, \"=\" & A37))","v":0},{"$f":"IF(ISBLANK(A37), 0, SUMIFS(Registros!F:F, Registros!A:A, \">=\" & fecha_inicial, Registros!A:A, \"<=\" & fecha_final,  Registros!B:B, \"=\" & A37))","v":0},0]
[1210,"Código de cuenta incorrecto",{"$f":"IF(ISBLANK(A38),0, SUMIFS(Registros!E:E,Registros!A:A,\"<\"&fecha_inicial,Registros!B:B,\"=\"&A38)) - IF(ISBLANK(A38),0, SUMIFS(Registros!F:F,Registros!A:A,\"<\"&fecha_inicial,Registros!B:B,\"=\"&A38))","v":0},null,{"$f":"IF(ISBLANK(A38), 0, SUMIFS(Registros!E:E, Registros!A:A, \">=\" & fecha_inicial, Registros!A:A, \"<=\" & fecha_final,  Registros!B:B, \"=\" & A38))","v":0},{"$f":"IF(ISBLANK(A38), 0, SUMIFS(Registros!F:F, Registros!A:A, \">=\" & fecha_inicial, Registros!A:A, \"<=\" & fecha_final,  Registros!B:B, \"=\" & A38))","v":0},0]
[1211,"Código de cuenta incorrecto",{"$f":"IF(ISBLANK(A39),0, SUMIFS(Registros!E:E,Registros!A:A,\"<\"&fecha_inicial,Registros!B:B,\"=\"&A39)) - IF(ISBLANK(A39),0, SUMIFS(Registros!F:F,Registros!A:A,\"<\"&fecha_inicial,Registros!B:B,\"=\"&A39))","v":0},null,{"$f":"IF(ISBLANK(A39), 0, SUMIFS(Registros!E:E, Registros!A:A, \">=\" & fecha_inicial, Registros!A:A, \"<=\" & fecha_final,  Registros!B:B, \"=\" & A39))","v":0},{"$f":"IF(ISBLANK(A39), 0, SUMIFS(Registros!F:F, Registros!A:A, \">=\" & fecha_inicial, Registros!A:A, \"<=\" & fecha_final,  Registros!B:B, \"=\" & A39))","v":0},0]
[1212,"Código de cuenta incorrecto",{"$f":"IF(ISBLANK(A40),0, SUMIFS(Registros!E:E,Registros!A:A,\"<\"&fecha_inicial,Registros!B:B,\"=\"&A40)) - IF(ISBLANK(A40),0, SUMIFS(Registros!F:F,Registros!A:A,\"<\"&fecha_inicial,Registros!B:B,\"=\"&A40))","v":0},null,{"$f":"IF(ISBLANK(A40), 0, SUMIFS(Registros!E:E, Registros!A:A, \">=\" & fecha_inicial, Registros!A:A, \"<=\" & fecha_final,  Registros!B:B, \"=\" & A40))","v":0},{"$f":"IF(ISBLANK(A40), 0, SUMIFS(Registros!F:F, Registros!A:A, \">=\" & fecha_inicial, Registros!A:A, \"<=\" & fecha_final,  Registros!B:B, \"=\" & A40))","v":0},0]
[1213,"Código de cuenta incorrecto",{"$f":"IF(ISBLANK(A41),0, SUMIFS(Registros!E:E,Registros!A:A,\"<\"&fecha_inicial,Registros!B:B,\"=\"&A41)) - IF(ISBLANK(A41),0, SUMIFS(Registros!F:F,Registros!A:A,\"<\"&fecha_inicial,Registros!B:B,\"=\"&A41))","v":0},null,{"$f":"IF(ISBLANK(A41), 0, SUMIFS(Registros!E:E, Registros!A:A, \">=\" & fecha_inicial, Registros!A:A, \"<=\" & fecha_final,  Registros!B:B, \"=\" & A41))","v":0},{"$f":"IF(ISBLANK(A41), 0, SUMIFS(Registros!F:F, Registros!A:A, \">=\" & fecha_inicial, Registros!A:A, \"<=\" & fecha_final,  Registros!B:B, \"=\" & A41))","v":0},0]
[1214,"Código de cuenta incorrecto",{"$f":"IF(ISBLANK(A42),0, SUMIFS(Registros!E:E,Registros!A:A,\"<\"&fecha_inicial,Registros!B:B,\"=\"&A42)) - IF(ISBLANK(A42),0, SUMIFS(Registros!F:F,Registros!A:A,\"<\"&fecha_inicial,Registros!B:B,\"=\"&A42))","v":0},null,{"$f":"IF(ISBLANK(A42), 0, SUMIFS(Registros!E:E, Registros!A:A, \">=\" & fecha_inicial, Registros!A:A, \"<=\" & fecha_final,  Registros!B:B, \"=\" & A42))","v":0},{"$f":"IF(ISBLANK(A42), 0, SUMIFS(Registros!F:F, Registros!A:A, \">=\" & fecha_inicial, Registros!A:A, \"<=\" & fecha_final,  Registros!B:B, \"=\" & A42))","v":0},0]
[1215,"Código de cuenta incorrecto",{"$f":"IF(ISBLANK(A43),0, SUMIFS(Registros!E:E,Registros!A:A,\"<\"&fecha_inicial,Registros!B:B,\"=\"&A43)) - IF(ISBLANK(A43),0, SUMIFS(Registros!F:F,Registros!A:A,\"<\"&fecha_inicial,Registros!B:B,\"=\"&A43))","v":0},null,{"$f":"IF(ISBLANK(A43), 0, SUMIFS(Registros!E:E, Registros!A:A, \">=\" & fecha_inicial, Registros!A:A, \"<=\" & fecha_final,  Registros!B:B, \"=\" & A43))","v":0},{"$f":"IF(ISBLANK(A43), 0, SUMIFS(Registros!F:F, Registros!A:A, \">=\" & fecha_inicial, Registros!A:A, \"<=\" & fecha_final,  Registros!B:B, \"=\" & A43))","v":0},{"$f":"C43+E43-F43","v":0}]
[1300,"ACTIVOS INTANGIBLES",{"$f":"SUM(C45:C59)","v":0},null,{"$f":"SUM(E45:E59)","v":0},{"$f":"SUM(F45:F59)","v":0},{"$f":"SUM(G45:G59)","v":0}]
[1301,"DERECHOS DE AUTOR",{"$f":"IF(ISBLANK(A45),0, SUMIFS(Registros!E:E,Registros!A:A,\"<\"&fecha_inicial,Registros!B:B,\"=\"&A45)) - IF(ISBLANK(A45),0, SUMIFS(Registros!F:F,Registros!A:A,\"<\"&fecha_inicial,Registros!B:B,\"=\"&A45))","v":0},null,{"$f":"IF(ISBLANK(A45), 0, SUMIFS(Registros!E:E, Registros!A:A, \">=\" & fecha_inicial, Registros!A:A, \"<=\" & fecha_final,  Registros!B:B, \"=\" & A45))","v":0},{"$f":"IF(ISBLANK(A45), 0, SUMIFS(Registros!F:F, Registros!A:A, \">=\" & fecha_inicial, Registros!A:A, \"<=\" & fecha_final,  Registros!B:B, \"=\" & A45))","v":0},{"$f":"C45+E45-F45","v":0}]
[1302,"PATENTES",{"$f":"IF(ISBLANK(A46),0, SUMIFS(Registros!E:E,Registros!A:A,\"<\"&fecha_inicial,Registros!B:B,\"=\"&A46)) - IF(ISBLANK(A46),0, SUMIFS(Registros!F:F,Registros!A:A,\"<\"&fecha_inicial,Registros!B:B,\"=\"&A46))","v":0},null,{"$f":"IF(ISBLANK(A46), 0, SUMIFS(Registros!E:E, Registros!A:A, \">=\" & fecha_inicial, Registros!A:A, \"<=\" & fecha_final,  Registros!B:B, \"=\" & A46))","v":0},{"$f":"IF(ISBLANK(A46), 0, SUMIFS(Registros!F:F, Registros!A:A, \">=\" & fecha_inicial, Registros!A:A, \"<=\" & fecha_final,  Registros!B:B, \"=\" & A46))","v":0},{"$f":"C46+E46-F46","v":0}]
[1303,"MARCAS REGISTRADAS",{"$f":"IF(ISBLANK(A47),0, SUMIFS(Registros!E:E,Registros!A:A,\"<\"&fecha_inicial,Registros!B:B,\"=\"&A47)) - IF(ISBLANK(A47),0, SUMIFS(Registros!F:F,Registros!A:A,\"<\"&fecha_inicial,Registros!B:B,\"=\"&A47))","v":0},null,{"$f":"IF(ISBLANK(A47), 0, SUMIFS(Registros!E:E, Registros!A:A, \">=\" & fecha_inicial, Registros!A:A, \"<=\" & fecha_final,  Registros!B:B, \"=\" & A47))","v":0},{"$f":"IF(ISBLANK(A47), 0, SUMIFS(Registros!F:F, Registros!A:A, \">=\" & fecha_inicial, Registros!A:A, \"<=\" & fecha_final,  Registros!B:B, \"=\" & A47))","v":0},0]
[1304,"NOMBRES COMERCIALES",{"$f":"IF(ISBLANK(A48),0, SUMIFS(Registros!E:E,Registros!A:A,\"<\"&fecha_inicial,Registros!B:B,\"=\"&A48)) - IF(ISBLANK(A48),0, SUMIFS(Registros!F:F,Registros!A:A,\"<\"&fecha_inicial,Registros!B:B,\"=\"&A48))","v":0},null,{"$f":"IF(ISBLANK(A48), 0, SUMIFS(Registros!E:E, Registros!A:A, \">=\" & fecha_inicial, Registros!A:A, \"<=\" & fecha_final,  Registros!B:B, \"=\" & A48))","v":0},{"$f":"IF(ISBLANK(A48), 0, SUMIFS(Registros!F:F, Registros!A:A, \">=\" & fecha_inicial, Registros!A:A, \"<=\" & fecha_final,  Registros!B:B, \"=\" & A48))","v":0},0]
[1305,"CRÉDITO MERCANTIL",{"$f":"IF(ISBLANK(A49),0, SUMIFS(Registros!E:E,Registros!A:A,\"<\"&fecha_inicial,Registros!B:B,\"=\"&A49)) - IF(ISBLANK(A49),0, SUMIFS(Registros!F:F,Registros!A:A,\"<\"&fecha_inicial,Registros!B:B,\"=\"&A49))","v":0},null,{"$f":"IF(ISBLANK(A49), 0, SUMIFS(Registros!E:E, Registros!A:A, \">=\" & fecha_inicial, Registros!A:A, \"<=\" & fecha_final,  Registros!B:B, \"=\" & A49))","v":0},{"$f":"IF(ISBLANK(A49), 0, SUMIFS(Registros!F:F, Registros!A:A, \">=\" & fecha_inicial, Registros!A:A, \"<=\" & fecha_final,  Registros!B:B, \"=\" & A49))","v":0},0]
[1306,"GASTOS DE CONSTITUCIÓN",{"$f":"IF(ISBLANK(A50),0, SUMIFS(Registros!E:E,Registros!A:A,\"<\"&fecha_inicial,Registros!B:B,\"=\"&A50)) - IF(ISBLANK(A50),0, SUMIFS(Registros!F:F,Registros!A:A,\"<\"&fecha_inicial,Registros!B:B,\"=\"&A50))","v":0},null,{"$f":"IF(ISBLANK(A50), 0, SUMIFS(Registros!E:E, Registros!A:A, \">=\" & fecha_inicial, Registros!A:A, \"<=\" & fecha_final,  Registros!B:B, \"=\" & A50))","v":0},{"$f":"IF(ISBLANK(A50), 0, SUMIFS(Registros!F:F, Registros!A:A, \">=\" & fecha_inicial, Registros!A:A, \"<=\" & fecha_final,  Registros!B:B, \"=\" & A50))","v":0},0]
[1307,"GASTOS DE ORGANIZACIÓN",{"$f":"IF(ISBLANK(A51),0, SUMIFS(Registros!E:E,Registros!A:A,\"<\"&fecha_inicial,Registros!B:B,\"=\"&A51)) - IF(ISBLANK(A51),0, SUMIFS(Registros!F:F,Registros!A:A,\"<\"&fecha_inicial,Registros!B:B,\"=\"&A51))","v":0},null,{"$f":"IF(ISBLANK(A51), 0, SUMIFS(Registros!E:E, Registros!A:A, \">=\" & fecha_inicial, Registros!A:A, \"<=\" & fecha_final,  Registros!B:B, \"=\" & A51))","v":0},{"$f":"IF(ISBLANK(A51), 0, SUMIFS(Registros!F:F, Registros!A:A, \">=\" & fecha_inicial, Registros!A:A, \"<=\" & fecha_final,  Registros!B:B, \"=\" & A51))","v":0},0]
[1308,"GASTOS DE INSTALACIÓN",{"$f":"IF(ISBLANK(A52),0, SUMIFS(Registros!E:E,Registros!A:A,\"<\"&fecha_inicial,Registros!B:B,\"=\"&A52)) - IF(ISBLANK(A52),0, SUMIFS(Registros!F:F,Registros!A:A,\"<\"&fecha_inicial,Registros!B:B,\"=\"&A52))","v":0},null,{"$f":"IF(ISBLANK(A52), 0, SUMIFS(Registros!E:E, Registros!A:A, \">=\" & fecha_inicial, Registros!A:A, \"<=\" & fecha_final,  Registros!B:B, \"=\" & A52))","v":0},{"$f":"IF(ISBLANK(A52), 0, SUMIFS(Registros!F:F, Registros!A:A, \">=\" & fecha_inicial, Registros!A:A, \"<=\" & fecha_final,  Registros!B:B, \"=\" & A52))","v":0},0]
[1309,"GASTOS DE INVESTIGACIÓN",{"$f":"IF(ISBLANK(A53),0, SUMIFS(Registros!E:E,Registros!A:A,\"<\"&fecha_inicial,Registros!B:B,\"=\"&A53)) - IF(ISBLANK(A53),0, SUMIFS(Registros!F:F,Registros!A:A,\"<\"&fecha_inicial,Registros!B:B,\"=\"&A53))","v":0},null,{"$f":"IF(ISBLANK(A53), 0, SUMIFS(Registros!E:E, Registros!A:A, \">=\" & fecha_inicial, Registros!A:A, \"<=\" & fecha_final,  Registros!B:B, \"=\" & A53))","v":0},{"$f":"IF(ISBLANK(A53), 0, SUMIFS(Registros!F:F, Registros!A:A, \">=\" & fecha_inicial, Registros!A:A, \"<=\" & fecha_final,  Registros!B:B, \"=\" & A53))","v":0},0]
[1310,"Código de cuenta incorrecto",{"$f":"IF(ISBLANK(A54),0, SUMIFS(Registros!E:E,Registros!A:A,\"<\"&fecha_inicial,Registros!B:B,\"=\"&A54)) - IF(ISBLANK(A54),0, SUMIFS(Registros!F:F,Registros!A:A,\"<\"&fecha_inicial,Registros!B:B,\"=\"&A54))","v":0},null,{"$f":"IF(ISBLANK(A54), 0, SUMIFS(Registros!E:E, Registros!A:A, \">=\" & fecha_inicial, Registros!A:A, \"<=\" & fecha_final,  Registros!B:B, \"=\" & A54))","v":0},{"$f":"IF(ISBLANK(A54), 0, SUMIFS(Registros!F:F, Registros!A:A, \">=\" & fecha_inicial, Registros!A:A, \"<=\" & fecha_final,  Registros!B:B, \"=\" & A54))","v":0},0]
[1311,"Código de cuenta incorrecto",{"$f":"IF(ISBLANK(A55),0, SUMIFS(Registros!E:E,Registros!A:A,\"<\"&fecha_inicial,Registros!B:B,\"=\"&A55)) - IF(ISBLANK(A55),0, SUMIFS(Registros!F:F,Registros!A:A,\"<\"&fecha_inicial,Registros!B:B,\"=\"&A55))","v":0},null,{"$f":"IF(ISBLANK(A55), 0, SUMIFS(Registros!E:E, Registros!A:A, \">=\" & fecha_inicial, Registros!A:A, \"<=\" & fecha_final,  Registros!B:B, \"=\" & A55))","v":0},{"$f":"IF(ISBLANK(A55), 0, SUMIFS(Registros!F:F, Registros!A:A, \">=\" & fecha_inicial, Registros!A:A, \"<=\" & fecha_final,  Registros!B:B, \"=\" & A55))","v":0},0]
[1312,"Código de cuenta incorrecto",{"$f":"IF(ISBLANK(A56),0, SUMIFS(Registros!E:E,Registros!A:A,\"<\"&fecha_inicial,Registros!B:B,\"=\"&A56)) - IF(ISBLANK(A56),0, SUMIFS(Registros!F:F,Registros!A:A,\"<\"&fecha_inicial,Registros!B:B,\"=\"&A56))","v":0},null,{"$f":"IF(ISBLANK(A56), 0, SUMIFS(Registros!E:E, Registros!A:A, \">=\" & fecha_inicial, Registros!A:A, \"<=\" & fecha_final,  Registros!B:B, \"=\" & A56))","v":0},{"$f":"IF(ISBLANK(A56), 0, SUMIFS(Registros!F:F, Registros!A:A, \">=\" & fecha_inicial, Registros!A:A, \"<=\" & fecha_final,  Registros!B:B, \"=\" & A56))","v":0},0]
[1313,"Código de cuenta incorrecto",{"$f":"IF(ISBLANK(A57),0, SUMIFS(Registros!E:E,Registros!A:A,\"<\"&fecha_inicial,Registros!B:B,\"=\"&A57)) - IF(ISBLANK(A57),0, SUMIFS(Registros!F:F,Registros!A:A,\"<\"&fecha_inicial,Registros!B:B,\"=\"&A57))","v":0},null,{"$f":"IF(ISBLANK(A57), 0, SUMIFS(Registros!E:E, Registros!A:A, \">=\" & fecha_inicial, Registros!A:A, \"<=\" & fecha_final,  Registros!B:B, \"=\" & A57))","v":0},{"$f":"IF(ISBLANK(A57), 0, SUMIFS(Registros!F:F, Registros!A:A, \">=\" & fecha_inicial, Registros!A:A, \"<=\" & fecha_final,  Registros!B:B, \"=\" & A57))","v":0},0]
[1314,"Código de cuenta incorrecto",{"$f":"IF(ISBLANK(A58),0, SUMIFS(Registros!E:E,Registros!A:A,\"<\"&fecha_inicial,Registros!B:B,\"=\"&A58)) - IF(ISBLANK(A58),0, SUMIFS(Registros!F:F,Registros!A:A,\"<\"&fecha_inicial,Registros!B:B,\"=\"&A58))","v":0},null,{"$f":"IF(ISBLANK(A58), 0, SUMIFS(Registros!E:E, Registros!A:A, \">=\" & fecha_inicial, Registros!A:A, \"<=\" & fecha_final,  Registros!B:B, \"=\" & A58))","v":0},{"$f":"IF(ISBLANK(A58), 0, SUMIFS(Registros!F:F, Registros!A:A, \">=\" & fecha_inicial, Registros!A:A, \"<=\" & fecha_final,  Registros!B:B, \"=\" & A58))","v":0},0]
[1315,"Código de cuenta incorrecto",{"$f":"IF(ISBLANK(A59),0, SUMIFS(Registros!E:E,Registros!A:A,\"<\"&fecha_inicial,Registros!B:B,\"=\"&A59)) - IF(ISBLANK(A59),0, SUMIFS(Registros!F:F,Registros!A:A,\"<\"&fecha_inicial,Registros!B:B,\"=\"&A59))","v":0},null,{"$f":"IF(ISBLANK(A59), 0, SUMIFS(Registros!E:E, Registros!A:A, \">=\" & fecha_inicial, Registros!A:A, \"<=\" & fecha_final,  Registros!B:B, \"=\" & A59))","v":0},{"$f":"IF(ISBLANK(A59), 0, SUMIFS(Registros!F:F, Registros!A:A, \">=\" & fecha_inicial, Registros!A:A, \"<=\" & fecha_final,  Registros!B:B, \"=\" & A59))","v":0},{"$f":"C59+E59-F59","v":0}]
[1400,"DEPRECIACIÓN Y AMORTIZACIÓN",null,{"$f":"SUM(D61:D62)","v":0},{"$f":"SUM(E61:E62)","v":0},{"$f":"SUM(F61:F62)","v":0},null,{"$f":"SUM(H61:H62)","v":0}]
[1401,"DEPRECIACIÓN ACUMULADA",null,{"$f":"IF(ISBLANK(A61),0, SUMIFS(Registros!F:F,Registros!A:A,\"<\"&fecha_inicial,Registros!B:B,\"=\"&A61)) - IF(ISBLANK(A61),0, SUMIFS(Registros!E:E,Registros!A:A,\"<\"&fecha_inicial,Registros!B:B,\"=\"&A61))","v":0},{"$f":"IF(ISBLANK(A61), 0, SUMIFS(Registros!E:E, Registros!A:A, \">=\" & fecha_inicial, Registros!A:A, \"<=\" & fecha_final,  Registros!B:B, \"=\" &A61))","v":0},{"$f":"IF(ISBLANK(A61), 0, SUMIFS(Registros!F:F, Registros!A:A, \">=\" & fecha_inicial, Registros!A:A, \"<=\" & fecha_final,  Registros!B:B, \"=\" &A61))","v":0},null,{"$f":"D61-E61+F61","v":0}]
[1402,"AMORTIZACIÓN DE INTANGIBLES",null,{"$f":"IF(ISBLANK(A62),0, SUMIFS(Registros!F:F,Registros!A:A,\"<\"&fecha_inicial,Registros!B:B,\"=\"&A62)) - IF(ISBLANK(A62),0, SUMIFS(Registros!E:E,Registros!A:A,\"<\"&fecha_inicial,Registros!B:B,\"=\"&A62))","v":0},{"$f":"IF(ISBLANK(A62), 0, SUMIFS(Registros!E:E, Registros!A:A, \">=\" & fecha_inicial, Registros!A:A, \"<=\" & fecha_final,  Registros!B:B, \"=\" &A62))","v":0},{"$f":"IF(ISBLANK(A62), 0, SUMIFS(Registros!F:F, Registros!A:A, \">=\" & fecha_inicial, Registros!A:A, \"<=\" & fecha_final,  Registros!B:B, \"=\" &A62))","v":0},null,{"$f":"D62-E62+F62","v":0}]
[2000,"PASIVOS",null,{"$f":"D64+D80","v":0},{"$f":"E64+E80","v":0},0,null,{"$f":"H64+H80","v":0}]
[2100,"PASIVOS CIRCULANTES",null,{"$f":"SUM(D65:D79)","v":0},{"$f":"SUM(E65:E79)","v":0},{"$f":"SUM(F65:F79)","v":0},null,{"$f":"SUM(H65:H79)","v":0}]
[2101,"PROVEEDORES",null,{"$f":"IF(ISBLANK(A65),0, SUMIFS(Registros!F:F,Registros!A:A,\"<\"&fecha_inicial,Registros!B:B,\"=\"&A65)) - IF(ISBLANK(A65),0, SUMIFS(Registros!E:E,Registros!A:A,\"<\"&fecha_inicial,Registros!B:B,\"=\"&A65))","v":0},{"$f":"IF(ISBLANK(A65), 0, SUMIFS(Registros!E:E, Registros!A:A, \">=\" & fecha_inicial, Registros!A:A, \"<=\" & fecha_final,  Registros!B:B, \"=\" &A65))","v":0},{"$f":"IF(ISBLANK(A65), 0, SUMIFS(Registros!F:F, Registros!A:A, \">=\" & fecha_inicial, Registros!A:A, \"<=\" & fecha_final,  Registros!B:B, \"=\" &A65))","v":0},null,{"$f":"D65-E65+F65","v":0}]
[2102,"DOCUMENTOS POR PAGAR",null,{"$f":"IF(ISBLANK(A66),0, SUMIFS(Registros!F:F,Registros!A:A,\"<\"&fecha_inicial,Registros!B:B,\"=\"&A66)) - IF(ISBLANK(A66),0, SUMIFS(Registros!E:E,Registros!A:A,\"<\"&fecha_inicial,Registros!B:B,\"=\"&A66))","v":0},{"$f":"IF(ISBLANK(A66), 0, SUMIFS(Registros!E:E, Registros!A:A, \">=\" & fecha_inicial, Registros!A:A, \"<=\" & fecha_final,  Registros!B:B, \"=\" &A66))","v":0},{"$f":"IF(ISBLANK(A66), 0, SUMIFS(Registros!F:F, Registros!A:A, \">=\" & fecha_inicial, Registros!A:A, \"<=\" & fecha_final,  Registros!B:B, \"=\" &A66))","v":0},null,{"$f":"D66-E66+F66","v":0}]
[2103,"ACREEDORES",null,{"$f":"IF(ISBLANK(A67),0, SUMIFS(Registros!F:F,Registros!A:A,\"<\"&fecha_inicial,Registros!B:B,\"=\"&A67)) - IF(ISBLANK(A67),0, SUMIFS(Registros!E:E,Registros!A:A,\"<\"&fecha_inicial,Registros!B:B,\"=\"&A67))","v":0},{"$f":"IF(ISBLANK(A67), 0, SUMIFS(Registros!E:E, Registros!A:A, \">=\" & fecha_inicial, Registros!A:A, \"<=\" & fecha_final,  Registros!B:B, \"=\" &A67))","v":0},{"$f":"IF(ISBLANK(A67), 0, SUMIFS(Registros!F:F, Registros!A:A, \">=\" & fecha_inicial, Registros!A:A, \"<=\" & fecha_final,  Registros!B:B, \"=\" &A67))","v":0},null,0]
[2104,"ACREEDORES BANCARIOS",null,{"$f":"IF(ISBLANK(A68),0, SUMIFS(Registros!F:F,Registros!A:A,\"<\"&fecha_inicial,Registros!B:B,\"=\"&A68)) - IF(ISBLANK(A68),0, SUMIFS(Registros!E:E,Registros!A:A,\"<\"&fecha_inicial,Registros!B:B,\"=\"&A68))","v":0},{"$f":"IF(ISBLANK(A68), 0, SUMIFS(Registros!E:E, Registros!A:A, \">=\" & fecha_inicial, Registros!A:A, \"<=\" & fecha_final,  Registros!B:B, \"=\" &A68))","v":0},{"$f":"IF(ISBLANK(A68), 0, SUMIFS(Registros!F:F, Registros!A:A, \">=\" & fecha_inicial, Registros!A:A, \"<=\" & fecha_final,  Registros!B:B, \"=\" &A68))","v":0},null,0]
[2105,"ANTICIPOS DE CLIENTES",null,{"$f":"IF(ISBLANK(A69),0, SUMIFS(Registros!F:F,Registros!A:A,\"<\"&fecha_inicial,Registros!B:B,\"=\"&A69)) - IF(ISBLANK(A69),0, SUMIFS(Registros!E:E,Registros!A:A,\"<\"&fecha_inicial,Registros!B:B,\"=\"&A69))","v":0},{"$f":"IF(ISBLANK(A69), 0, SUMIFS(Registros!E:E, Registros!A:A, \">=\" & fecha_inicial, Registros!A:A, \"<=\" & fecha_final,  Registros!B:B, \"=\" &A69))","v":0},{"$f":"IF(ISBLANK(A69), 0, SUMIFS(Registros!F:F, Registros!A:A, \">=\" & fecha_inicial, Registros!A:A, \"<=\" & fecha_final,  Registros!B:B, \"=\" &A69))","v":0},null,0]
[2106,"IVA POR PAGAR",null,{"$f":"IF(ISBLANK(A70),0, SUMIFS(Registros!F:F,Registros!A:A,\"<\"&fecha_inicial,Registros!B:B,\"=\"&A70)) - IF(ISBLANK(A70),0, SUMIFS(Registros!E:E,Registros!A:A,\"<\"&fecha_inicial,Registros!B:B,\"=\"&A70))","v":0},{"$f":"IF(ISBLANK(A70), 0, SUMIFS(Registros!E:E, Registros!A:A, \">=\" & fecha_inicial, Registros!A:A, \"<=\" & fecha_final,  Registros!B:B, \"=\" &A70))","v":0},{"$f":"IF(ISBLANK(A70), 0, SUMIFS(Registros!F:F, Registros!A:A, \">=\" & fecha_inicial, Registros!A:A, \"<=\" & fecha_final,  Registros!B:B, \"=\" &A70))","v":0},null,0]
[2107,"IR POR PAGAR",null,{"$f":"IF(ISBLANK(A71),0, SUMIFS(Registros!F:F,Registros!A:A,\"<\"&fecha_inicial,Registros!B:B,\"=\"&A71)) - IF(ISBLANK(A71),0, SUMIFS(Registros!E:E,Registros!A:A,\"<\"&fecha_inicial,Registros!B:B,\"=\"&A71))","v":0},{"$f":"IF(ISBLANK(A71), 0, SUMIFS(Registros!E:E, Registros!A:A, \">=\" & fecha_inicial, Registros!A:A, \"<=\" & fecha_final,  Registros!B:B, \"=\" &A71))","v":0},{"$f":"IF(ISBLANK(A71), 0, SUMIFS(Registros!F:F, Registros!A:A, \">=\" & fecha_inicial, Registros!A:A, \"<=\" & fecha_final,  Registros!B:B, \"=\" &A71))","v":0},null,0]
[2108,"RENTAS COBRADAS POR ANTICIPADO",null,{"$f":"IF(ISBLANK(A72),0, SUMIFS(Registros!F:F,Registros!A:A,\"<\"&fecha_inicial,Registros!B:B,\"=\"&A72)) - IF(ISBLANK(A72),0, SUMIFS(Registros!E:E,Registros!A:A,\"<\"&fecha_inicial,Registros!B:B,\"=\"&A72))","v":0},{"$f":"IF(ISBLANK(A72), 0, SUMIFS(Registros!E:E, Registros!A:A, \">=\" & fecha_inicial, Registros!A:A, \"<=\" & fecha_final,  Registros!B:B, \"=\" &A72))","v":0},{"$f":"IF(ISBLANK(A72), 0, SUMIFS(Registros!F:F, Registros!A:A, \">=\" & fecha_inicial, Registros!A:A, \"<=\" & fecha_final,  Registros!B:B, \"=\" &A72))","v":0},null,0]
[2109,"INTERESES COBRADOS POR ANTICIPADOS",null,{"$f":"IF(ISBLANK(A73),0, SUMIFS(Registros!F:F,Registros!A:A,\"<\"&fecha_inicial,Registros!B:B,\"=\"&A73)) - IF(ISBLANK(A73),0, SUMIFS(Registros!E:E,Registros!A:A,\"<\"&fecha_inicial,Registros!B:B,\"=\"&A73))","v":0},{"$f":"IF(ISBLANK(A73), 0, SUMIFS(Registros!E:E, Registros!A:A, \">=\" & fecha_inicial, Registros!A:A, \"<=\" & fecha_final,  Registros!B:B, \"=\" &A73))","v":0},{"$f":"IF(ISBLANK(A73), 0, SUMIFS(Registros!F:F, Registros!A:A, \">=\" & fecha_inicial, Registros!A:A, \"<=\" & fecha_final,  Registros!B:B, \"=\" &A73))","v":0},null,0]
[2110,"Código de cuenta incorrecto",null,{"$f":"IF(ISBLANK(A74),0, SUMIFS(Registros!F:F,Registros!A:A,\"<\"&fecha_inicial,Registros!B:B,\"=\"&A74)) - IF(ISBLANK(A74),0, SUMIFS(Registros!E:E,Registros!A:A,\"<\"&fecha_inicial,Registros!B:B,\"=\"&A74))","v":0},{"$f":"IF(ISBLANK(A74), 0, SUMIFS(Registros!E:E, Registros!A:A, \">=\" & fecha_inicial, Registros!A:A, \"<=\" & fecha_final,  Registros!B:B, \"=\" &A74))","v":0},{"$f":"IF(ISBLANK(A74), 0, SUMIFS(Registros!F:F, Registros!A:A, \">=\" & fecha_inicial, Registros!A:A, \"<=\" & fecha_final,  Registros!B:B, \"=\" &A74))","v":0},null,0]
[2111,"Código de cuenta incorrecto",null,{"$f":"IF(ISBLANK(A75),0, SUMIFS(Registros!F:F,Registros!A:A,\"<\"&fecha_inicial,Registros!B:B,\"=\"&A75)) - IF(ISBLANK(A75),0, SUMIFS(Registros!E:E,Registros!A:A,\"<\"&fecha_inicial,Registros!B:B,\"=\"&A75))","v":0},{"$f":"IF(ISBLANK(A75), 0, SUMIFS(Registros!E:E, Registros!A:A, \">=\" & fecha_inicial, Registros!A:A, \"<=\" & fecha_final,  Registros!B:B, \"=\" &A75))","v":0},{"$f":"IF(ISBLANK(A75), 0, SUMIFS(Registros!F:F, Registros!A:A, \">=\" & fecha_inicial, Registros!A:A, \"<=\" & fecha_final,  Registros!B:B, \"=\" &A75))","v":0},null,0]
[2112,"Código de cuenta incorrecto",null,{"$f":"IF(ISBLANK(A76),0, SUMIFS(Registros!F:F,Registros!A:A,\"<\"&fecha_inicial,Registros!B:B,\"=\"&A76)) - IF(ISBLANK(A76),0, SUMIFS(Registros!E:E,Registros!A:A,\"<\"&fecha_inicial,Registros!B:B,\"=\"&A76))","v":0},{"$f":"IF(ISBLANK(A76), 0, SUMIFS(Registros!E:E, Registros!A:A, \">=\" & fecha_inicial, Registros!A:A, \"<=\" & fecha_final,  Registros!B:B, \"=\" &A76))","v":0},{"$f":"IF(ISBLANK(A76), 0, SUMIFS(Registros!F:F, Registros!A:A, \">=\" & fecha_inicial, Registros!A:A, \"<=\" & fecha_final,  Registros!B:B, \"=\" &A76))","v":0},null,0]
[2113,"Código de cuenta incorrecto",null,{"$f":"IF(ISBLANK(A77),0, SUMIFS(Registros!F:F,Registros!A:A,\"<\"&fecha_inicial,Registros!B:B,\"=\"&A77)) - IF(ISBLANK(A77),0, SUMIFS(Registros!E:E,Registros!A:A,\"<\"&fecha_inicial,Registros!B:B,\"=\"&A77))","v":0},{"$f":"IF(ISBLANK(A77), 0, SUMIFS(Registros!E:E, Registros!A:A, \">=\" & fecha_inicial, Registros!A:A, \"<=\" & fecha_final,  Registros!B:B, \"=\" &A77))","v":0},{"$f":"IF(ISBLANK(A77), 0, SUMIFS(Registros!F:F, Registros!A:A, \">=\" & fecha_inicial, Registros!A:A, \"<=\" & fecha_final,  Registros!B:B, \"=\" &A77))","v":0},null,0]
[2114,"Código de cuenta incorrecto",null,{"$f":"IF(ISBLANK(A78),0, SUMIFS(Registros!F:F,Registros!A:A,\"<\"&fecha_inicial,Registros!B:B,\"=\"&A78)) - IF(ISBLANK(A78),0, SUMIFS(Registros!E:E,Registros!A:A,\"<\"&fecha_inicial,Registros!B:B,\"=\"&A78))","v":0},{"$f":"IF(ISBLANK(A78), 0, SUMIFS(Registros!E:E, Registros!A:A, \">=\" & fecha_inicial, Registros!A:A, \"<=\" & fecha_final,  Registros!B:B, \"=\" &A78))","v":0},{"$f":"IF(ISBLANK(A78), 0, SUMIFS(Registros!F:F, Registros!A:A, \">=\" & fecha_inicial, Registros!A:A, \"<=\" & fecha_final,  Registros!B:B, \"=\" &A78))","v":0},null,0]
[2115,"Código de cuenta incorrecto",null,{"$f":"IF(ISBLANK(A79),0, SUMIFS(Registros!F:F,Registros!A:A,\"<\"&fecha_inicial,Registros!B:B,\"=\"&A79)) - IF(ISBLANK(A79),0, SUMIFS(Registros!E:E,Registros!A:A,\"<\"&fecha_inicial,Registros!B:B,\"=\"&A79))","v":0},{"$f":"IF(ISBLANK(A79), 0, SUMIFS(Registros!E:E, Registros!A:A, \">=\" & fecha_inicial, Registros!A:A, \"<=\" & fecha_final,  Registros!B:B, \"=\" &A79))","v":0},{"$f":"IF(ISBLANK(A79), 0, SUMIFS(Registros!F:F, Registros!A:A, \">=\" & fecha_inicial, Registros!A:A, \"<=\" & fecha_final,  Registros!B:B, \"=\" &A79))","v":0},null,0]
[2200,"PASIVOS FIJOS",null,{"$f":"SUM(D81:D90)","v":0},{"$f":"SUM(E81:E90)","v":0},{"$f":"SUM(F81:F90)","v":0},null,{"$f":"SUM(H81:H90)","v":0}]
[2201,"ACREEDORES HIPOTECARIOS",null,{"$f":"IF(ISBLANK(A81),0, SUMIFS(Registros!F:F,Registros!A:A,\"<\"&fecha_inicial,Registros!B:B,\"=\"&A81)) - IF(ISBLANK(A81),0, SUMIFS(Registros!E:E,Registros!A:A,\"<\"&fecha_inicial,Registros!B:B,\"=\"&A81))","v":0},{"$f":"IF(ISBLANK(A81), 0, SUMIFS(Registros!E:E, Registros!A:A, \">=\" & fecha_inicial, Registros!A:A, \"<=\" & fecha_final,  Registros!B:B, \"=\" &A81))","v":0},{"$f":"IF(ISBLANK(A81), 0, SUMIFS(Registros!F:F, Registros!A:A, \">=\" & fecha_inicial, Registros!A:A, \"<=\" & fecha_final,  Registros!B:B, \"=\" &A81))","v":0},null,0]
[2202,"ACREEDORES BANCARIOS",null,{"$f":"IF(ISBLANK(A82),0, SUMIFS(Registros!F:F,Registros!A:A,\"<\"&fecha_inicial,Registros!B:B,\"=\"&A82)) - IF(ISBLANK(A82),0, SUMIFS(Registros!E:E,Registros!A:A,\"<\"&fecha_inicial,Registros!B:B,\"=\"&A82))","v":0},{"$f":"IF(ISBLANK(A82), 0, SUMIFS(Registros!E:E, Registros!A:A, \">=\" & fecha_inicial, Registros!A:A, \"<=\" & fecha_final,  Registros!B:B, \"=\" &A82))","v":0},{"$f":"IF(ISBLANK(A82), 0, SUMIFS(Registros!F:F, Registros!A:A, \">=\" & fecha_inicial, Registros!A:A, \"<=\" & fecha_final,  Registros!B:B, \"=\" &A82))","v":0},null,0]
[2203,"DOCUMENTOS POR PAGAR L/P",null,{"$f":"IF(ISBLANK(A83),0, SUMIFS(Registros!F:F,Registros!A:A,\"<\"&fecha_inicial,Registros!B:B,\"=\"&A83)) - IF(ISBLANK(A83),0, SUMIFS(Registros!E:E,Registros!A:A,\"<\"&fecha_inicial,Registros!B:B,\"=\"&A83))","v":0},{"$f":"IF(ISBLANK(A83), 0, SUMIFS(Registros!E:E, Registros!A:A, \">=\" & fecha_inicial, Registros!A:A, \"<=\" & fecha_final,  Registros!B:B, \"=\" &A83))","v":0},{"$f":"IF(ISBLANK(A83), 0, SUMIFS(Registros!F:F, Registros!A:A, \">=\" & fecha_inicial, Registros!A:A, \"<=\" & fecha_final,  Registros!B:B, \"=\" &A83))","v":0},null,0]
[2204,"Código de cuenta incorrecto",null,{"$f":"IF(ISBLANK(A84),0, SUMIFS(Registros!F:F,Registros!A:A,\"<\"&fecha_inicial,Registros!B:B,\"=\"&A84)) - IF(ISBLANK(A84),0, SUMIFS(Registros!E:E,Registros!A:A,\"<\"&fecha_inicial,Registros!B:B,\"=\"&A84))","v":0},{"$f":"IF(ISBLANK(A84), 0, SUMIFS(Registros!E:E, Registros!A:A, \">=\" & fecha_inicial, Registros!A:A, \"<=\" & fecha_final,  Registros!B:B, \"=\" &A84))","v":0},{"$f":"IF(ISBLANK(A84), 0, SUMIFS(Registros!F:F, Registros!A:A, \">=\" & fecha_inicial, Registros!A:A, \"<=\" & fecha_final,  Registros!B:B, \"=\" &A84))","v":0},null,0]
[2205,"Código de cuenta incorrecto",null,{"$f":"IF(ISBLANK(A85),0, SUMIFS(Registros!F:F,Registros!A:A,\"<\"&fecha_inicial,Registros!B:B,\"=\"&A85)) - IF(ISBLANK(A85),0, SUMIFS(Registros!E:E,Registros!A:A,\"<\"&fecha_inicial,Registros!B:B,\"=\"&A85))","v":0},{"$f":"IF(ISBLANK(A85), 0, SUMIFS(Registros!E:E, Registros!A:A, \">=\" & fecha_inicial, Registros!A:A, \"<=\" & fecha_final,  Registros!B:B, \"=\" &A85))","v":0},{"$f":"IF(ISBLANK(A85), 0, SUMIFS(Registros!F:F, Registros!A:A, \">=\" & fecha_inicial, Registros!A:A, \"<=\" & fecha_final,  Registros!B:B, \"=\" &A85))","v":0},null,0]
[2206,"Código de cuenta incorrecto",null,{"$f":"IF(ISBLANK(A86),0, SUMIFS(Registros!F:F,Registros!A:A,\"<\"&fecha_inicial,Registros!B:B,\"=\"&A86)) - IF(ISBLANK(A86),0, SUMIFS(Registros!E:E,Registros!A:A,\"<\"&fecha_inicial,Registros!B:B,\"=\"&A86))","v":0},{"$f":"IF(ISBLANK(A86), 0, SUMIFS(Registros!E:E, Registros!A:A, \">=\" & fecha_inicial, Registros!A:A, \"<=\" & fecha_final,  Registros!B:B, \"=\" &A86))","v":0},{"$f":"IF(ISBLANK(A86), 0, SUMIFS(Registros!F:F, Registros!A:A, \">=\" & fecha_inicial, Registros!A:A, \"<=\" & fecha_final,  Registros!B:B, \"=\" &A86))","v":0},null,0]
[2207,"Código de cuenta incorrecto",null,{"$f":"IF(ISBLANK(A87),0, SUMIFS(Registros!F:F,Registros!A:A,\"<\"&fecha_inicial,Registros!B:B,\"=\"&A87)) - IF(ISBLANK(A87),0, SUMIFS(Registros!E:E,Registros!A:A,\"<\"&fecha_inicial,Registros!B:B,\"=\"&A87))","v":0},{"$f":"IF(ISBLANK(A87), 0, SUMIFS(Registros!E:E, Registros!A:A, \">=\" & fecha_inicial, Registros!A:A, \"<=\" & fecha_final,  Registros!B:B, \"=\" &A87))","v":0},{"$f":"IF(ISBLANK(A87), 0, SUMIFS(Registros!F:F, Registros!A:A, \">=\" & fecha_inicial, Registros!A:A, \"<=\" & fecha_final,  Registros!B:B, \"=\" &A87))","v":0},null,0]
[2208,"Código de cuenta incorrecto",null,{"$f":"IF(ISBLANK(A88),0, SUMIFS(Registros!F:F,Registros!A:A,\"<\"&fecha_inicial,Registros!B:B,\"=\"&A88)) - IF(ISBLANK(A88),0, SUMIFS(Registros!E:E,Registros!A:A,\"<\"&fecha_inicial,Registros!B:B,\"=\"&A88))","v":0},{"$f":"IF(ISBLANK(A88), 0, SUMIFS(Registros!E:E, Registros!A:A, \">=\" & fecha_inicial, Registros!A:A, \"<=\" & fecha_final,  Registros!B:B, \"=\" &A88))","v":0},{"$f":"IF(ISBLANK(A88), 0, SUMIFS(Registros!F:F, Registros!A:A, \">=\" & fecha_inicial, Registros!A:A, \"<=\" & fecha_final,  Registros!B:B, \"=\" &A88))","v":0},null,0]
[2209,"Código de cuenta incorrecto",null,{"$f":"IF(ISBLANK(A89),0, SUMIFS(Registros!F:F,Registros!A:A,\"<\"&fecha_inicial,Registros!B:B,\"=\"&A89)) - IF(ISBLANK(A89),0, SUMIFS(Registros!E:E,Registros!A:A,\"<\"&fecha_inicial,Registros!B:B,\"=\"&A89))","v":0},{"$f":"IF(ISBLANK(A89), 0, SUMIFS(Registros!E:E, Registros!A:A, \">=\" & fecha_inicial, Registros!A:A, \"<=\" & fecha_final,  Registros!B:B, \"=\" &A89))","v":0},{"$f":"IF(ISBLANK(A89), 0, SUMIFS(Registros!F:F, Registros!A:A, \">=\" & fecha_inicial, Registros!A:A, \"<=\" & fecha_final,  Registros!B:B, \"=\" &A89))","v":0},null,0]
[2210,"Código de cuenta incorrecto",null,{"$f":"IF(ISBLANK(A90),0, SUMIFS(Registros!F:F,Registros!A:A,\"<\"&fecha_inicial,Registros!B:B,\"=\"&A90)) - IF(ISBLANK(A90),0, SUMIFS(Registros!E:E,Registros!A:A,\"<\"&fecha_inicial,Registros!B:B,\"=\"&A90))","v":0},{"$f":"IF(ISBLANK(A90), 0, SUMIFS(Registros!E:E, Registros!A:A, \">=\" & fecha_inicial, Registros!A:A, \"<=\" & fecha_final,  Registros!B:B, \"=\" &A90))","v":0},{"$f":"IF(ISBLANK(A90), 0, SUMIFS(Registros!F:F, Registros!A:A, \">=\" & fecha_inicial, Registros!A:A, \"<=\" & fecha_final,  Registros!B:B, \"=\" &A90))","v":0},null,{"$f":"D90-E90+F90","v":0}]
[3000,{"$f":"IF(ISBLANK(A91), \"\", IFERROR(VLOOKUP(A91, plan_cuentas, 2, FALSE), \"Código de cuenta incorrecto\"))","v":"CAPITAL CONTABLE"},null,{"$f":"D92","v":0},{"$f":"E92","v":0},0,null,{"$f":"H92","v":0}]
[3100,"CAPITAL SOCIAL",null,{"$f":"SUM(D93:D107)","v":0},{"$f":"SUM(E93:E107)","v":0},0,null,{"$f":"SUM(H93:H107)","v":0}]
[3101,"CAPITAL INICIAL",null,{"$f":"IF(ISBLANK(A93),0, SUMIFS(Registros!F:F,Registros!A:A,\"<\"&fecha_inicial,Registros!B:B,\"=\"&A93)) - IF(ISBLANK(A93),0, SUMIFS(Registros!E:E,Registros!A:A,\"<\"&fecha_inicial,Registros!B:B,\"=\"&A93))","v":0},{"$f":"IF(ISBLANK(A93), 0, SUMIFS(Registros!E:E, Registros!A:A, \">=\" & fecha_inicial, Registros!A:A, \"<=\" & fecha_final,  Registros!B:B, \"=\" &A93))","v":0},{"$f":"IF(ISBLANK(A93), 0, SUMIFS(Registros!F:F, Registros!A:A, \">=\" & fecha_inicial, Registros!A:A, \"<=\" & fecha_final,  Registros!B:B, \"=\" &A93))","v":0},null,{"$f":"D93-E93+F93","v":0}]
[3102,"APORTACIONES",null,{"$f":"IF(ISBLANK(A94),0, SUMIFS(Registros!F:F,Registros!A:A,\"<\"&fecha_inicial,Registros!B:B,\"=\"&A94)) - IF(ISBLANK(A94),0, SUMIFS(Registros!E:E,Registros!A:A,\"<\"&fecha_inicial,Registros!B:B,\"=\"&A94))","v":0},{"$f":"IF(ISBLANK(A94), 0, SUMIFS(Registros!E:E, Registros!A:A, \">=\" & fecha_inicial, Registros!A:A, \"<=\" & fecha_final,  Registros!B:B, \"=\" &A94))","v":0},{"$f":"IF(ISBLANK(A94), 0, SUMIFS(Registros!F:F, Registros!A:A, \">=\" & fecha_inicial, Registros!A:A, \"<=\" & fecha_final,  Registros!B:B, \"=\" &A94))","v":0},null,{"$f":"D94-E94+F94","v":0}]
[3103,"RESERVA",null,{"$f":"IF(ISBLANK(A95),0, SUMIFS(Registros!F:F,Registros!A:A,\"<\"&fecha_inicial,Registros!B:B,\"=\"&A95)) - IF(ISBLANK(A95),0, SUMIFS(Registros!E:E,Registros!A:A,\"<\"&fecha_inicial,Registros!B:B,\"=\"&A95))","v":0},{"$f":"IF(ISBLANK(A95), 0, SUMIFS(Registros!E:E, Registros!A:A, \">=\" & fecha_inicial, Registros!A:A, \"<=\" & fecha_final,  Registros!B:B, \"=\" &A95))","v":0},{"$f":"IF(ISBLANK(A95), 0, SUMIFS(Registros!F:F, Registros!A:A, \">=\" & fecha_inicial, Registros!A:A, \"<=\" & fecha_final,  Registros!B:B, \"=\" &A95))","v":0},null,0]
[3104,"UTILIDADES RETENIDAS",null,{"$f":"IF(ISBLANK(A96),0, SUMIFS(Registros!F:F,Registros!A:A,\"<\"&fecha_inicial,Registros!B:B,\"=\"&A96)) - IF(ISBLANK(A96),0, SUMIFS(Registros!E:E,Registros!A:A,\"<\"&fecha_inicial,Registros!B:B,\"=\"&A96))","v":0},{"$f":"IF(ISBLANK(A96), 0, SUMIFS(Registros!E:E, Registros!A:A, \">=\" & fecha_inicial, Registros!A:A, \"<=\" & fecha_final,  Registros!B:B, \"=\" &A96))","v":0},{"$f":"IF(ISBLANK(A96), 0, SUMIFS(Registros!F:F, Registros!A:A, \">=\" & fecha_inicial, Registros!A:A, \"<=\" & fecha_final,  Registros!B:B, \"=\" &A96))","v":0},null,0]
[3105,"UTILIDAD DEL EJERCICIO",null,{"$f":"IF(ISBLANK(A97),0, SUMIFS(Registros!F:F,Registros!A:A,\"<\"&fecha_inicial,Registros!B:B,\"=\"&A97)) - IF(ISBLANK(A97),0, SUMIFS(Registros!E:E,Registros!A:A,\"<\"&fecha_inicial,Registros!B:B,\"=\"&A97))","v":0},{"$f":"IF(ISBLANK(A97), 0, SUMIFS(Registros!E:E, Registros!A:A, \">=\" & fecha_inicial, Registros!A:A, \"<=\" & fecha_final,  Registros!B:B, \"=\" &A97))","v":0},{"$f":"IF(ISBLANK(A97), 0, SUMIFS(Registros!F:F, Registros!A:A, \">=\" & fecha_inicial, Registros!A:A, \"<=\" & fecha_final,  Registros!B:B, \"=\" &A97))","v":0},null,0]
[3106,"Código de cuenta incorrecto",null,{"$f":"IF(ISBLANK(A98),0, SUMIFS(Registros!F:F,Registros!A:A,\"<\"&fecha_inicial,Registros!B:B,\"=\"&A98)) - IF(ISBLANK(A98),0, SUMIFS(Registros!E:E,Registros!A:A,\"<\"&fecha_inicial,Registros!B:B,\"=\"&A98))","v":0},{"$f":"IF(ISBLANK(A98), 0, SUMIFS(Registros!E:E, Registros!A:A, \">=\" & fecha_inicial, Registros!A:A, \"<=\" & fecha_final,  Registros!B:B, \"=\" &A98))","v":0},{"$f":"IF(ISBLANK(A98), 0, SUMIFS(Registros!F:F, Registros!A:A, \">=\" & fecha_inicial, Registros!A:A, \"<=\" & fecha_final,  Registros!B:B, \"=\" &A98))","v":0},null,0]
[3107,"Código de cuenta incorrecto",null,{"$f":"IF(ISBLANK(A99),0, SUMIFS(Registros!F:F,Registros!A:A,\"<\"&fecha_inicial,Registros!B:B,\"=\"&A99)) - IF(ISBLANK(A99),0, SUMIFS(Registros!E:E,Registros!A:A,\"<\"&fecha_inicial,Registros!B:B,\"=\"&A99))","v":0},{"$f":"IF(ISBLANK(A99), 0, SUMIFS(Registros!E:E, Registros!A:A, \">=\" & fecha_inicial, Registros!A:A, \"<=\" & fecha_final,  Registros!B:B, \"=\" &A99))","v":0},{"$f":"IF(ISBLANK(A99), 0, SUMIFS(Registros!F:F, Registros!A:A, \">=\" & fecha_inicial, Registros!A:A, \"<=\" & fecha_final,  Registros!B:B, \"=\" &A99))","v":0},null,0]
[3108,"Código de cuenta incorrecto",null,{"$f":"IF(ISBLANK(A100),0, SUMIFS(Registros!F:F,Registros!A:A,\"<\"&fecha_inicial,Registros!B:B,\"=\"&A100)) - IF(ISBLANK(A100),0, SUMIFS(Registros!E:E,Registros!A:A,\"<\"&fecha_inicial,Registros!B:B,\"=\"&A100))","v":0},{"$f":"IF(ISBLANK(A100), 0, SUMIFS(Registros!E:E, Registros!A:A, \">=\" & fecha_inicial, Registros!A:A, \"<=\" & fecha_final,  Registros!B:B, \"=\" &A100))","v":0},{"$f":"IF(ISBLANK(A100), 0, SUMIFS(Registros!F:F, Registros!A:A, \">=\" & fecha_inicial, Registros!A:A, \"<=\" & fecha_final,  Registros!B:B, \"=\" &A100))","v":0},null,0]
[3109,"Código de cuenta incorrecto",null,{"$f":"IF(ISBLANK(A101),0, SUMIFS(Registros!F:F,Registros!A:A,\"<\"&fecha_inicial,Registros!B:B,\"=\"&A101)) - IF(ISBLANK(A101),0, SUMIFS(Registros!E:E,Registros!A:A,\"<\"&fecha_inicial,Registros!B:B,\"=\"&A101))","v":0},{"$f":"IF(ISBLANK(A101), 0, SUMIFS(Registros!E:E, Registros!A:A, \">=\" & fecha_inicial, Registros!A:A, \"<=\" & fecha_final,  Registros!B:B, \"=\" &A101))","v":0},{"$f":"IF(ISBLANK(A101), 0, SUMIFS(Registros!F:F, Registros!A:A, \">=\" & fecha_inicial, Registros!A:A, \"<=\" & fecha_final,  Registros!B:B, \"=\" &A101))","v":0},null,0]
[3110,"Código de cuenta incorrecto",null,{"$f":"IF(ISBLANK(A102),0, SUMIFS(Registros!F:F,Registros!A:A,\"<\"&fecha_inicial,Registros!B:B,\"=\"&A102)) - IF(ISBLANK(A102),0, SUMIFS(Registros!E:E,Registros!A:A,\"<\"&fecha_inicial,Registros!B:B,\"=\"&A102))","v":0},{"$f":"IF(ISBLANK(A102), 0, SUMIFS(Registros!E:E, Registros!A:A, \">=\" & fecha_inicial, Registros!A:A, \"<=\" & fecha_final,  Registros!B:B, \"=\" &A102))","v":0},{"$f":"IF(ISBLANK(A102), 0, SUMIFS(Registros!F:F, Registros!A:A, \">=\" & fecha_inicial, Registros!A:A, \"<=\" & fecha_final,  Registros!B:B, \"=\" &A102))","v":0},null,0]
[3111,"Código de cuenta incorrecto",null,{"$f":"IF(ISBLANK(A103),0, SUMIFS(Registros!F:F,Registros!A:A,\"<\"&fecha_inicial,Registros!B:B,\"=\"&A103)) - IF(ISBLANK(A103),0, SUMIFS(Registros!E:E,Registros!A:A,\"<\"&fecha_inicial,Registros!B:B,\"=\"&A103))","v":0},{"$f":"IF(ISBLANK(A103), 0, SUMIFS(Registros!E:E, Registros!A:A, \">=\" & fecha_inicial, Registros!A:A, \"<=\" & fecha_final,  Registros!B:B, \"=\" &A103))","v":0},{"$f":"IF(ISBLANK(A103), 0, SUMIFS(Registros!F:F, Registros!A:A, \">=\" & fecha_inicial, Registros!A:A, \"<=\" & fecha_final,  Registros!B:B, \"=\" &A103))","v":0},null,0]
[3112,"Código de cuenta incorrecto",null,{"$f":"IF(ISBLANK(A104),0, SUMIFS(Registros!F:F,Registros!A:A,\"<\"&fecha_inicial,Registros!B:B,\"=\"&A104)) - IF(ISBLANK(A104),0, SUMIFS(Registros!E:E,Registros!A:A,\"<\"&fecha_inicial,Registros!B:B,\"=\"&A104))","v":0},{"$f":"IF(ISBLANK(A104), 0, SUMIFS(Registros!E:E, Registros!A:A, \">=\" & fecha_inicial, Registros!A:A, \"<=\" & fecha_final,  Registros!B:B, \"=\" &A104))","v":0},{"$f":"IF(ISBLANK(A104), 0, SUMIFS(Registros!F:F, Registros!A:A, \">=\" & fecha_inicial, Registros!A:A, \"<=\" & fecha_final,  Registros!B:B, \"=\" &A104))","v":0},null,0]
[3113,"Código de cuenta incorrecto",null,{"$f":"IF(ISBLANK(A105),0, SUMIFS(Registros!F:F,Registros!A:A,\"<\"&fecha_inicial,Registros!B:B,\"=\"&A105)) - IF(ISBLANK(A105),0, SUMIFS(Registros!E:E,Registros!A:A,\"<\"&fecha_inicial,Registros!B:B,\"=\"&A105))","v":0},{"$f":"IF(ISBLANK(A105), 0, SUMIFS(Registros!E:E, Registros!A:A, \">=\" & fecha_inicial, Registros!A:A, \"<=\" & fecha_final,  Registros!B:B, \"=\" &A105))","v":0},{"$f":"IF(ISBLANK(A105), 0, SUMIFS(Registros!F:F, Registros!A:A, \">=\" & fecha_inicial, Registros!A:A, \"<=\" & fecha_final,  Registros!B:B, \"=\" &A105))","v":0},null,0]
[3114,"Código de cuenta incorrecto",null,{"$f":"IF(ISBLANK(A106),0, SUMIFS(Registros!F:F,Registros!A:A,\"<\"&fecha_inicial,Registros!B:B,\"=\"&A106)) - IF(ISBLANK(A106),0, SUMIFS(Registros!E:E,Registros!A:A,\"<\"&fecha_inicial,Registros!B:B,\"=\"&A106))","v":0},{"$f":"IF(ISBLANK(A106), 0, SUMIFS(Registros!E:E, Registros!A:A, \">=\" & fecha_inicial, Registros!A:A, \"<=\" & fecha_final,  Registros!B:B, \"=\" &A106))","v":0},{"$f":"IF(ISBLANK(A106), 0, SUMIFS(Registros!F:F, Registros!A:A, \">=\" & fecha_inicial, Registros!A:A, \"<=\" & fecha_final,  Registros!B:B, \"=\" &A106))","v":0},null,0]
[3115,"Código de cuenta incorrecto",null,{"$f":"IF(ISBLANK(A107),0, SUMIFS(Registros!F:F,Registros!A:A,\"<\"&fecha_inicial,Registros!B:B,\"=\"&A107)) - IF(ISBLANK(A107),0, SUMIFS(Registros!E:E,Registros!A:A,\"<\"&fecha_inicial,Registros!B:B,\"=\"&A107))","v":0},{"$f":"IF(ISBLANK(A107), 0, SUMIFS(Registros!E:E, Registros!A:A, \">=\" & fecha_inicial, Registros!A:A, \"<=\" & fecha_final,  Registros!B:B, \"=\" &A107))","v":0},{"$f":"IF(ISBLANK(A107), 0, SUMIFS(Registros!F:F, Registros!A:A, \">=\" & fecha_inicial, Registros!A:A, \"<=\" & fecha_final,  Registros!B:B, \"=\" &A107))","v":0},null,0]
[4000,"INGRESOS",null,{"$f":"D109+D117","v":0},{"$f":"E109+E117","v":0},0,null,0]
[4100,"VENTAS DE CONTADO",null,{"$f":"SUM(D110:D116)","v":0},{"$f":"SUM(E110:E116)","v":0},0,null,0]
[4101,"VENTA DE MERCANCÍAS AL CONTADO",null,{"$f":"IF(ISBLANK(A110),0, SUMIFS(Registros!F:F,Registros!A:A,\"<\"&fecha_inicial,Registros!B:B,\"=\"&A110)) - IF(ISBLANK(A110),0, SUMIFS(Registros!E:E,Registros!A:A,\"<\"&fecha_inicial,Registros!B:B,\"=\"&A110))","v":0},{"$f":"IF(ISBLANK(A110), 0, SUMIFS(Registros!E:E, Registros!A:A, \">=\" & fecha_inicial, Registros!A:A, \"<=\" & fecha_final,  Registros!B:B, \"=\" &A110))","v":0},{"$f":"IF(ISBLANK(A110), 0, SUMIFS(Registros!F:F, Registros!A:A, \">=\" & fecha_inicial, Registros!A:A, \"<=\" & fecha_final,  Registros!B:B, \"=\" &A110))","v":0},null,{"$f":"D110-E110+F110","v":0}]
[4102,"OTROS INGRESOS",null,{"$f":"IF(ISBLANK(A111),0, SUMIFS(Registros!F:F,Registros!A:A,\"<\"&fecha_inicial,Registros!B:B,\"=\"&A111)) - IF(ISBLANK(A111),0, SUMIFS(Registros!E:E,Registros!A:A,\"<\"&fecha_inicial,Registros!B:B,\"=\"&A111))","v":0},{"$f":"IF(ISBLANK(A111), 0, SUMIFS(Registros!E:E, Registros!A:A, \">=\" & fecha_inicial, Registros!A:A, \"<=\" & fecha_final,  Registros!B:B, \"=\" &A111))","v":0},{"$f":"IF(ISBLANK(A111), 0, SUMIFS(Registros!F:F, Registros!A:A, \">=\" & fecha_inicial, Registros!A:A, \"<=\" & fecha_final,  Registros!B:B, \"=\" &A111))","v":0},null,{"$f":"D111-E111+F111","v":0}]
[4103,"Código de cuenta incorrecto",null,{"$f":"IF(ISBLANK(A112),0, SUMIFS(Registros!F:F,Registros!A:A,\"<\"&fecha_inicial,Registros!B:B,\"=\"&A112)) - IF(ISBLANK(A112),0, SUMIFS(Registros!E:E,Registros!A:A,\"<\"&fecha_inicial,Registros!B:B,\"=\"&A112))","v":0},{"$f":"IF(ISBLANK(A112), 0, SUMIFS(Registros!E:E, Registros!A:A, \">=\" & fecha_inicial, Registros!A:A, \"<=\" & fecha_final,  Registros!B:B, \"=\" &A112))","v":0},{"$f":"IF(ISBLANK(A112), 0, SUMIFS(Registros!F:F, Registros!A:A, \">=\" & fecha_inicial, Registros!A:A, \"<=\" & fecha_final,  Registros!B:B, \"=\" &A112))","v":0},null,0]
[4104,"Código de cuenta incorrecto",null,{"$f":"IF(ISBLANK(A113),0, SUMIFS(Registros!F:F,Registros!A:A,\"<\"&fecha_inicial,Registros!B:B,\"=\"&A113)) - IF(ISBLANK(A113),0, SUMIFS(Registros!E:E,Registros!A:A,\"<\"&fecha_inicial,Registros!B:B,\"=\"&A113))","v":0},{"$f":"IF(ISBLANK(A113), 0, SUMIFS(Registros!E:E, Registros!A:A, \">=\" & fecha_inicial, Registros!A:A, \"<=\" & fecha_final,  Registros!B:B, \"=\" &A113))","v":0},{"$f":"IF(ISBLANK(A113), 0, SUMIFS(Registros!F:F, Registros!A:A, \">=\" & fecha_inicial, Registros!A:A, \"<=\" & fecha_final,  Registros!B:B, \"=\" &A113))","v":0},null,0]
[4105,"Código de cuenta incorrecto",null,{"$f":"IF(ISBLANK(A114),0, SUMIFS(Registros!F:F,Registros!A:A,\"<\"&fecha_inicial,Registros!B:B,\"=\"&A114)) - IF(ISBLANK(A114),0, SUMIFS(Registros!E:E,Registros!A:A,\"<\"&fecha_inicial,Registros!B:B,\"=\"&A114))","v":0},{"$f":"IF(ISBLANK(A114), 0, SUMIFS(Registros!E:E, Registros!A:A, \">=\" & fecha_inicial, Registros!A:A, \"<=\" & fecha_final,  Registros!B:B, \"=\" &A114))","v":0},{"$f":"IF(ISBLANK(A114), 0, SUMIFS(Registros!F:F, Registros!A:A, \">=\" & fecha_inicial, Registros!A:A, \"<=\" & fecha_final,  Registros!B:B, \"=\" &A114))","v":0},null,0]
[4106,"Código de cuenta incorrecto",null,{"$f":"IF(ISBLANK(A115),0, SUMIFS(Registros!F:F,Registros!A:A,\"<\"&fecha_inicial,Registros!B:B,\"=\"&A115)) - IF(ISBLANK(A115),0, SUMIFS(Registros!E:E,Registros!A:A,\"<\"&fecha_inicial,Registros!B:B,\"=\"&A115))","v":0},{"$f":"IF(ISBLANK(A115), 0, SUMIFS(Registros!E:E, Registros!A:A, \">=\" & fecha_inicial, Registros!A:A, \"<=\" & fecha_final,  Registros!B:B, \"=\" &A115))","v":0},{"$f":"IF(ISBLANK(A115), 0, SUMIFS(Registros!F:F, Registros!A:A, \">=\" & fecha_inicial, Registros!A:A, \"<=\" & fecha_final,  Registros!B:B, \"=\" &A115))","v":0},null,0]
[4107,"Código de cuenta incorrecto",null,{"$f":"IF(ISBLANK(A116),0, SUMIFS(Registros!F:F,Registros!A:A,\"<\"&fecha_inicial,Registros!B:B,\"=\"&A116)) - IF(ISBLANK(A116),0, SUMIFS(Registros!E:E,Registros!A:A,\"<\"&fecha_inicial,Registros!B:B,\"=\"&A116))","v":0},{"$f":"IF(ISBLANK(A116), 0, SUMIFS(Registros!E:E, Registros!A:A, \">=\" & fecha_inicial, Registros!A:A, \"<=\" & fecha_final,  Registros!B:B, \"=\" &A116))","v":0},{"$f":"IF(ISBLANK(A116), 0, SUMIFS(Registros!F:F, Registros!A:A, \">=\" & fecha_inicial, Registros!A:A, \"<=\" & fecha_final,  Registros!B:B, \"=\" &A116))","v":0},null,0]
[4200,"VENTAS DE CREDITO",null,{"$f":"SUM(D118:D124)","v":0},{"$f":"SUM(E118:E124)","v":0},{"$f":"SUM(F118:F124)","v":0},null,{"$f":"SUM(H118:H124)","v":0}]
[4201,"VENTA DE MERCANCÍAS AL CRÉDITO",null,{"$f":"IF(ISBLANK(A118),0, SUMIFS(Registros!F:F,Registros!A:A,\"<\"&fecha_inicial,Registros!B:B,\"=\"&A118)) - IF(ISBLANK(A118),0, SUMIFS(Registros!E:E,Registros!A:A,\"<\"&fecha_inicial,Registros!B:B,\"=\"&A118))","v":0},{"$f":"IF(ISBLANK(A118), 0, SUMIFS(Registros!E:E, Registros!A:A, \">=\" & fecha_inicial, Registros!A:A, \"<=\" & fecha_final,  Registros!B:B, \"=\" &A118))","v":0},{"$f":"IF(ISBLANK(A118), 0, SUMIFS(Registros!F:F, Registros!A:A, \">=\" & fecha_inicial, Registros!A:A, \"<=\" & fecha_final,  Registros!B:B, \"=\" &A118))","v":0},null,{"$f":"D118-E118+F118","v":0}]
[4202,"OTROS INGRESOS",null,{"$f":"IF(ISBLANK(A119),0, SUMIFS(Registros!F:F,Registros!A:A,\"<\"&fecha_inicial,Registros!B:B,\"=\"&A119)) - IF(ISBLANK(A119),0, SUMIFS(Registros!E:E,Registros!A:A,\"<\"&fecha_inicial,Registros!B:B,\"=\"&A119))","v":0},{"$f":"IF(ISBLANK(A119), 0, SUMIFS(Registros!E:E, Registros!A:A, \">=\" & fecha_inicial, Registros!A:A, \"<=\" & fecha_final,  Registros!B:B, \"=\" &A119))","v":0},{"$f":"IF(ISBLANK(A119), 0, SUMIFS(Registros!F:F, Registros!A:A, \">=\" & fecha_inicial, Registros!A:A, \"<=\" & fecha_final,  Registros!B:B, \"=\" &A119))","v":0},null,0]
[4203,"Código de cuenta incorrecto",null,{"$f":"IF(ISBLANK(A120),0, SUMIFS(Registros!F:F,Registros!A:A,\"<\"&fecha_inicial,Registros!B:B,\"=\"&A120)) - IF(ISBLANK(A120),0, SUMIFS(Registros!E:E,Registros!A:A,\"<\"&fecha_inicial,Registros!B:B,\"=\"&A120))","v":0},{"$f":"IF(ISBLANK(A120), 0, SUMIFS(Registros!E:E, Registros!A:A, \">=\" & fecha_inicial, Registros!A:A, \"<=\" & fecha_final,  Registros!B:B, \"=\" &A120))","v":0},{"$f":"IF(ISBLANK(A120), 0, SUMIFS(Registros!F:F, Registros!A:A, \">=\" & fecha_inicial, Registros!A:A, \"<=\" & fecha_final,  Registros!B:B, \"=\" &A120))","v":0},null,0]
[4204,"Código de cuenta incorrecto",null,{"$f":"IF(ISBLANK(A121),0, SUMIFS(Registros!F:F,Registros!A:A,\"<\"&fecha_inicial,Registros!B:B,\"=\"&A121)) - IF(ISBLANK(A121),0, SUMIFS(Registros!E:E,Registros!A:A,\"<\"&fecha_inicial,Registros!B:B,\"=\"&A121))","v":0},{"$f":"IF(ISBLANK(A121), 0, SUMIFS(Registros!E:E, Registros!A:A, \">=\" & fecha_inicial, Registros!A:A, \"<=\" & fecha_final,  Registros!B:B, \"=\" &A121))","v":0},{"$f":"IF(ISBLANK(A121), 0, SUMIFS(Registros!F:F, Registros!A:A, \">=\" & fecha_inicial, Registros!A:A, \"<=\" & fecha_final,  Registros!B:B, \"=\" &A121))","v":0},null,0]
[4205,"Código de cuenta incorrecto",null,{"$f":"IF(ISBLANK(A122),0, SUMIFS(Registros!F:F,Registros!A:A,\"<\"&fecha_inicial,Registros!B:B,\"=\"&A122)) - IF(ISBLANK(A122),0, SUMIFS(Registros!E:E,Registros!A:A,\"<\"&fecha_inicial,Registros!B:B,\"=\"&A122))","v":0},{"$f":"IF(ISBLANK(A122), 0, SUMIFS(Registros!E:E, Registros!A:A, \">=\" & fecha_inicial, Registros!A:A, \"<=\" & fecha_final,  Registros!B:B, \"=\" &A122))","v":0},{"$f":"IF(ISBLANK(A122), 0, SUMIFS(Registros!F:F, Registros!A:A, \">=\" & fecha_inicial, Registros!A:A, \"<=\" & fecha_final,  Registros!B:B, \"=\" &A122))","v":0},null,0]
[4206,"Código de cuenta incorrecto",null,{"$f":"IF(ISBLANK(A123),0, SUMIFS(Registros!F:F,Registros!A:A,\"<\"&fecha_inicial,Registros!B:B,\"=\"&A123)) - IF(ISBLANK(A123),0, SUMIFS(Registros!E:E,Registros!A:A,\"<\"&fecha_inicial,Registros!B:B,\"=\"&A123))","v":0},{"$f":"IF(ISBLANK(A123), 0, SUMIFS(Registros!E:E, Registros!A:A, \">=\" & fecha_inicial, Registros!A:A, \"<=\" & fecha_final,  Registros!B:B, \"=\" &A123))","v":0},{"$f":"IF(ISBLANK(A123), 0, SUMIFS(Registros!F:F, Registros!A:A, \">=\" & fecha_inicial, Registros!A:A, \"<=\" & fecha_final,  Registros!B:B, \"=\" &A123))","v":0},null,0]
[4207,"Código de cuenta incorrecto",null,{"$f":"IF(ISBLANK(A124),0, SUMIFS(Registros!F:F,Registros!A:A,\"<\"&fecha_inicial,Registros!B:B,\"=\"&A124)) - IF(ISBLANK(A124),0, SUMIFS(Registros!E:E,Registros!A:A,\"<\"&fecha_inicial,Registros!B:B,\"=\"&A124))","v":0},{"$f":"IF(ISBLANK(A124), 0, SUMIFS(Registros!E:E, Registros!A:A, \">=\" & fecha_inicial, Registros!A:A, \"<=\" & fecha_final,  Registros!B:B, \"=\" &A124))","v":0},{"$f":"IF(ISBLANK(A124), 0, SUMIFS(Registros!F:F, Registros!A:A, \">=\" & fecha_inicial, Registros!A:A, \"<=\" & fecha_final,  Registros!B:B, \"=\" &A124))","v":0},null,0]
[5100,"COSTO DE VENTAS",{"$f":"SUM(C126:C132)","v":0},null,{"$f":"SUM(E126:E132)","v":0},0,0]
[5101,"COSTO DE BIENES",{"$f":"IF(ISBLANK(A126),0, SUMIFS(Registros!E:E,Registros!A:A,\"<\"&fecha_inicial,Registros!B:B,\"=\"&A126)) - IF(ISBLANK(A126),0, SUMIFS(Registros!F:F,Registros!A:A,\"<\"&fecha_inicial,Registros!B:B,\"=\"&A126))","v":0},null,{"$f":"IF(ISBLANK(A126), 0, SUMIFS(Registros!E:E, Registros!A:A, \">=\" & fecha_inicial, Registros!A:A, \"<=\" & fecha_final,  Registros!B:B, \"=\" & A126))","v":0},{"$f":"IF(ISBLANK(A126), 0, SUMIFS(Registros!F:F, Registros!A:A, \">=\" & fecha_inicial, Registros!A:A, \"<=\" & fecha_final,  Registros!B:B, \"=\" & A126))","v":0},{"$f":"C126+E126-F126","v":0}]
[5102,"OTROS COSTOS",{"$f":"IF(ISBLANK(A127),0, SUMIFS(Registros!E:E,Registros!A:A,\"<\"&fecha_inicial,Registros!B:B,\"=\"&A127)) - IF(ISBLANK(A127),0, SUMIFS(Registros!F:F,Registros!A:A,\"<\"&fecha_inicial,Registros!B:B,\"=\"&A127))","v":0},null,{"$f":"IF(ISBLANK(A127), 0, SUMIFS(Registros!E:E, Registros!A:A, \">=\" & fecha_inicial, Registros!A:A, \"<=\" & fecha_final,  Registros!B:B, \"=\" & A127))","v":0},{"$f":"IF(ISBLANK(A127), 0, SUMIFS(Registros!F:F, Registros!A:A, \">=\" & fecha_inicial, Registros!A:A, \"<=\" & fecha_final,  Registros!B:B, \"=\" & A127))","v":0},{"$f":"C127+E127-F127","v":0}]
[5103,"Código de cuenta incorrecto",{"$f":"IF(ISBLANK(A128),0, SUMIFS(Registros!E:E,Registros!A:A,\"<\"&fecha_inicial,Registros!B:B,\"=\"&A128)) - IF(ISBLANK(A128),0, SUMIFS(Registros!F:F,Registros!A:A,\"<\"&fecha_inicial,Registros!B:B,\"=\"&A128))","v":0},null,{"$f":"IF(ISBLANK(A128), 0, SUMIFS(Registros!E:E, Registros!A:A, \">=\" & fecha_inicial, Registros!A:A, \"<=\" & fecha_final,  Registros!B:B, \"=\" & A128))","v":0},{"$f":"IF(ISBLANK(A128), 0, SUMIFS(Registros!F:F, Registros!A:A, \">=\" & fecha_inicial, Registros!A:A, \"<=\" & fecha_final,  Registros!B:B, \"=\" & A128))","v":0},0]
[5104,"Código de cuenta incorrecto",{"$f":"IF(ISBLANK(A129),0, SUMIFS(Registros!E:E,Registros!A:A,\"<\"&fecha_inicial,Registros!B:B,\"=\"&A129)) - IF(ISBLANK(A129),0, SUMIFS(Registros!F:F,Registros!A:A,\"<\"&fecha_inicial,Registros!B:B,\"=\"&A129))","v":0},null,{"$f":"IF(ISBLANK(A129), 0, SUMIFS(Registros!E:E, Registros!A:A, \">=\" & fecha_inicial, Registros!A:A, \"<=\" & fecha_final,  Registros!B:B, \"=\" & A129))","v":0},{"$f":"IF(ISBLANK(A129), 0, SUMIFS(Registros!F:F, Registros!A:A, \">=\" & fecha_inicial, Registros!A:A, \"<=\" & fecha_final,  Registros!B:B, \"=\" & A129))","v":0},0]
[5105,"Código de cuenta incorrecto",{"$f":"IF(ISBLANK(A130),0, SUMIFS(Registros!E:E,Registros!A:A,\"<\"&fecha_inicial,Registros!B:B,\"=\"&A130)) - IF(ISBLANK(A130),0, SUMIFS(Registros!F:F,Registros!A:A,\"<\"&fecha_inicial,Registros!B:B,\"=\"&A130))","v":0},null,{"$f":"IF(ISBLANK(A130), 0, SUMIFS(Registros!E:E, Registros!A:A, \">=\" & fecha_inicial, Registros!A:A, \"<=\" & fecha_final,  Registros!B:B, \"=\" & A130))","v":0},{"$f":"IF(ISBLANK(A130), 0, SUMIFS(Registros!F:F, Registros!A:A, \">=\" & fecha_inicial, Registros!A:A, \"<=\" & fecha_final,  Registros!B:B, \"=\" & A130))","v":0},0]
[5106,"Código de cuenta incorrecto",{"$f":"IF(ISBLANK(A131),0, SUMIFS(Registros!E:E,Registros!A:A,\"<\"&fecha_inicial,Registros!B:B,\"=\"&A131)) - IF(ISBLANK(A131),0, SUMIFS(Registros!F:F,Registros!A:A,\"<\"&fecha_inicial,Registros!B:B,\"=\"&A131))","v":0},null,{"$f":"IF(ISBLANK(A131), 0, SUMIFS(Registros!E:E, Registros!A:A, \">=\" & fecha_inicial, Registros!A:A, \"<=\" & fecha_final,  Registros!B:B, \"=\" & A131))","v":0},{"$f":"IF(ISBLANK(A131), 0, SUMIFS(Registros!F:F, Registros!A:A, \">=\" & fecha_inicial, Registros!A:A, \"<=\" & fecha_final,  Registros!B:B, \"=\" & A131))","v":0},0]
[5107,"Código de cuenta incorrecto",{"$f":"IF(ISBLANK(A132),0, SUMIFS(Registros!E:E,Registros!A:A,\"<\"&fecha_inicial,Registros!B:B,\"=\"&A132)) - IF(ISBLANK(A132),0, SUMIFS(Registros!F:F,Registros!A:A,\"<\"&fecha_inicial,Registros!B:B,\"=\"&A132))","v":0},null,{"$f":"IF(ISBLANK(A132), 0, SUMIFS(Registros!E:E, Registros!A:A, \">=\" & fecha_inicial, Registros!A:A, \"<=\" & fecha_final,  Registros!B:B, \"=\" & A132))","v":0},{"$f":"IF(ISBLANK(A132), 0, SUMIFS(Registros!F:F, Registros!A:A, \">=\" & fecha_inicial, Registros!A:A, \"<=\" & fecha_final,  Registros!B:B, \"=\" & A132))","v":0},0]
[6100,"GASTOS OPERATIVOS",{"$f":"SUM(C134:C135)","v":0},null,{"$f":"SUM(E134:E135)","v":0},0,0]
[6101,"GASTOS DE ADMINISTRACIÓN",{"$f":"IF(ISBLANK(A134),0, SUMIFS(Registros!E:E,Registros!A:A,\"<\"&fecha_inicial,Registros!B:B,\"=\"&A134)) - IF(ISBLANK(A134),0, SUMIFS(Registros!F:F,Registros!A:A,\"<\"&fecha_inicial,Registros!B:B,\"=\"&A134))","v":0},null,{"$f":"IF(ISBLANK(A134), 0, SUMIFS(Registros!E:E, Registros!A:A, \">=\" & fecha_inicial, Registros!A:A, \"<=\" & fecha_final,  Registros!B:B, \"=\" & A134))","v":0},{"$f":"IF(ISBLANK(A134), 0, SUMIFS(Registros!F:F, Registros!A:A, \">=\" & fecha_inicial, Registros!A:A, \"<=\" & fecha_final,  Registros!B:B, \"=\" & A134))","v":0},{"$f":"C134+E134-F134","v":0}]
[6102,"GASTOS DE VENTAS",{"$f":"IF(ISBLANK(A135),0, SUMIFS(Registros!E:E,Registros!A:A,\"<\"&fecha_inicial,Registros!B:B,\"=\"&A135)) - IF(ISBLANK(A135),0, SUMIFS(Registros!F:F,Registros!A:A,\"<\"&fecha_inicial,Registros!B:B,\"=\"&A135))","v":0},null,{"$f":"IF(ISBLANK(A135), 0, SUMIFS(Registros!E:E, Registros!A:A, \">=\" & fecha_inicial, Registros!A:A, \"<=\" & fecha_final,  Registros!B:B, \"=\" & A135))","v":0},{"$f":"IF(ISBLANK(A135), 0, SUMIFS(Registros!F:F, Registros!A:A, \">=\" & fecha_inicial, Registros!A:A, \"<=\" & fecha_final,  Registros!B:B, \"=\" & A135))","v":0},{"$f":"C135+E135-F135","v":0}]
[6200,"DEPRECIACIÓN Y AMORTIZACIÓN",{"$f":"SUM(C137:C138)","v":0},null,{"$f":"SUM(E137:E138)","v":0},{"$f":"SUM(F137:F138)","v":0},{"$f":"SUM(G137:G138)","v":0}]
[6201,"GASTOS POR DEPRECIACIÓN",{"$f":"IF(ISBLANK(A137),0, SUMIFS(Registros!E:E,Registros!A:A,\"<\"&fecha_inicial,Registros!B:B,\"=\"&A137)) - IF(ISBLANK(A137),0, SUMIFS(Registros!F:F,Registros!A:A,\"<\"&fecha_inicial,Registros!B:B,\"=\"&A137))","v":0},null,{"$f":"IF(ISBLANK(A137), 0, SUMIFS(Registros!E:E, Registros!A:A, \">=\" & fecha_inicial, Registros!A:A, \"<=\" & fecha_final,  Registros!B:B, \"=\" & A137))","v":0},{"$f":"IF(ISBLANK(A137), 0, SUMIFS(Registros!F:F, Registros!A:A, \">=\" & fecha_inicial, Registros!A:A, \"<=\" & fecha_final,  Registros!B:B, \"=\" & A137))","v":0},{"$f":"C137+E137-F137","v":0}]
[6202,"GASTOS POR AMORTIZACIÓN",{"$f":"IF(ISBLANK(A138),0, SUMIFS(Registros!E:E,Registros!A:A,\"<\"&fecha_inicial,Registros!B:B,\"=\"&A138)) - IF(ISBLANK(A138),0, SUMIFS(Registros!F:F,Registros!A:A,\"<\"&fecha_inicial,Registros!B:B,\"=\"&A138))","v":0},null,{"$f":"IF(ISBLANK(A138), 0, SUMIFS(Registros!E:E, Registros!A:A, \">=\" & fecha_inicial, Registros!A:A, \"<=\" & fecha_final,  Registros!B:B, \"=\" & A138))","v":0},{"$f":"IF(ISBLANK(A138), 0, SUMIFS(Registros!F:F, Registros!A:A, \">=\" & fecha_inicial, Registros!A:A, \"<=\" & fecha_final,  Registros!B:B, \"=\" & A138))","v":0},0]
[6300,"GASTOS FINANCIEROS",{"$f":"C140","v":0},null,{"$f":"E140","v":0},0,0]
[6301,"GASTO POR INTERESES",{"$f":"IF(ISBLANK(A140),0, SUMIFS(Registros!E:E,Registros!A:A,\"<\"&fecha_inicial,Registros!B:B,\"=\"&A140)) - IF(ISBLANK(A140),0, SUMIFS(Registros!F:F,Registros!A:A,\"<\"&fecha_inicial,Registros!B:B,\"=\"&A140))","v":0},null,{"$f":"IF(ISBLANK(A140), 0, SUMIFS(Registros!E:E, Registros!A:A, \">=\" & fecha_inicial, Registros!A:A, \"<=\" & fecha_final,  Registros!B:B, \"=\" & A140))","v":0},{"$f":"IF(ISBLANK(A140), 0, SUMIFS(Registros!F:F, Registros!A:A, \">=\" & fecha_inicial, Registros!A:A, \"<=\" & fecha_final,  Registros!B:B, \"=\" & A140))","v":0},{"$f":"C140+E140-F140","v":0}]
[6400,"IMPUESTOS",{"$f":"C142","v":0},null,{"$f":"E142","v":0},0,0]
[6401,"IMPUESTOS SOBRE LA RENTA",{"$f":"IF(ISBLANK(A142),0, SUMIFS(Registros!E:E,Registros!A:A,\"<\"&fecha_inicial,Registros!B:B,\"=\"&A142)) - IF(ISBLANK(A142),0, SUMIFS(Registros!F:F,Registros!A:A,\"<\"&fecha_inicial,Registros!B:B,\"=\"&A142))","v":0},null,{"$f":"IF(ISBLANK(A142), 0, SUMIFS(Registros!E:E, Registros!A:A, \">=\" & fecha_inicial, Registros!A:A, \"<=\" & fecha_final,  Registros!B:B, \"=\" & A142))","v":0},{"$f":"IF(ISBLANK(A142), 0, SUMIFS(Registros!F:F, Registros!A:A, \">=\" & fecha_inicial, Registros!A:A, \"<=\" & fecha_final,  Registros!B:B, \"=\" & A142))","v":0},{"$f":"C142+E142-F142","v":0}]
["TOTALES",null,{"$f":"C11+C125+C133+C136+C139+C141","v":0},{"$f":"D60+D63+D91+D108","v":0},{"$f":"E11+E125+E133+E136+E139+E141+E60+E63+E91+E108","v":0},{"$f":"F11+F125+F133+F136+F139+F141+F60+F63+F91+F108","v":0},{"$f":"G11+G125+G133+G136+G139+G141","v":0},{"$f":"H60+H63+H91+H108","v":0}]
[null,null,null,{"$f":"C143-D143","v":0},null,{"$f":"E143-F143","v":0},null,{"$f":"G143-H143","v":0}]
[]
[]
[]
[]
[]
[null,"Elabora",null,null,null,"Revisa"]
[null,{"$f":"VLOOKUP(B150, Usuarios!B12:D14, 2, FALSE)","v":"Arlen de Jesús Baltodano López"},null,null,null,{"$f":"VLOOKUP(F150, Usuarios!B12:D14, 2, FALSE)","v":"Gersan Arguello Prado"}]
[null,{"$f":"VLOOKUP(B150, Usuarios!B12:E14, 4, FALSE)","v":"Auxiliar de Contabilidad"},null,null,null,{"$f":"VLOOKUP(F150, Usuarios!B12:E14, 4, FALSE)","v":"Contador General"}]
[null,null,"Autoriza"]
[null,null,{"$f":"VLOOKUP(C153, Usuarios!B12:D14, 2, FALSE)","v":"Matilda Padilla Mayorga"}]
[null,null,{"$f":"VLOOKUP(C153, Usuarios!B12:E14, 4, FALSE)","v":"Gerente de Finanzas"}]

{"sheet":"02","index":11,"n_rows":47,"n_cols":5,"rows_kept":47,"cut":false,"hidden":false,"merged":[[40,3,40,4],[41,3,41,4],[42,3,42,4],[2,0,2,4],[3,0,3,4],[4,0,4,4],[5,0,5,4],[7,0,8,0],[7,1,8,1],[7,2,8,2],[7,3,8,3],[7,4,8,4]]}
[]
[]
[{"$f":"D!A2","v":"CONSULTORES DE OMETEPE"}]
["ESTADO DE RESULTADOS CONSOLIDADO"]
[{"$f":"D!A4","v":"DEL 00 DE ENERO AL 00 DE ENERO DE 1900"}]
[{"$f":"D!A5","v":"Barrio el Progreso, San Jorge, Rivas. *** Tel/Fax:  89040457 *** escribeme@radioometepe.com"}]
[]
["CODIGO","CUENTA",{"$f":"\"SALDO ACUMULADO AL \"&TEXT(fecha_inicial-1,\"dd-mm-yy\")","v":{"$error":"#VALUE!"}},"MES ACTUAL",{"$f":"\"SALDO ACUMULADO AL \"&TEXT(fecha_final, \"DD-MM-YY\")","v":"SALDO ACUMULADO AL 00-01-00"}]
[null,{"$f":"IF(A9<>0, IF(ISERROR(VLOOKUP(A9, PlanCuentas,2, FALSE)), \"Código de Cuenta Incorrecto\", UPPER(VLOOKUP(A9, PlanCuentas, 2, FALSE))), \"\")","v":""}]
[]
[4000,{"$f":"IF(ISBLANK(A11), \"\", IFERROR(VLOOKUP(A11, plan_cuentas, 2, FALSE), \"Código de cuenta incorrecto\"))","v":"INGRESOS"},{"$f":"SUM(C12:C13)","v":0},{"$f":"SUM(D12:D13)","v":0},{"$f":"SUM(E12:E13)","v":0}]
[4100,{"$f":"IF(ISBLANK(A12), \"\", IFERROR(VLOOKUP(A12, plan_cuentas, 2, FALSE), \"Código de cuenta incorrecto\"))","v":"VENTAS DE CONTADO"},{"$f":"'4000'!C11","v":0},{"$f":"'4000'!E11-'4000'!D11","v":0},{"$f":"C12+D12","v":0}]
[4200,{"$f":"IF(ISBLANK(A13), \"\", IFERROR(VLOOKUP(A13, plan_cuentas, 2, FALSE), \"Código de cuenta incorrecto\"))","v":"VENTAS DE CREDITO"},{"$f":"'4000'!C27","v":0},{"$f":"'4000'!E27-'4000'!D27","v":0},{"$f":"C13+D13","v":0}]
[5100,{"$f":"IF(ISBLANK(A14), \"\", IFERROR(VLOOKUP(A14, plan_cuentas, 2, FALSE), \"Código de cuenta incorrecto\"))","v":"COSTO DE VENTAS"},{"$f":"'5000'!C11","v":0},{"$f":"'5000'!D11-'5000'!E11","v":0},{"$f":"C14+D14","v":0}]
[null,"UTILIDAD BRUTA",{"$f":"C11-C14","v":0},{"$f":"D11-D14","v":0},{"$f":"E11-E14","v":0}]
[6100,{"$f":"IF(ISBLANK(A16), \"\", IFERROR(VLOOKUP(A16, plan_cuentas, 2, FALSE), \"Código de cuenta incorrecto\"))","v":"GASTOS OPERATIVOS"},{"$f":"SUM(C17:C20)","v":0},{"$f":"SUM(D17:D20)","v":0},{"$f":"SUM(E17:E20)","v":0}]
[6101,{"$f":"IF(ISBLANK(A17), \"\", IFERROR(VLOOKUP(A17, plan_cuentas, 2, FALSE), \"Código de cuenta incorrecto\"))","v":"GASTOS DE ADMINISTRACIÓN"},{"$f":"'6000'!C12","v":0},{"$f":"'6000'!D12-'6000'!E12","v":0},{"$f":"C17+D17","v":0}]
[6102,{"$f":"IF(ISBLANK(A18), \"\", IFERROR(VLOOKUP(A18, plan_cuentas, 2, FALSE), \"Código de cuenta incorrecto\"))","v":"GASTOS DE VENTAS"},{"$f":"'6000'!C13","v":0},{"$f":"'6000'!D13-'6000'!E13","v":0},{"$f":"C18+D18","v":0}]
[6201,{"$f":"IF(ISBLANK(A19), \"\", IFERROR(VLOOKUP(A19, plan_cuentas, 2, FALSE), \"Código de cuenta incorrecto\"))","v":"GASTOS POR DEPRECIACIÓN"},{"$f":"'6000'!C28","v":0},{"$f":"'6000'!D28-'6000'!E28","v":0},{"$f":"C19+D19","v":0}]
[6202,{"$f":"IF(ISBLANK(A20), \"\", IFERROR(VLOOKUP(A20, plan_cuentas, 2, FALSE), \"Código de cuenta incorrecto\"))","v":"GASTOS POR AMORTIZACIÓN"},{"$f":"'6000'!C29","v":0},{"$f":"'6000'!D29-'6000'!E29","v":0},{"$f":"C20+D20","v":0}]
[null,"UTILIDAD ANTES DE INTERESES E IMPUESTOS",{"$f":"C15-C16","v":0},{"$f":"D15-D16","v":0},{"$f":"E15-E16","v":0}]
[6301,{"$f":"IF(ISBLANK(A22), \"\", IFERROR(VLOOKUP(A22, plan_cuentas, 2, FALSE), \"Código de cuenta incorrecto\"))","v":"GASTO POR INTERESES"},{"$f":"'6000'!C44","v":0},{"$f":"'6000'!D44-'6000'!E44","v":0},{"$f":"C22+D22","v":0}]
[null,"UTILIDAD ANTES DE IMPUESTOS",{"$f":"C21-C22","v":0},{"$f":"D21-D22","v":0},{"$f":"E21-E22","v":0}]
[6401,{"$f":"IF(ISBLANK(A24), \"\", IFERROR(VLOOKUP(A24, plan_cuentas, 2, FALSE), \"Código de cuenta incorrecto\"))","v":"IMPUESTOS SOBRE LA RENTA"},{"$f":"'6000'!C60","v":0},{"$f":"'6000'!D60-'6000'!E60","v":0},{"$f":"C24+D24","v":0}]
[null,"UTILIDAD NETA DESPUÉS DE IMPUESTOS",{"$f":"C23-C24","v":0},{"$f":"D23-D24","v":0},{"$f":"E23-E24","v":0}]
[null,"RETIROS EN EFECTIVO",{"$f":"SUMIFS(Registros!E:E, Registros!A:A, \">=\" & DATE(TEXT(fecha_inicial, \"YYYY\"), 1, 1), Registros!A:A, \"<=\" & fecha_final, Registros!B:B, \"=\" & A26)","v":0},{"$f":"'3000'!D16","v":0},{"$f":"C26+D26","v":0}]
[3105,{"$f":"IF(ISBLANK(A27), \"\", IFERROR(VLOOKUP(A27, plan_cuentas, 2, FALSE), \"Código de cuenta incorrecto\"))","v":"UTILIDAD DEL EJERCICIO"},{"$f":"C25-C26","v":0},{"$f":"D25-D26","v":0},{"$f":"E25-E26","v":0}]
[null,""]
[null,""]
[null,""]
[null,""]
[null,""]
[null,""]
[]
[]
[]
[]
[]
[]
[]
[null,"Elabora",null,"Revisa"]
[null,{"$f":"VLOOKUP(B41, Usuarios!B12:D14, 2, FALSE)","v":"Arlen de Jesús Baltodano López"},null,{"$f":"VLOOKUP(D41, Usuarios!B12:D14, 2, FALSE)","v":"Gersan Arguello Prado"}]
[null,{"$f":"VLOOKUP(B41, Usuarios!B12:D14, 3, FALSE)","v":0},null,{"$f":"VLOOKUP(D41, Usuarios!B12:D14, 3, FALSE)","v":0}]
[]
[null,null,"Autoriza"]
[null,null,{"$f":"VLOOKUP(C45, Usuarios!B12:D14, 2, FALSE)","v":"Matilda Padilla Mayorga"}]
[null,null,{"$f":"VLOOKUP(C45, Usuarios!B12:D14, 3, FALSE)","v":0}]

{"sheet":"03","index":12,"n_rows":61,"n_cols":6,"rows_kept":61,"cut":false,"hidden":false,"merged":[[55,4,55,5],[57,2,57,3],[58,1,58,5],[59,1,59,5],[60,1,60,5],[54,4,54,5],[2,0,2,5],[3,0,3,5],[4,0,4,5],[5,0,5,5],[53,4,53,5]]}
[]
[]
[{"$f":"D!A2","v":"CONSULTORES DE OMETEPE"}]
["BALANCE GENERAL CONSOLIDADO"]
[{"$f":"D!A4","v":"DEL 00 DE ENERO AL 00 DE ENERO DE 1900"}]
[{"$f":"D!A5","v":"Barrio el Progreso, San Jorge, Rivas. *** Tel/Fax:  89040457 *** escribeme@radioometepe.com"}]
[]
[]
[]
[]
["CÓDIGO","ACTIVOS",null,"CÓDIGO","PASIVO Y PATRIMONIO"]
[1100,{"$f":"IF(ISBLANK(A12),\"\",IFERROR(VLOOKUP(A12,Cuentas!B:F,2,FALSE),\"Código incorrecto\"))","v":"ACTIVOS CIRCULANTES"},null,2100,{"$f":"IF(ISBLANK(D12), \"\", IFERROR(VLOOKUP(D12, Cuentas!B:F, 2, FALSE), \"Código incorrecto\"))","v":"PASIVOS CIRCULANTES"}]
[1101,{"$f":"IF(ISBLANK(A13),\"\",IFERROR(VLOOKUP(A13,Cuentas!B:F,2,FALSE),\"Código incorrecto\"))","v":"CAJA"},{"$f":"'1000'!F12","v":0},2101,{"$f":"IF(ISBLANK(D13), \"\", IFERROR(VLOOKUP(D13, Cuentas!B:F, 2, FALSE), \"Código incorrecto\"))","v":"PROVEEDORES"},{"$f":"'2000'!F12","v":0}]
[1102,{"$f":"IF(ISBLANK(A14),\"\",IFERROR(VLOOKUP(A14,Cuentas!B:F,2,FALSE),\"Código incorrecto\"))","v":"FONDO FIJO DE CAJA CHICA"},{"$f":"'1000'!F13","v":0},2102,{"$f":"IF(ISBLANK(D14), \"\", IFERROR(VLOOKUP(D14, Cuentas!B:F, 2, FALSE), \"Código incorrecto\"))","v":"DOCUMENTOS POR PAGAR"},{"$f":"'2000'!F13","v":0}]
[1103,{"$f":"IF(ISBLANK(A15),\"\",IFERROR(VLOOKUP(A15,Cuentas!B:F,2,FALSE),\"Código incorrecto\"))","v":"BANCOS"},{"$f":"'1000'!F14","v":0},2103,{"$f":"IF(ISBLANK(D15), \"\", IFERROR(VLOOKUP(D15, Cuentas!B:F, 2, FALSE), \"Código incorrecto\"))","v":"ACREEDORES"},{"$f":"'2000'!F14","v":0}]
[1104,{"$f":"IF(ISBLANK(A16),\"\",IFERROR(VLOOKUP(A16,Cuentas!B:F,2,FALSE),\"Código incorrecto\"))","v":"INVERSIONES TEMPORALES"},{"$f":"'1000'!F15","v":0},2104,{"$f":"IF(ISBLANK(D16), \"\", IFERROR(VLOOKUP(D16, Cuentas!B:F, 2, FALSE), \"Código incorrecto\"))","v":"ACREEDORES BANCARIOS"},{"$f":"'2000'!F15","v":0}]
[1105,{"$f":"IF(ISBLANK(A17),\"\",IFERROR(VLOOKUP(A17,Cuentas!B:F,2,FALSE),\"Código incorrecto\"))","v":"CLIENTES"},{"$f":"'1000'!F16","v":0},2105,{"$f":"IF(ISBLANK(D17), \"\", IFERROR(VLOOKUP(D17, Cuentas!B:F, 2, FALSE), \"Código incorrecto\"))","v":"ANTICIPOS DE CLIENTES"},{"$f":"'2000'!F16","v":0}]
[1106,{"$f":"IF(ISBLANK(A18),\"\",IFERROR(VLOOKUP(A18,Cuentas!B:F,2,FALSE),\"Código incorrecto\"))","v":"DOCUMENTOS POR COBRAR"},{"$f":"'1000'!F17","v":0},2106,{"$f":"IF(ISBLANK(D18), \"\", IFERROR(VLOOKUP(D18, Cuentas!B:F, 2, FALSE), \"Código incorrecto\"))","v":"IVA POR PAGAR"},{"$f":"'2000'!F17","v":0}]
[1107,{"$f":"IF(ISBLANK(A19),\"\",IFERROR(VLOOKUP(A19,Cuentas!B:F,2,FALSE),\"Código incorrecto\"))","v":"CUENTAS POR COBRAR A EMPLEADOS"},{"$f":"'1000'!F18","v":0},2107,{"$f":"IF(ISBLANK(D19), \"\", IFERROR(VLOOKUP(D19, Cuentas!B:F, 2, FALSE), \"Código incorrecto\"))","v":"IR POR PAGAR"},{"$f":"'2000'!F18","v":0}]
[1108,{"$f":"IF(ISBLANK(A20),\"\",IFERROR(VLOOKUP(A20,Cuentas!B:F,2,FALSE),\"Código incorrecto\"))","v":"IVA ACREDITABLE"},{"$f":"'1000'!F19","v":0},2108,{"$f":"IF(ISBLANK(D20), \"\", IFERROR(VLOOKUP(D20, Cuentas!B:F, 2, FALSE), \"Código incorrecto\"))","v":"RENTAS COBRADAS POR ANTICIPADO"},{"$f":"'2000'!F19","v":0}]
[1109,{"$f":"IF(ISBLANK(A21),\"\",IFERROR(VLOOKUP(A21,Cuentas!B:F,2,FALSE),\"Código incorrecto\"))","v":"ANTICIPO DE IMPUESTOS"},{"$f":"'1000'!F20","v":0},2109,{"$f":"IF(ISBLANK(D21), \"\", IFERROR(VLOOKUP(D21, Cuentas!B:F, 2, FALSE), \"Código incorrecto\"))","v":"INTERESES COBRADOS POR ANTICIPADOS"},{"$f":"'2000'!F20","v":0}]
[1110,{"$f":"IF(ISBLANK(A22),\"\",IFERROR(VLOOKUP(A22,Cuentas!B:F,2,FALSE),\"Código incorrecto\"))","v":"INVENTARIOS"},{"$f":"'1000'!F21","v":0},null,"SUB TOTAL PASIVOS  DE CORTO PLAZO",{"$f":"SUM(F13:F21)","v":0}]
[1111,{"$f":"IF(ISBLANK(A23),\"\",IFERROR(VLOOKUP(A23,Cuentas!B:F,2,FALSE),\"Código incorrecto\"))","v":"ANTICIPO A PROVEEDORES"},{"$f":"'1000'!F22","v":0},2200,{"$f":"IF(ISBLANK(D23), \"\", VLOOKUP(D23, Cuentas!B:F, 2, FALSE))","v":"PASIVOS FIJOS"}]
[1112,{"$f":"IF(ISBLANK(A24),\"\",IFERROR(VLOOKUP(A24,Cuentas!B:F,2,FALSE),\"Código incorrecto\"))","v":"RENTAS PAGADAS POR ANTICIPADO"},{"$f":"'1000'!F23","v":0},2201,{"$f":"IF(ISBLANK(D24), \"\", IFERROR(VLOOKUP(D24, Cuentas!B:F, 2, FALSE), \"Código incorrecto\"))","v":"ACREEDORES HIPOTECARIOS"},{"$f":"'2000'!F28","v":0}]
[1113,{"$f":"IF(ISBLANK(A25),\"\",IFERROR(VLOOKUP(A25,Cuentas!B:F,2,FALSE),\"Código incorrecto\"))","v":"INTERESES PAGADOS POR ANTICIPADO"},{"$f":"'1000'!F24","v":0},2202,{"$f":"IF(ISBLANK(D25), \"\", IFERROR(VLOOKUP(D25, Cuentas!B:F, 2, FALSE), \"Código incorrecto\"))","v":"ACREEDORES BANCARIOS"},{"$f":"'2000'!F29","v":0}]
[null,"SUB TOTAL ACTIVOS CIRCULANTES",{"$f":"SUM(C13:C25)","v":0},2203,{"$f":"IF(ISBLANK(D26), \"\", IFERROR(VLOOKUP(D26, Cuentas!B:F, 2, FALSE), \"Código incorrecto\"))","v":"DOCUMENTOS POR PAGAR L/P"},{"$f":"'2000'!F30","v":0}]
[1200,{"$f":"IF(ISBLANK(A27),\"\",IFERROR(VLOOKUP(A27,Cuentas!B:F,2,FALSE),\"Código incorrecto\"))","v":"ACTIVOS FIJOS"},null,null,"SUB TOTAL PASIVOS DE LARGO PLAZO",{"$f":"F16+F26","v":0}]
[1201,{"$f":"IF(ISBLANK(A28),\"\",IFERROR(VLOOKUP(A28,Cuentas!B:F,2,FALSE),\"Código incorrecto\"))","v":"TERRENOS"},{"$f":"'1000'!F28","v":0},null,"TOTAL PASIVOS",{"$f":"F22+F27","v":0}]
[1202,{"$f":"IF(ISBLANK(A29),\"\",IFERROR(VLOOKUP(A29,Cuentas!B:F,2,FALSE),\"Código incorrecto\"))","v":"EDIFICIOS"},{"$f":"'1000'!F29","v":0},3000,{"$f":"IF(ISBLANK(D29), \"\", IFERROR(VLOOKUP(D29, Cuentas!B:F, 2, FALSE), \"Código incorrecto\"))","v":"CAPITAL CONTABLE"}]
[1203,{"$f":"IF(ISBLANK(A30),\"\",IFERROR(VLOOKUP(A30,Cuentas!B:F,2,FALSE),\"Código incorrecto\"))","v":"MAQUINARIA"},{"$f":"'1000'!F30","v":0},3100,{"$f":"IF(ISBLANK(D30), \"\", IFERROR(VLOOKUP(D30, Cuentas!B:F, 2, FALSE), \"Código incorrecto\"))","v":"CAPITAL SOCIAL"}]
[1204,{"$f":"IF(ISBLANK(A31),\"\",IFERROR(VLOOKUP(A31,Cuentas!B:F,2,FALSE),\"Código incorrecto\"))","v":"MOBILIARIO Y EQUIPO DE OFICINA"},{"$f":"'1000'!F31","v":0},3101,{"$f":"IF(ISBLANK(D31), \"\", IFERROR(VLOOKUP(D31, Cuentas!B:F, 2, FALSE), \"Código incorrecto\"))","v":"CAPITAL INICIAL"},{"$f":"'3000'!F12","v":0}]
[1205,{"$f":"IF(ISBLANK(A32),\"\",IFERROR(VLOOKUP(A32,Cuentas!B:F,2,FALSE),\"Código incorrecto\"))","v":"MUEBLES Y ENSERES"},{"$f":"'1000'!F32","v":0},3102,{"$f":"IF(ISBLANK(D32), \"\", IFERROR(VLOOKUP(D32, Cuentas!B:F, 2, FALSE), \"Código incorrecto\"))","v":"APORTACIONES"},{"$f":"'3000'!F13","v":0}]
[1206,{"$f":"IF(ISBLANK(A33),\"\",IFERROR(VLOOKUP(A33,Cuentas!B:F,2,FALSE),\"Código incorrecto\"))","v":"EQUIPO DE TRANSPORTE"},{"$f":"'1000'!F33","v":0},3103,{"$f":"IF(ISBLANK(D33), \"\", IFERROR(VLOOKUP(D33, Cuentas!B:F, 2, FALSE), \"Código incorrecto\"))","v":"RESERVA"},{"$f":"'3000'!F14","v":0}]
[1207,{"$f":"IF(ISBLANK(A34),\"\",IFERROR(VLOOKUP(A34,Cuentas!B:F,2,FALSE),\"Código incorrecto\"))","v":"EQUIPO DE ENTREGA Y REPARTO"},{"$f":"'1000'!F34","v":0},3104,{"$f":"IF(ISBLANK(D34), \"\", IFERROR(VLOOKUP(D34, Cuentas!B:F, 2, FALSE), \"Código incorrecto\"))","v":"UTILIDADES RETENIDAS"},{"$f":"'3000'!F15","v":0}]
[1401,{"$f":"IF(ISBLANK(A35),\"\",IFERROR(VLOOKUP(A35,Cuentas!B:F,2,FALSE),\"Código incorrecto\"))","v":"DEPRECIACIÓN ACUMULADA"},{"$f":"-'1000'!F60","v":0},3105,{"$f":"IF(ISBLANK(D35), \"\", IFERROR(VLOOKUP(D35, Cuentas!B:F, 2, FALSE), \"Código incorrecto\"))","v":"UTILIDAD DEL EJERCICIO"},{"$f":"'02'!E27","v":0}]
[null,"ACTIVO FIJO NETO",{"$f":"SUM(C28:C35)","v":0},null,"SUB TOTAL CAPITAL",{"$f":"SUM(F31:F35)","v":0}]
[1300,{"$f":"IF(ISBLANK(A37),\"\",IFERROR(VLOOKUP(A37,Cuentas!B:F,2,FALSE),\"Código incorrecto\"))","v":"ACTIVOS INTANGIBLES"},null,null,{"$f":"IF(ISBLANK(D37), \"\", VLOOKUP(D37, Cuentas!B:F, 2, FALSE))","v":""}]
[1301,{"$f":"IF(ISBLANK(A38),\"\",IFERROR(VLOOKUP(A38,Cuentas!B:F,2,FALSE),\"Código incorrecto\"))","v":"DERECHOS DE AUTOR"},{"$f":"'1000'!F44","v":0},null,{"$f":"IF(ISBLANK(D38), \"\", VLOOKUP(D38, Cuentas!B:F, 2, FALSE))","v":""}]
[1302,{"$f":"IF(ISBLANK(A39),\"\",IFERROR(VLOOKUP(A39,Cuentas!B:F,2,FALSE),\"Código incorrecto\"))","v":"PATENTES"},{"$f":"'1000'!F45","v":0},null,{"$f":"IF(ISBLANK(D39), \"\", VLOOKUP(D39, Cuentas!B:F, 2, FALSE))","v":""}]
[1303,{"$f":"IF(ISBLANK(A40),\"\",IFERROR(VLOOKUP(A40,Cuentas!B:F,2,FALSE),\"Código incorrecto\"))","v":"MARCAS REGISTRADAS"},{"$f":"'1000'!F46","v":0},null,{"$f":"IF(ISBLANK(D40), \"\", VLOOKUP(D40, Cuentas!B:F, 2, FALSE))","v":""}]
[1304,{"$f":"IF(ISBLANK(A41),\"\",IFERROR(VLOOKUP(A41,Cuentas!B:F,2,FALSE),\"Código incorrecto\"))","v":"NOMBRES COMERCIALES"},{"$f":"'1000'!F47","v":0},null,{"$f":"IF(ISBLANK(D41), \"\", VLOOKUP(D41, Cuentas!B:F, 2, FALSE))","v":""}]
[1305,{"$f":"IF(ISBLANK(A42),\"\",IFERROR(VLOOKUP(A42,Cuentas!B:F,2,FALSE),\"Código incorrecto\"))","v":"CRÉDITO MERCANTIL"},{"$f":"'1000'!F48","v":0},null,{"$f":"IF(ISBLANK(D42), \"\", VLOOKUP(D42, Cuentas!B:F, 2, FALSE))","v":""}]
[1306,{"$f":"IF(ISBLANK(A43),\"\",IFERROR(VLOOKUP(A43,Cuentas!B:F,2,FALSE),\"Código incorrecto\"))","v":"GASTOS DE CONSTITUCIÓN"},{"$f":"'1000'!F49","v":0}]
[1307,{"$f":"IF(ISBLANK(A44),\"\",IFERROR(VLOOKUP(A44,Cuentas!B:F,2,FALSE),\"Código incorrecto\"))","v":"GASTOS DE ORGANIZACIÓN"},{"$f":"'1000'!F50","v":0}]
[1308,{"$f":"IF(ISBLANK(A45),\"\",IFERROR(VLOOKUP(A45,Cuentas!B:F,2,FALSE),\"Código incorrecto\"))","v":"GASTOS DE INSTALACIÓN"},{"$f":"'1000'!F51","v":0}]
[1309,{"$f":"IF(ISBLANK(A46),\"\",IFERROR(VLOOKUP(A46,Cuentas!B:F,2,FALSE),\"Código incorrecto\"))","v":"GASTOS DE INVESTIGACIÓN"},{"$f":"'1000'!F52","v":0},null,{"$f":"IF(ISBLANK(D46), \"\", VLOOKUP(D46, Cuentas!B:F, 2, FALSE))","v":""}]
[1402,{"$f":"IF(ISBLANK(A47),\"\",IFERROR(VLOOKUP(A47,Cuentas!B:F,2,FALSE),\"Código incorrecto\"))","v":"AMORTIZACIÓN DE INTANGIBLES"},{"$f":"-'1000'!F61","v":0},null,{"$f":"IF(ISBLANK(D47), \"\", VLOOKUP(D47, Cuentas!B:F, 2, FALSE))","v":""}]
[null,"ACTIVOS INTANGIBLES NETO",{"$f":"SUM(C38:C47)","v":0}]
[null,"ACTIVOS TOTALES",{"$f":"C26+C36+C48","v":0},null,"TOTAL PASIVO + CAPITAL CONTABLE",{"$f":"F28+F36","v":0}]
[null,null,null,null,null,{"$f":"ABS(C49-F49)","v":0}]
[]
[]
[]
[null,"ELABORA",null,null,"REVISA"]
[null,{"$f":"VLOOKUP(B54, Usuarios!B12:D14, 2, FALSE)","v":"Arlen de Jesús Baltodano López"},null,null,{"$f":"VLOOKUP(E54, Usuarios!B12:D14, 2, FALSE)","v":"Gersan Arguello Prado"}]
[null,{"$f":"VLOOKUP(B54, Usuarios!B12:E14, 4, FALSE)","v":"Auxiliar de Contabilidad"},null,null,{"$f":"VLOOKUP(E54, Usuarios!B12:E14, 4, FALSE)","v":"Contador General"}]
[]
[]
[null,"AUTORIZA"]
[null,{"$f":"VLOOKUP(B59, Usuarios!B12:D14, 2, FALSE)","v":"Matilda Padilla Mayorga"}]
[null,{"$f":"VLOOKUP(B59, Usuarios!B12:E14, 4, FALSE)","v":"Gerente de Finanzas"}]

{"sheet":"LM","index":13,"n_rows":10,"n_cols":5,"rows_kept":10,"cut":false,"hidden":false,"merged":[[0,0,0,4],[1,0,1,4],[2,0,2,4]]}
[{"$f":"D!A2","v":"CONSULTORES DE OMETEPE"}]
["CONSULTA DE MAYOR"]
[{"$f":"D!A4","v":"DEL 00 DE ENERO AL 00 DE ENERO DE 1900"}]
[]
[1101,{"$f":"IF(ISBLANK(A5), \"\", IFERROR(VLOOKUP(A5, plan_cuentas, 2, FALSE), \"Código de cuenta incorrecto\"))","v":"CAJA"}]
["FECHA","DESCRIPCIÓN","DÉBITOS","CRÉDITOS","SALDO"]
[{"$f":"fecha_inicial","v":"00:00:00"},"Saldo inicial de la cuenta",null,null,10000]
["2012-09-03","Renta de local a cuenta de 09/12",0,500,9500]
["2012-09-04","Venta de productos",10000,0,19500]
["2012-09-05","Depósito a banco",0,9500,10000]

{"sheet":"1000","index":14,"n_rows":87,"n_cols":6,"rows_kept":87,"cut":false,"hidden":false,"merged":[[86,2,86,3],[80,0,80,1],[80,4,80,5],[81,0,81,1],[81,4,81,5],[84,2,84,3],[85,2,85,3],[7,5,8,5],[74,0,74,1],[78,0,78,1],[78,4,78,5],[79,0,79,1],[79,4,79,5],[7,0,8,0],[7,1,8,1],[7,2,8,2],[7,3,8,3],[7,4,8,4],[1,0,1,5],[2,0,2,5],[3,0,3,5],[4,0,4,5],[6,3,6,5]]}
[null,null,null,null,"Proteger"]
[{"$f":"nombre_empresa","v":"CONSULTORES DE OMETEPE"}]
[{"$f":"\"RESUMEN CONTABLE DE \"&B7","v":"RESUMEN CONTABLE DE ACTIVOS"}]
[{"$f":"\"DEL \"&TEXT(fecha_inicial, \"DD\")&\" DE \"&UPPER(TEXT(fecha_inicial, \"MMMM\"))&\" AL \"&TEXT(fecha_final, \"DD\")&\" DE \"&UPPER(TEXT(fecha_final, \"MMMM\"))&\" DE \"&TEXT(fecha_final, \"YYYY\")","v":"DEL 00 DE ENERO AL 00 DE ENERO DE 1900"}]
[{"$f":"direccion & \" *** Tel/Fax:  \" & tel_fax & \" *** \" & email","v":"Barrio el Progreso, San Jorge, Rivas. *** Tel/Fax:  89040457 *** escribeme@radioometepe.com"}]
[]
[1000,{"$f":"UPPER(IF(ISBLANK(A7),\"\",IFERROR(VLOOKUP(A7,plan_cuentas,2,FALSE),\"Código de cuenta incorrecto\")))","v":"ACTIVOS"},null,{"$f":"\"MOVIMIENTOS DE \"&UPPER(TEXT(fecha_final, \"MMMM\"))","v":"MOVIMIENTOS DE ENERO"}]
["CODIGO","NOMBRE DE LA CUENTA","SALDO INICIAL","DEBITOS","CREDITOS","SALDO FINAL"]
[]
[]
[1100,{"$f":"IF(A11<>\"\", IF(ISERROR(VLOOKUP(A11, plan_cuentas,2, FALSE)), \"Código de Cuenta Incorrecto\", UPPER(VLOOKUP(A11, plan_cuentas, 2, FALSE))), \"\")","v":"ACTIVOS CIRCULANTES"},{"$f":"SUM(C12:C26)","v":0},{"$f":"SUM(D12:D26)","v":0},0,{"$f":"C11+D11-E11","v":0}]
[1101,{"$f":"IF(A12<>\"\", IF(ISERROR(VLOOKUP(A12, plan_cuentas,2, FALSE)), \"Código de Cuenta Incorrecto\", UPPER(VLOOKUP(A12, plan_cuentas, 2, FALSE))), \"\")","v":"CAJA"},{"$f":"IF(ISBLANK(A12),0, SUMIFS(Registros!E:E,Registros!A:A,\"<\"&fecha_inicial,Registros!B:B,\"=\"&'1000'!A12)) - IF(ISBLANK(A12),0, SUMIFS(Registros!F:F,Registros!A:A,\"<\"&fecha_inicial,Registros!B:B,\"=\"&'1000'!A12))","v":0},{"$f":"IF(ISBLANK(A12), 0, SUMIFS(Registros!E:E, Registros!A:A, \">=\" & fecha_inicial, Registros!A:A, \"<=\" & fecha_final,  Registros!B:B, \"=\" & '1000'!A12))","v":0},{"$f":"IF(ISBLANK(A12), 0, SUMIFS(Registros!F:F, Registros!A:A, \">=\" & fecha_inicial, Registros!A:A, \"<=\" & fecha_final,  Registros!B:B, \"=\" & '1000'!A12))","v":0},{"$f":"C12+D12-E12","v":0}]
[1102,{"$f":"IF(A13<>0, IF(ISERROR(VLOOKUP(A13, plan_cuentas,2, FALSE)), \"Código de Cuenta Incorrecto\", UPPER(VLOOKUP(A13, plan_cuentas, 2, FALSE))), \"\")","v":"FONDO FIJO DE CAJA CHICA"},{"$f":"IF(ISBLANK(A13),0, SUMIFS(Registros!E:E,Registros!A:A,\"<\"&fecha_inicial,Registros!B:B,\"=\"&'1000'!A13)) - IF(ISBLANK(A13),0, SUMIFS(Registros!F:F,Registros!A:A,\"<\"&fecha_inicial,Registros!B:B,\"=\"&'1000'!A13))","v":0},{"$f":"IF(ISBLANK(A13), 0, SUMIFS(Registros!E:E, Registros!A:A, \">=\" & fecha_inicial, Registros!A:A, \"<=\" & fecha_final,  Registros!B:B, \"=\" & '1000'!A13))","v":0},{"$f":"IF(ISBLANK(A13), 0, SUMIFS(Registros!F:F, Registros!A:A, \">=\" & fecha_inicial, Registros!A:A, \"<=\" & fecha_final,  Registros!B:B, \"=\" & '1000'!A13))","v":0},0]
[1103,"BANCOS",{"$f":"IF(ISBLANK(A14),0, SUMIFS(Registros!E:E,Registros!A:A,\"<\"&fecha_inicial,Registros!B:B,\"=\"&'1000'!A14)) - IF(ISBLANK(A14),0, SUMIFS(Registros!F:F,Registros!A:A,\"<\"&fecha_inicial,Registros!B:B,\"=\"&'1000'!A14))","v":0},{"$f":"IF(ISBLANK(A14), 0, SUMIFS(Registros!E:E, Registros!A:A, \">=\" & fecha_inicial, Registros!A:A, \"<=\" & fecha_final,  Registros!B:B, \"=\" & '1000'!A14))","v":0},{"$f":"IF(ISBLANK(A14), 0, SUMIFS(Registros!F:F, Registros!A:A, \">=\" & fecha_inicial, Registros!A:A, \"<=\" & fecha_final,  Registros!B:B, \"=\" & '1000'!A14))","v":0},0]
[1104,"INVERSIONES TEMPORALES",{"$f":"IF(ISBLANK(A15),0, SUMIFS(Registros!E:E,Registros!A:A,\"<\"&fecha_inicial,Registros!B:B,\"=\"&'1000'!A15)) - IF(ISBLANK(A15),0, SUMIFS(Registros!F:F,Registros!A:A,\"<\"&fecha_inicial,Registros!B:B,\"=\"&'1000'!A15))","v":0},{"$f":"IF(ISBLANK(A15), 0, SUMIFS(Registros!E:E, Registros!A:A, \">=\" & fecha_inicial, Registros!A:A, \"<=\" & fecha_final,  Registros!B:B, \"=\" & '1000'!A15))","v":0},{"$f":"IF(ISBLANK(A15), 0, SUMIFS(Registros!F:F, Registros!A:A, \">=\" & fecha_inicial, Registros!A:A, \"<=\" & fecha_final,  Registros!B:B, \"=\" & '1000'!A15))","v":0},0]
[1105,"CLIENTES",{"$f":"IF(ISBLANK(A16),0, SUMIFS(Registros!E:E,Registros!A:A,\"<\"&fecha_inicial,Registros!B:B,\"=\"&'1000'!A16)) - IF(ISBLANK(A16),0, SUMIFS(Registros!F:F,Registros!A:A,\"<\"&fecha_inicial,Registros!B:B,\"=\"&'1000'!A16))","v":0},{"$f":"IF(ISBLANK(A16), 0, SUMIFS(Registros!E:E, Registros!A:A, \">=\" & fecha_inicial, Registros!A:A, \"<=\" & fecha_final,  Registros!B:B, \"=\" & '1000'!A16))","v":0},{"$f":"IF(ISBLANK(A16), 0, SUMIFS(Registros!F:F, Registros!A:A, \">=\" & fecha_inicial, Registros!A:A, \"<=\" & fecha_final,  Registros!B:B, \"=\" & '1000'!A16))","v":0},0]
[1106,"DOCUMENTOS POR COBRAR",{"$f":"IF(ISBLANK(A17),0, SUMIFS(Registros!E:E,Registros!A:A,\"<\"&fecha_inicial,Registros!B:B,\"=\"&'1000'!A17)) - IF(ISBLANK(A17),0, SUMIFS(Registros!F:F,Registros!A:A,\"<\"&fecha_inicial,Registros!B:B,\"=\"&'1000'!A17))","v":0},{"$f":"IF(ISBLANK(A17), 0, SUMIFS(Registros!E:E, Registros!A:A, \">=\" & fecha_inicial, Registros!A:A, \"<=\" & fecha_final,  Registros!B:B, \"=\" & '1000'!A17))","v":0},{"$f":"IF(ISBLANK(A17), 0, SUMIFS(Registros!F:F, Registros!A:A, \">=\" & fecha_inicial, Registros!A:A, \"<=\" & fecha_final,  Registros!B:B, \"=\" & '1000'!A17))","v":0},0]
[1107,"CUENTAS POR COBRAR A EMPLEADOS",{"$f":"IF(ISBLANK(A18),0, SUMIFS(Registros!E:E,Registros!A:A,\"<\"&fecha_inicial,Registros!B:B,\"=\"&'1000'!A18)) - IF(ISBLANK(A18),0, SUMIFS(Registros!F:F,Registros!A:A,\"<\"&fecha_inicial,Registros!B:B,\"=\"&'1000'!A18))","v":0},{"$f":"IF(ISBLANK(A18), 0, SUMIFS(Registros!E:E, Registros!A:A, \">=\" & fecha_inicial, Registros!A:A, \"<=\" & fecha_final,  Registros!B:B, \"=\" & '1000'!A18))","v":0},{"$f":"IF(ISBLANK(A18), 0, SUMIFS(Registros!F:F, Registros!A:A, \">=\" & fecha_inicial, Registros!A:A, \"<=\" & fecha_final,  Registros!B:B, \"=\" & '1000'!A18))","v":0},0]
[1108,"IVA ACREDITABLE",{"$f":"IF(ISBLANK(A19),0, SUMIFS(Registros!E:E,Registros!A:A,\"<\"&fecha_inicial,Registros!B:B,\"=\"&'1000'!A19)) - IF(ISBLANK(A19),0, SUMIFS(Registros!F:F,Registros!A:A,\"<\"&fecha_inicial,Registros!B:B,\"=\"&'1000'!A19))","v":0},{"$f":"IF(ISBLANK(A19), 0, SUMIFS(Registros!E:E, Registros!A:A, \">=\" & fecha_inicial, Registros!A:A, \"<=\" & fecha_final,  Registros!B:B, \"=\" & '1000'!A19))","v":0},{"$f":"IF(ISBLANK(A19), 0, SUMIFS(Registros!F:F, Registros!A:A, \">=\" & fecha_inicial, Registros!A:A, \"<=\" & fecha_final,  Registros!B:B, \"=\" & '1000'!A19))","v":0},0]
[1109,"ANTICIPO DE IMPUESTOS",{"$f":"IF(ISBLANK(A20),0, SUMIFS(Registros!E:E,Registros!A:A,\"<\"&fecha_inicial,Registros!B:B,\"=\"&'1000'!A20)) - IF(ISBLANK(A20),0, SUMIFS(Registros!F:F,Registros!A:A,\"<\"&fecha_inicial,Registros!B:B,\"=\"&'1000'!A20))","v":0},{"$f":"IF(ISBLANK(A20), 0, SUMIFS(Registros!E:E, Registros!A:A, \">=\" & fecha_inicial, Registros!A:A, \"<=\" & fecha_final,  Registros!B:B, \"=\" & '1000'!A20))","v":0},{"$f":"IF(ISBLANK(A20), 0, SUMIFS(Registros!F:F, Registros!A:A, \">=\" & fecha_inicial, Registros!A:A, \"<=\" & fecha_final,  Registros!B:B, \"=\" & '1000'!A20))","v":0},0]
[1110,"INVENTARIOS",{"$f":"IF(ISBLANK(A21),0, SUMIFS(Registros!E:E,Registros!A:A,\"<\"&fecha_inicial,Registros!B:B,\"=\"&'1000'!A21)) - IF(ISBLANK(A21),0, SUMIFS(Registros!F:F,Registros!A:A,\"<\"&fecha_inicial,Registros!B:B,\"=\"&'1000'!A21))","v":0},{"$f":"IF(ISBLANK(A21), 0, SUMIFS(Registros!E:E, Registros!A:A, \">=\" & fecha_inicial, Registros!A:A, \"<=\" & fecha_final,  Registros!B:B, \"=\" & '1000'!A21))","v":0},{"$f":"IF(ISBLANK(A21), 0, SUMIFS(Registros!F:F, Registros!A:A, \">=\" & fecha_inicial, Registros!A:A, \"<=\" & fecha_final,  Registros!B:B, \"=\" & '1000'!A21))","v":0},0]
[1111,"ANTICIPO A PROVEEDORES",{"$f":"IF(ISBLANK(A22),0, SUMIFS(Registros!E:E,Registros!A:A,\"<\"&fecha_inicial,Registros!B:B,\"=\"&'1000'!A22)) - IF(ISBLANK(A22),0, SUMIFS(Registros!F:F,Registros!A:A,\"<\"&fecha_inicial,Registros!B:B,\"=\"&'1000'!A22))","v":0},{"$f":"IF(ISBLANK(A22), 0, SUMIFS(Registros!E:E, Registros!A:A, \">=\" & fecha_inicial, Registros!A:A, \"<=\" & fecha_final,  Registros!B:B, \"=\" & '1000'!A22))","v":0},{"$f":"IF(ISBLANK(A22), 0, SUMIFS(Registros!F:F, Registros!A:A, \">=\" & fecha_inicial, Registros!A:A, \"<=\" & fecha_final,  Registros!B:B, \"=\" & '1000'!A22))","v":0},0]
[1112,"RENTAS PAGADAS POR ANTICIPADO",{"$f":"IF(ISBLANK(A23),0, SUMIFS(Registros!E:E,Registros!A:A,\"<\"&fecha_inicial,Registros!B:B,\"=\"&'1000'!A23)) - IF(ISBLANK(A23),0, SUMIFS(Registros!F:F,Registros!A:A,\"<\"&fecha_inicial,Registros!B:B,\"=\"&'1000'!A23))","v":0},{"$f":"IF(ISBLANK(A23), 0, SUMIFS(Registros!E:E, Registros!A:A, \">=\" & fecha_inicial, Registros!A:A, \"<=\" & fecha_final,  Registros!B:B, \"=\" & '1000'!A23))","v":0},{"$f":"IF(ISBLANK(A23), 0, SUMIFS(Registros!F:F, Registros!A:A, \">=\" & fecha_inicial, Registros!A:A, \"<=\" & fecha_final,  Registros!B:B, \"=\" & '1000'!A23))","v":0},0]
[1113,"INTERESES PAGADOS POR ANTICIPADO",{"$f":"IF(ISBLANK(A24),0, SUMIFS(Registros!E:E,Registros!A:A,\"<\"&fecha_inicial,Registros!B:B,\"=\"&'1000'!A24)) - IF(ISBLANK(A24),0, SUMIFS(Registros!F:F,Registros!A:A,\"<\"&fecha_inicial,Registros!B:B,\"=\"&'1000'!A24))","v":0},{"$f":"IF(ISBLANK(A24), 0, SUMIFS(Registros!E:E, Registros!A:A, \">=\" & fecha_inicial, Registros!A:A, \"<=\" & fecha_final,  Registros!B:B, \"=\" & '1000'!A24))","v":0},{"$f":"IF(ISBLANK(A24), 0, SUMIFS(Registros!F:F, Registros!A:A, \">=\" & fecha_inicial, Registros!A:A, \"<=\" & fecha_final,  Registros!B:B, \"=\" & '1000'!A24))","v":0},0]
[1114,"Código de Cuenta Incorrecto",{"$f":"IF(ISBLANK(A25),0, SUMIFS(Registros!E:E,Registros!A:A,\"<\"&fecha_inicial,Registros!B:B,\"=\"&'1000'!A25)) - IF(ISBLANK(A25),0, SUMIFS(Registros!F:F,Registros!A:A,\"<\"&fecha_inicial,Registros!B:B,\"=\"&'1000'!A25))","v":0},{"$f":"IF(ISBLANK(A25), 0, SUMIFS(Registros!E:E, Registros!A:A, \">=\" & fecha_inicial, Registros!A:A, \"<=\" & fecha_final,  Registros!B:B, \"=\" & '1000'!A25))","v":0},{"$f":"IF(ISBLANK(A25), 0, SUMIFS(Registros!F:F, Registros!A:A, \">=\" & fecha_inicial, Registros!A:A, \"<=\" & fecha_final,  Registros!B:B, \"=\" & '1000'!A25))","v":0},0]
[1115,"Código de Cuenta Incorrecto",{"$f":"IF(ISBLANK(A26),0, SUMIFS(Registros!E:E,Registros!A:A,\"<\"&fecha_inicial,Registros!B:B,\"=\"&'1000'!A26)) - IF(ISBLANK(A26),0, SUMIFS(Registros!F:F,Registros!A:A,\"<\"&fecha_inicial,Registros!B:B,\"=\"&'1000'!A26))","v":0},{"$f":"IF(ISBLANK(A26), 0, SUMIFS(Registros!E:E, Registros!A:A, \">=\" & fecha_inicial, Registros!A:A, \"<=\" & fecha_final,  Registros!B:B, \"=\" & '1000'!A26))","v":0},{"$f":"IF(ISBLANK(A26), 0, SUMIFS(Registros!F:F, Registros!A:A, \">=\" & fecha_inicial, Registros!A:A, \"<=\" & fecha_final,  Registros!B:B, \"=\" & '1000'!A26))","v":0},0]
[1200,"ACTIVOS FIJOS",{"$f":"SUM(C28:C42)","v":0},{"$f":"SUM(D28:D42)","v":0},{"$f":"SUM(E28:E42)","v":0},0]
[1201,"TERRENOS",{"$f":"IF(ISBLANK(A28),0, SUMIFS(Registros!E:E,Registros!A:A,\"<\"&fecha_inicial,Registros!B:B,\"=\"&'1000'!A28)) - IF(ISBLANK(A28),0, SUMIFS(Registros!F:F,Registros!A:A,\"<\"&fecha_inicial,Registros!B:B,\"=\"&'1000'!A28))","v":0},{"$f":"IF(ISBLANK(A28), 0, SUMIFS(Registros!E:E, Registros!A:A, \">=\" & fecha_inicial, Registros!A:A, \"<=\" & fecha_final,  Registros!B:B, \"=\" & '1000'!A28))","v":0},{"$f":"IF(ISBLANK(A28), 0, SUMIFS(Registros!F:F, Registros!A:A, \">=\" & fecha_inicial, Registros!A:A, \"<=\" & fecha_final,  Registros!B:B, \"=\" & '1000'!A28))","v":0},0]
[1202,"EDIFICIOS",{"$f":"IF(ISBLANK(A29),0, SUMIFS(Registros!E:E,Registros!A:A,\"<\"&fecha_inicial,Registros!B:B,\"=\"&'1000'!A29)) - IF(ISBLANK(A29),0, SUMIFS(Registros!F:F,Registros!A:A,\"<\"&fecha_inicial,Registros!B:B,\"=\"&'1000'!A29))","v":0},{"$f":"IF(ISBLANK(A29), 0, SUMIFS(Registros!E:E, Registros!A:A, \">=\" & fecha_inicial, Registros!A:A, \"<=\" & fecha_final,  Registros!B:B, \"=\" & '1000'!A29))","v":0},{"$f":"IF(ISBLANK(A29), 0, SUMIFS(Registros!F:F, Registros!A:A, \">=\" & fecha_inicial, Registros!A:A, \"<=\" & fecha_final,  Registros!B:B, \"=\" & '1000'!A29))","v":0},0]
[1203,"MAQUINARIA",{"$f":"IF(ISBLANK(A30),0, SUMIFS(Registros!E:E,Registros!A:A,\"<\"&fecha_inicial,Registros!B:B,\"=\"&'1000'!A30)) - IF(ISBLANK(A30),0, SUMIFS(Registros!F:F,Registros!A:A,\"<\"&fecha_inicial,Registros!B:B,\"=\"&'1000'!A30))","v":0},{"$f":"IF(ISBLANK(A30), 0, SUMIFS(Registros!E:E, Registros!A:A, \">=\" & fecha_inicial, Registros!A:A, \"<=\" & fecha_final,  Registros!B:B, \"=\" & '1000'!A30))","v":0},{"$f":"IF(ISBLANK(A30), 0, SUMIFS(Registros!F:F, Registros!A:A, \">=\" & fecha_inicial, Registros!A:A, \"<=\" & fecha_final,  Registros!B:B, \"=\" & '1000'!A30))","v":0},0]
[1204,"MOBILIARIO Y EQUIPO DE OFICINA",{"$f":"IF(ISBLANK(A31),0, SUMIFS(Registros!E:E,Registros!A:A,\"<\"&fecha_inicial,Registros!B:B,\"=\"&'1000'!A31)) - IF(ISBLANK(A31),0, SUMIFS(Registros!F:F,Registros!A:A,\"<\"&fecha_inicial,Registros!B:B,\"=\"&'1000'!A31))","v":0},{"$f":"IF(ISBLANK(A31), 0, SUMIFS(Registros!E:E, Registros!A:A, \">=\" & fecha_inicial, Registros!A:A, \"<=\" & fecha_final,  Registros!B:B, \"=\" & '1000'!A31))","v":0},{"$f":"IF(ISBLANK(A31), 0, SUMIFS(Registros!F:F, Registros!A:A, \">=\" & fecha_inicial, Registros!A:A, \"<=\" & fecha_final,  Registros!B:B, \"=\" & '1000'!A31))","v":0},0]
[1205,"MUEBLES Y ENSERES",{"$f":"IF(ISBLANK(A32),0, SUMIFS(Registros!E:E,Registros!A:A,\"<\"&fecha_inicial,Registros!B:B,\"=\"&'1000'!A32)) - IF(ISBLANK(A32),0, SUMIFS(Registros!F:F,Registros!A:A,\"<\"&fecha_inicial,Registros!B:B,\"=\"&'1000'!A32))","v":0},{"$f":"IF(ISBLANK(A32), 0, SUMIFS(Registros!E:E, Registros!A:A, \">=\" & fecha_inicial, Registros!A:A, \"<=\" & fecha_final,  Registros!B:B, \"=\" & '1000'!A32))","v":0},{"$f":"IF(ISBLANK(A32), 0, SUMIFS(Registros!F:F, Registros!A:A, \">=\" & fecha_inicial, Registros!A:A, \"<=\" & fecha_final,  Registros!B:B, \"=\" & '1000'!A32))","v":0},0]
[1206,"EQUIPO DE TRANSPORTE",{"$f":"IF(ISBLANK(A33),0, SUMIFS(Registros!E:E,Registros!A:A,\"<\"&fecha_inicial,Registros!B:B,\"=\"&'1000'!A33)) - IF(ISBLANK(A33),0, SUMIFS(Registros!F:F,Registros!A:A,\"<\"&fecha_inicial,Registros!B:B,\"=\"&'1000'!A33))","v":0},{"$f":"IF(ISBLANK(A33), 0, SUMIFS(Registros!E:E, Registros!A:A, \">=\" & fecha_inicial, Registros!A:A, \"<=\" & fecha_final,  Registros!B:B, \"=\" & '1000'!A33))","v":0},{"$f":"IF(ISBLANK(A33), 0, SUMIFS(Registros!F:F, Registros!A:A, \">=\" & fecha_inicial, Registros!A:A, \"<=\" & fecha_final,  Registros!B:B, \"=\" & '1000'!A33))","v":0},0]
[1207,"EQUIPO DE ENTREGA Y REPARTO",{"$f":"IF(ISBLANK(A34),0, SUMIFS(Registros!E:E,Registros!A:A,\"<\"&fecha_inicial,Registros!B:B,\"=\"&'1000'!A34)) - IF(ISBLANK(A34),0, SUMIFS(Registros!F:F,Registros!A:A,\"<\"&fecha_inicial,Registros!B:B,\"=\"&'1000'!A34))","v":0},{"$f":"IF(ISBLANK(A34), 0, SUMIFS(Registros!E:E, Registros!A:A, \">=\" & fecha_inicial, Registros!A:A, \"<=\" & fecha_final,  Registros!B:B, \"=\" & '1000'!A34))","v":0},{"$f":"IF(ISBLANK(A34), 0, SUMIFS(Registros!F:F, Registros!A:A, \">=\" & fecha_inicial, Registros!A:A, \"<=\" & fecha_final,  Registros!B:B, \"=\" & '1000'!A34))","v":0},0]
[1208,"Código de Cuenta Incorrecto",{"$f":"IF(ISBLANK(A35),0, SUMIFS(Registros!E:E,Registros!A:A,\"<\"&fecha_inicial,Registros!B:B,\"=\"&'1000'!A35)) - IF(ISBLANK(A35),0, SUMIFS(Registros!F:F,Registros!A:A,\"<\"&fecha_inicial,Registros!B:B,\"=\"&'1000'!A35))","v":0},{"$f":"IF(ISBLANK(A35), 0, SUMIFS(Registros!E:E, Registros!A:A, \">=\" & fecha_inicial, Registros!A:A, \"<=\" & fecha_final,  Registros!B:B, \"=\" & '1000'!A35))","v":0},{"$f":"IF(ISBLANK(A35), 0, SUMIFS(Registros!F:F, Registros!A:A, \">=\" & fecha_inicial, Registros!A:A, \"<=\" & fecha_final,  Registros!B:B, \"=\" & '1000'!A35))","v":0},0]
[1209,"Código de Cuenta Incorrecto",{"$f":"IF(ISBLANK(A36),0, SUMIFS(Registros!E:E,Registros!A:A,\"<\"&fecha_inicial,Registros!B:B,\"=\"&'1000'!A36)) - IF(ISBLANK(A36),0, SUMIFS(Registros!F:F,Registros!A:A,\"<\"&fecha_inicial,Registros!B:B,\"=\"&'1000'!A36))","v":0},{"$f":"IF(ISBLANK(A36), 0, SUMIFS(Registros!E:E, Registros!A:A, \">=\" & fecha_inicial, Registros!A:A, \"<=\" & fecha_final,  Registros!B:B, \"=\" & '1000'!A36))","v":0},{"$f":"IF(ISBLANK(A36), 0, SUMIFS(Registros!F:F, Registros!A:A, \">=\" & fecha_inicial, Registros!A:A, \"<=\" & fecha_final,  Registros!B:B, \"=\" & '1000'!A36))","v":0},0]
[1210,"Código de Cuenta Incorrecto",{"$f":"IF(ISBLANK(A37),0, SUMIFS(Registros!E:E,Registros!A:A,\"<\"&fecha_inicial,Registros!B:B,\"=\"&'1000'!A37)) - IF(ISBLANK(A37),0, SUMIFS(Registros!F:F,Registros!A:A,\"<\"&fecha_inicial,Registros!B:B,\"=\"&'1000'!A37))","v":0},{"$f":"IF(ISBLANK(A37), 0, SUMIFS(Registros!E:E, Registros!A:A, \">=\" & fecha_inicial, Registros!A:A, \"<=\" & fecha_final,  Registros!B:B, \"=\" & '1000'!A37))","v":0},{"$f":"IF(ISBLANK(A37), 0, SUMIFS(Registros!F:F, Registros!A:A, \">=\" & fecha_inicial, Registros!A:A, \"<=\" & fecha_final,  Registros!B:B, \"=\" & '1000'!A37))","v":0},0]
[1211,"Código de Cuenta Incorrecto",{"$f":"IF(ISBLANK(A38),0, SUMIFS(Registros!E:E,Registros!A:A,\"<\"&fecha_inicial,Registros!B:B,\"=\"&'1000'!A38)) - IF(ISBLANK(A38),0, SUMIFS(Registros!F:F,Registros!A:A,\"<\"&fecha_inicial,Registros!B:B,\"=\"&'1000'!A38))","v":0},{"$f":"IF(ISBLANK(A38), 0, SUMIFS(Registros!E:E, Registros!A:A, \">=\" & fecha_inicial, Registros!A:A, \"<=\" & fecha_final,  Registros!B:B, \"=\" & '1000'!A38))","v":0},{"$f":"IF(ISBLANK(A38), 0, SUMIFS(Registros!F:F, Registros!A:A, \">=\" & fecha_inicial, Registros!A:A, \"<=\" & fecha_final,  Registros!B:B, \"=\" & '1000'!A38))","v":0},0]
[1212,"Código de Cuenta Incorrecto",{"$f":"IF(ISBLANK(A39),0, SUMIFS(Registros!E:E,Registros!A:A,\"<\"&fecha_inicial,Registros!B:B,\"=\"&'1000'!A39)) - IF(ISBLANK(A39),0, SUMIFS(Registros!F:F,Registros!A:A,\"<\"&fecha_inicial,Registros!B:B,\"=\"&'1000'!A39))","v":0},{"$f":"IF(ISBLANK(A39), 0, SUMIFS(Registros!E:E, Registros!A:A, \">=\" & fecha_inicial, Registros!A:A, \"<=\" & fecha_final,  Registros!B:B, \"=\" & '1000'!A39))","v":0},{"$f":"IF(ISBLANK(A39), 0, SUMIFS(Registros!F:F, Registros!A:A, \">=\" & fecha_inicial, Registros!A:A, \"<=\" & fecha_final,  Registros!B:B, \"=\" & '1000'!A39))","v":0},0]
[1213,"Código de Cuenta Incorrecto",{"$f":"IF(ISBLANK(A40),0, SUMIFS(Registros!E:E,Registros!A:A,\"<\"&fecha_inicial,Registros!B:B,\"=\"&'1000'!A40)) - IF(ISBLANK(A40),0, SUMIFS(Registros!F:F,Registros!A:A,\"<\"&fecha_inicial,Registros!B:B,\"=\"&'1000'!A40))","v":0},{"$f":"IF(ISBLANK(A40), 0, SUMIFS(Registros!E:E, Registros!A:A, \">=\" & fecha_inicial, Registros!A:A, \"<=\" & fecha_final,  Registros!B:B, \"=\" & '1000'!A40))","v":0},{"$f":"IF(ISBLANK(A40), 0, SUMIFS(Registros!F:F, Registros!A:A, \">=\" & fecha_inicial, Registros!A:A, \"<=\" & fecha_final,  Registros!B:B, \"=\" & '1000'!A40))","v":0},0]
[1214,"Código de Cuenta Incorrecto",{"$f":"IF(ISBLANK(A41),0, SUMIFS(Registros!E:E,Registros!A:A,\"<\"&fecha_inicial,Registros!B:B,\"=\"&'1000'!A41)) - IF(ISBLANK(A41),0, SUMIFS(Registros!F:F,Registros!A:A,\"<\"&fecha_inicial,Registros!B:B,\"=\"&'1000'!A41))","v":0},{"$f":"IF(ISBLANK(A41), 0, SUMIFS(Registros!E:E, Registros!A:A, \">=\" & fecha_inicial, Registros!A:A, \"<=\" & fecha_final,  Registros!B:B, \"=\" & '1000'!A41))","v":0},{"$f":"IF(ISBLANK(A41), 0, SUMIFS(Registros!F:F, Registros!A:A, \">=\" & fecha_inicial, Registros!A:A, \"<=\" & fecha_final,  Registros!B:B, \"=\" & '1000'!A41))","v":0},0]
[1215,"Código de Cuenta Incorrecto",{"$f":"IF(ISBLANK(A42),0, SUMIFS(Registros!E:E,Registros!A:A,\"<\"&fecha_inicial,Registros!B:B,\"=\"&'1000'!A42)) - IF(ISBLANK(A42),0, SUMIFS(Registros!F:F,Registros!A:A,\"<\"&fecha_inicial,Registros!B:B,\"=\"&'1000'!A42))","v":0},{"$f":"IF(ISBLANK(A42), 0, SUMIFS(Registros!E:E, Registros!A:A, \">=\" & fecha_inicial, Registros!A:A, \"<=\" & fecha_final,  Registros!B:B, \"=\" & '1000'!A42))","v":0},{"$f":"IF(ISBLANK(A42), 0, SUMIFS(Registros!F:F, Registros!A:A, \">=\" & fecha_inicial, Registros!A:A, \"<=\" & fecha_final,  Registros!B:B, \"=\" & '1000'!A42))","v":0},0]
[1300,"ACTIVOS INTANGIBLES",{"$f":"SUM(C44:C58)","v":0},{"$f":"SUM(D44:D58)","v":0},0,0]
[1301,"DERECHOS DE AUTOR",{"$f":"IF(ISBLANK(A44),0, SUMIFS(Registros!E:E,Registros!A:A,\"<\"&fecha_inicial,Registros!B:B,\"=\"&'1000'!A44)) - IF(ISBLANK(A44),0, SUMIFS(Registros!F:F,Registros!A:A,\"<\"&fecha_inicial,Registros!B:B,\"=\"&'1000'!A44))","v":0},{"$f":"IF(ISBLANK(A44), 0, SUMIFS(Registros!E:E, Registros!A:A, \">=\" & fecha_inicial, Registros!A:A, \"<=\" & fecha_final,  Registros!B:B, \"=\" & '1000'!A44))","v":0},{"$f":"IF(ISBLANK(A44), 0, SUMIFS(Registros!F:F, Registros!A:A, \">=\" & fecha_inicial, Registros!A:A, \"<=\" & fecha_final,  Registros!B:B, \"=\" & '1000'!A44))","v":0},0]
[1302,"PATENTES",{"$f":"IF(ISBLANK(A45),0, SUMIFS(Registros!E:E,Registros!A:A,\"<\"&fecha_inicial,Registros!B:B,\"=\"&'1000'!A45)) - IF(ISBLANK(A45),0, SUMIFS(Registros!F:F,Registros!A:A,\"<\"&fecha_inicial,Registros!B:B,\"=\"&'1000'!A45))","v":0},{"$f":"IF(ISBLANK(A45), 0, SUMIFS(Registros!E:E, Registros!A:A, \">=\" & fecha_inicial, Registros!A:A, \"<=\" & fecha_final,  Registros!B:B, \"=\" & '1000'!A45))","v":0},{"$f":"IF(ISBLANK(A45), 0, SUMIFS(Registros!F:F, Registros!A:A, \">=\" & fecha_inicial, Registros!A:A, \"<=\" & fecha_final,  Registros!B:B, \"=\" & '1000'!A45))","v":0},0]
[1303,"MARCAS REGISTRADAS",{"$f":"IF(ISBLANK(A46),0, SUMIFS(Registros!E:E,Registros!A:A,\"<\"&fecha_inicial,Registros!B:B,\"=\"&'1000'!A46)) - IF(ISBLANK(A46),0, SUMIFS(Registros!F:F,Registros!A:A,\"<\"&fecha_inicial,Registros!B:B,\"=\"&'1000'!A46))","v":0},{"$f":"IF(ISBLANK(A46), 0, SUMIFS(Registros!E:E, Registros!A:A, \">=\" & fecha_inicial, Registros!A:A, \"<=\" & fecha_final,  Registros!B:B, \"=\" & '1000'!A46))","v":0},{"$f":"IF(ISBLANK(A46), 0, SUMIFS(Registros!F:F, Registros!A:A, \">=\" & fecha_inicial, Registros!A:A, \"<=\" & fecha_final,  Registros!B:B, \"=\" & '1000'!A46))","v":0},0]
[1304,"NOMBRES COMERCIALES",{"$f":"IF(ISBLANK(A47),0, SUMIFS(Registros!E:E,Registros!A:A,\"<\"&fecha_inicial,Registros!B:B,\"=\"&'1000'!A47)) - IF(ISBLANK(A47),0, SUMIFS(Registros!F:F,Registros!A:A,\"<\"&fecha_inicial,Registros!B:B,\"=\"&'1000'!A47))","v":0},{"$f":"IF(ISBLANK(A47), 0, SUMIFS(Registros!E:E, Registros!A:A, \">=\" & fecha_inicial, Registros!A:A, \"<=\" & fecha_final,  Registros!B:B, \"=\" & '1000'!A47))","v":0},{"$f":"IF(ISBLANK(A47), 0, SUMIFS(Registros!F:F, Registros!A:A, \">=\" & fecha_inicial, Registros!A:A, \"<=\" & fecha_final,  Registros!B:B, \"=\" & '1000'!A47))","v":0},0]
[1305,"CRÉDITO MERCANTIL",{"$f":"IF(ISBLANK(A48),0, SUMIFS(Registros!E:E,Registros!A:A,\"<\"&fecha_inicial,Registros!B:B,\"=\"&'1000'!A48)) - IF(ISBLANK(A48),0, SUMIFS(Registros!F:F,Registros!A:A,\"<\"&fecha_inicial,Registros!B:B,\"=\"&'1000'!A48))","v":0},{"$f":"IF(ISBLANK(A48), 0, SUMIFS(Registros!E:E, Registros!A:A, \">=\" & fecha_inicial, Registros!A:A, \"<=\" & fecha_final,  Registros!B:B, \"=\" & '1000'!A48))","v":0},{"$f":"IF(ISBLANK(A48), 0, SUMIFS(Registros!F:F, Registros!A:A, \">=\" & fecha_inicial, Registros!A:A, \"<=\" & fecha_final,  Registros!B:B, \"=\" & '1000'!A48))","v":0},0]
[1306,"GASTOS DE CONSTITUCIÓN",{"$f":"IF(ISBLANK(A49),0, SUMIFS(Registros!E:E,Registros!A:A,\"<\"&fecha_inicial,Registros!B:B,\"=\"&'1000'!A49)) - IF(ISBLANK(A49),0, SUMIFS(Registros!F:F,Registros!A:A,\"<\"&fecha_inicial,Registros!B:B,\"=\"&'1000'!A49))","v":0},{"$f":"IF(ISBLANK(A49), 0, SUMIFS(Registros!E:E, Registros!A:A, \">=\" & fecha_inicial, Registros!A:A, \"<=\" & fecha_final,  Registros!B:B, \"=\" & '1000'!A49))","v":0},{"$f":"IF(ISBLANK(A49), 0, SUMIFS(Registros!F:F, Registros!A:A, \">=\" & fecha_inicial, Registros!A:A, \"<=\" & fecha_final,  Registros!B:B, \"=\" & '1000'!A49))","v":0},0]
[1307,"GASTOS DE ORGANIZACIÓN",{"$f":"IF(ISBLANK(A50),0, SUMIFS(Registros!E:E,Registros!A:A,\"<\"&fecha_inicial,Registros!B:B,\"=\"&'1000'!A50)) - IF(ISBLANK(A50),0, SUMIFS(Registros!F:F,Registros!A:A,\"<\"&fecha_inicial,Registros!B:B,\"=\"&'1000'!A50))","v":0},{"$f":"IF(ISBLANK(A50), 0, SUMIFS(Registros!E:E, Registros!A:A, \">=\" & fecha_inicial, Registros!A:A, \"<=\" & fecha_final,  Registros!B:B, \"=\" & '1000'!A50))","v":0},{"$f":"IF(ISBLANK(A50), 0, SUMIFS(Registros!F:F, Registros!A:A, \">=\" & fecha_inicial, Registros!A:A, \"<=\" & fecha_final,  Registros!B:B, \"=\" & '1000'!A50))","v":0},0]
[1308,"GASTOS DE INSTALACIÓN",{"$f":"IF(ISBLANK(A51),0, SUMIFS(Registros!E:E,Registros!A:A,\"<\"&fecha_inicial,Registros!B:B,\"=\"&'1000'!A51)) - IF(ISBLANK(A51),0, SUMIFS(Registros!F:F,Registros!A:A,\"<\"&fecha_inicial,Registros!B:B,\"=\"&'1000'!A51))","v":0},{"$f":"IF(ISBLANK(A51), 0, SUMIFS(Registros!E:E, Registros!A:A, \">=\" & fecha_inicial, Registros!A:A, \"<=\" & fecha_final,  Registros!B:B, \"=\" & '1000'!A51))","v":0},{"$f":"IF(ISBLANK(A51), 0, SUMIFS(Registros!F:F, Registros!A:A, \">=\" & fecha_inicial, Registros!A:A, \"<=\" & fecha_final,  Registros!B:B, \"=\" & '1000'!A51))","v":0},0]
[1309,"GASTOS DE INVESTIGACIÓN",{"$f":"IF(ISBLANK(A52),0, SUMIFS(Registros!E:E,Registros!A:A,\"<\"&fecha_inicial,Registros!B:B,\"=\"&'1000'!A52)) - IF(ISBLANK(A52),0, SUMIFS(Registros!F:F,Registros!A:A,\"<\"&fecha_inicial,Registros!B:B,\"=\"&'1000'!A52))","v":0},{"$f":"IF(ISBLANK(A52), 0, SUMIFS(Registros!E:E, Registros!A:A, \">=\" & fecha_inicial, Registros!A:A, \"<=\" & fecha_final,  Registros!B:B, \"=\" & '1000'!A52))","v":0},{"$f":"IF(ISBLANK(A52), 0, SUMIFS(Registros!F:F, Registros!A:A, \">=\" & fecha_inicial, Registros!A:A, \"<=\" & fecha_final,  Registros!B:B, \"=\" & '1000'!A52))","v":0},0]
[1310,"Código de Cuenta Incorrecto",{"$f":"IF(ISBLANK(A53),0, SUMIFS(Registros!E:E,Registros!A:A,\"<\"&fecha_inicial,Registros!B:B,\"=\"&'1000'!A53)) - IF(ISBLANK(A53),0, SUMIFS(Registros!F:F,Registros!A:A,\"<\"&fecha_inicial,Registros!B:B,\"=\"&'1000'!A53))","v":0},{"$f":"IF(ISBLANK(A53), 0, SUMIFS(Registros!E:E, Registros!A:A, \">=\" & fecha_inicial, Registros!A:A, \"<=\" & fecha_final,  Registros!B:B, \"=\" & '1000'!A53))","v":0},{"$f":"IF(ISBLANK(A53), 0, SUMIFS(Registros!F:F, Registros!A:A, \">=\" & fecha_inicial, Registros!A:A, \"<=\" & fecha_final,  Registros!B:B, \"=\" & '1000'!A53))","v":0},0]
[1311,"Código de Cuenta Incorrecto",{"$f":"IF(ISBLANK(A54),0, SUMIFS(Registros!E:E,Registros!A:A,\"<\"&fecha_inicial,Registros!B:B,\"=\"&'1000'!A54)) - IF(ISBLANK(A54),0, SUMIFS(Registros!F:F,Registros!A:A,\"<\"&fecha_inicial,Registros!B:B,\"=\"&'1000'!A54))","v":0},{"$f":"IF(ISBLANK(A54), 0, SUMIFS(Registros!E:E, Registros!A:A, \">=\" & fecha_inicial, Registros!A:A, \"<=\" & fecha_final,  Registros!B:B, \"=\" & '1000'!A54))","v":0},{"$f":"IF(ISBLANK(A54), 0, SUMIFS(Registros!F:F, Registros!A:A, \">=\" & fecha_inicial, Registros!A:A, \"<=\" & fecha_final,  Registros!B:B, \"=\" & '1000'!A54))","v":0},0]
[1312,"Código de Cuenta Incorrecto",{"$f":"IF(ISBLANK(A55),0, SUMIFS(Registros!E:E,Registros!A:A,\"<\"&fecha_inicial,Registros!B:B,\"=\"&'1000'!A55)) - IF(ISBLANK(A55),0, SUMIFS(Registros!F:F,Registros!A:A,\"<\"&fecha_inicial,Registros!B:B,\"=\"&'1000'!A55))","v":0},{"$f":"IF(ISBLANK(A55), 0, SUMIFS(Registros!E:E, Registros!A:A, \">=\" & fecha_inicial, Registros!A:A, \"<=\" & fecha_final,  Registros!B:B, \"=\" & '1000'!A55))","v":0},{"$f":"IF(ISBLANK(A55), 0, SUMIFS(Registros!F:F, Registros!A:A, \">=\" & fecha_inicial, Registros!A:A, \"<=\" & fecha_final,  Registros!B:B, \"=\" & '1000'!A55))","v":0},0]
[1313,"Código de Cuenta Incorrecto",{"$f":"IF(ISBLANK(A56),0, SUMIFS(Registros!E:E,Registros!A:A,\"<\"&fecha_inicial,Registros!B:B,\"=\"&'1000'!A56)) - IF(ISBLANK(A56),0, SUMIFS(Registros!F:F,Registros!A:A,\"<\"&fecha_inicial,Registros!B:B,\"=\"&'1000'!A56))","v":0},{"$f":"IF(ISBLANK(A56), 0, SUMIFS(Registros!E:E, Registros!A:A, \">=\" & fecha_inicial, Registros!A:A, \"<=\" & fecha_final,  Registros!B:B, \"=\" & '1000'!A56))","v":0},{"$f":"IF(ISBLANK(A56), 0, SUMIFS(Registros!F:F, Registros!A:A, \">=\" & fecha_inicial, Registros!A:A, \"<=\" & fecha_final,  Registros!B:B, \"=\" & '1000'!A56))","v":0},0]
[1314,"Código de Cuenta Incorrecto",{"$f":"IF(ISBLANK(A57),0, SUMIFS(Registros!E:E,Registros!A:A,\"<\"&fecha_inicial,Registros!B:B,\"=\"&'1000'!A57)) - IF(ISBLANK(A57),0, SUMIFS(Registros!F:F,Registros!A:A,\"<\"&fecha_inicial,Registros!B:B,\"=\"&'1000'!A57))","v":0},{"$f":"IF(ISBLANK(A57), 0, SUMIFS(Registros!E:E, Registros!A:A, \">=\" & fecha_inicial, Registros!A:A, \"<=\" & fecha_final,  Registros!B:B, \"=\" & '1000'!A57))","v":0},{"$f":"IF(ISBLANK(A57), 0, SUMIFS(Registros!F:F, Registros!A:A, \">=\" & fecha_inicial, Registros!A:A, \"<=\" & fecha_final,  Registros!B:B, \"=\" & '1000'!A57))","v":0},0]
[1315,"Código de Cuenta Incorrecto",{"$f":"IF(ISBLANK(A58),0, SUMIFS(Registros!E:E,Registros!A:A,\"<\"&fecha_inicial,Registros!B:B,\"=\"&'1000'!A58)) - IF(ISBLANK(A58),0, SUMIFS(Registros!F:F,Registros!A:A,\"<\"&fecha_inicial,Registros!B:B,\"=\"&'1000'!A58))","v":0},{"$f":"IF(ISBLANK(A58), 0, SUMIFS(Registros!E:E, Registros!A:A, \">=\" & fecha_inicial, Registros!A:A, \"<=\" & fecha_final,  Registros!B:B, \"=\" & '1000'!A58))","v":0},{"$f":"IF(ISBLANK(A58), 0, SUMIFS(Registros!F:F, Registros!A:A, \">=\" & fecha_inicial, Registros!A:A, \"<=\" & fecha_final,  Registros!B:B, \"=\" & '1000'!A58))","v":0},0]
[1400,"DEPRECIACIÓN Y AMORTIZACIÓN",{"$f":"SUM(C60:C74)","v":0},{"$f":"SUM(D60:D74)","v":0},0,0]
[1401,"DEPRECIACIÓN ACUMULADA",{"$f":"IF(ISBLANK(A60),0, SUMIFS(Registros!F:F,Registros!A:A,\"<\"&fecha_inicial,Registros!B:B,\"=\"&A60)) - IF(ISBLANK(A60),0, SUMIFS(Registros!E:E,Registros!A:A,\"<\"&fecha_inicial,Registros!B:B,\"=\"&A60))","v":0},{"$f":"IF(ISBLANK(A60), 0, SUMIFS(Registros!E:E, Registros!A:A, \">=\" & fecha_inicial, Registros!A:A, \"<=\" & fecha_final,  Registros!B:B, \"=\" & '1000'!A60))","v":0},{"$f":"IF(ISBLANK(A60), 0, SUMIFS(Registros!F:F, Registros!A:A, \">=\" & fecha_inicial, Registros!A:A, \"<=\" & fecha_final,  Registros!B:B, \"=\" & '1000'!A60))","v":0},{"$f":"C60-D60+E60","v":0}]
[1402,"AMORTIZACIÓN DE INTANGIBLES",{"$f":"IF(ISBLANK(A61),0, SUMIFS(Registros!F:F,Registros!A:A,\"<\"&fecha_inicial,Registros!B:B,\"=\"&A61)) - IF(ISBLANK(A61),0, SUMIFS(Registros!E:E,Registros!A:A,\"<\"&fecha_inicial,Registros!B:B,\"=\"&A61))","v":0},{"$f":"IF(ISBLANK(A61), 0, SUMIFS(Registros!E:E, Registros!A:A, \">=\" & fecha_inicial, Registros!A:A, \"<=\" & fecha_final,  Registros!B:B, \"=\" & '1000'!A61))","v":0},{"$f":"IF(ISBLANK(A61), 0, SUMIFS(Registros!F:F, Registros!A:A, \">=\" & fecha_inicial, Registros!A:A, \"<=\" & fecha_final,  Registros!B:B, \"=\" & '1000'!A61))","v":0},{"$f":"C61-D61+E61","v":0}]
[1403,"Código de Cuenta Incorrecto",{"$f":"IF(ISBLANK(A62),0, SUMIFS(Registros!F:F,Registros!A:A,\"<\"&fecha_inicial,Registros!B:B,\"=\"&A62)) - IF(ISBLANK(A62),0, SUMIFS(Registros!E:E,Registros!A:A,\"<\"&fecha_inicial,Registros!B:B,\"=\"&A62))","v":0},{"$f":"IF(ISBLANK(A62), 0, SUMIFS(Registros!E:E, Registros!A:A, \">=\" & fecha_inicial, Registros!A:A, \"<=\" & fecha_final,  Registros!B:B, \"=\" & '1000'!A62))","v":0},{"$f":"IF(ISBLANK(A62), 0, SUMIFS(Registros!F:F, Registros!A:A, \">=\" & fecha_inicial, Registros!A:A, \"<=\" & fecha_final,  Registros!B:B, \"=\" & '1000'!A62))","v":0},0]
[1404,"Código de Cuenta Incorrecto",{"$f":"IF(ISBLANK(A63),0, SUMIFS(Registros!F:F,Registros!A:A,\"<\"&fecha_inicial,Registros!B:B,\"=\"&A63)) - IF(ISBLANK(A63),0, SUMIFS(Registros!E:E,Registros!A:A,\"<\"&fecha_inicial,Registros!B:B,\"=\"&A63))","v":0},{"$f":"IF(ISBLANK(A63), 0, SUMIFS(Registros!E:E, Registros!A:A, \">=\" & fecha_inicial, Registros!A:A, \"<=\" & fecha_final,  Registros!B:B, \"=\" & '1000'!A63))","v":0},{"$f":"IF(ISBLANK(A63), 0, SUMIFS(Registros!F:F, Registros!A:A, \">=\" & fecha_inicial, Registros!A:A, \"<=\" & fecha_final,  Registros!B:B, \"=\" & '1000'!A63))","v":0},0]
[1405,"Código de Cuenta Incorrecto",{"$f":"IF(ISBLANK(A64),0, SUMIFS(Registros!F:F,Registros!A:A,\"<\"&fecha_inicial,Registros!B:B,\"=\"&A64)) - IF(ISBLANK(A64),0, SUMIFS(Registros!E:E,Registros!A:A,\"<\"&fecha_inicial,Registros!B:B,\"=\"&A64))","v":0},{"$f":"IF(ISBLANK(A64), 0, SUMIFS(Registros!E:E, Registros!A:A, \">=\" & fecha_inicial, Registros!A:A, \"<=\" & fecha_final,  Registros!B:B, \"=\" & '1000'!A64))","v":0},{"$f":"IF(ISBLANK(A64), 0, SUMIFS(Registros!F:F, Registros!A:A, \">=\" & fecha_inicial, Registros!A:A, \"<=\" & fecha_final,  Registros!B:B, \"=\" & '1000'!A64))","v":0},0]
[1406,"Código de Cuenta Incorrecto",{"$f":"IF(ISBLANK(A65),0, SUMIFS(Registros!F:F,Registros!A:A,\"<\"&fecha_inicial,Registros!B:B,\"=\"&A65)) - IF(ISBLANK(A65),0, SUMIFS(Registros!E:E,Registros!A:A,\"<\"&fecha_inicial,Registros!B:B,\"=\"&A65))","v":0},{"$f":"IF(ISBLANK(A65), 0, SUMIFS(Registros!E:E, Registros!A:A, \">=\" & fecha_inicial, Registros!A:A, \"<=\" & fecha_final,  Registros!B:B, \"=\" & '1000'!A65))","v":0},{"$f":"IF(ISBLANK(A65), 0, SUMIFS(Registros!F:F, Registros!A:A, \">=\" & fecha_inicial, Registros!A:A, \"<=\" & fecha_final,  Registros!B:B, \"=\" & '1000'!A65))","v":0},0]
[1407,"Código de Cuenta Incorrecto",{"$f":"IF(ISBLANK(A66),0, SUMIFS(Registros!F:F,Registros!A:A,\"<\"&fecha_inicial,Registros!B:B,\"=\"&A66)) - IF(ISBLANK(A66),0, SUMIFS(Registros!E:E,Registros!A:A,\"<\"&fecha_inicial,Registros!B:B,\"=\"&A66))","v":0},{"$f":"IF(ISBLANK(A66), 0, SUMIFS(Registros!E:E, Registros!A:A, \">=\" & fecha_inicial, Registros!A:A, \"<=\" & fecha_final,  Registros!B:B, \"=\" & '1000'!A66))","v":0},{"$f":"IF(ISBLANK(A66), 0, SUMIFS(Registros!F:F, Registros!A:A, \">=\" & fecha_inicial, Registros!A:A, \"<=\" & fecha_final,  Registros!B:B, \"=\" & '1000'!A66))","v":0},0]
[1408,"Código de Cuenta Incorrecto",{"$f":"IF(ISBLANK(A67),0, SUMIFS(Registros!F:F,Registros!A:A,\"<\"&fecha_inicial,Registros!B:B,\"=\"&A67)) - IF(ISBLANK(A67),0, SUMIFS(Registros!E:E,Registros!A:A,\"<\"&fecha_inicial,Registros!B:B,\"=\"&A67))","v":0},{"$f":"IF(ISBLANK(A67), 0, SUMIFS(Registros!E:E, Registros!A:A, \">=\" & fecha_inicial, Registros!A:A, \"<=\" & fecha_final,  Registros!B:B, \"=\" & '1000'!A67))","v":0},{"$f":"IF(ISBLANK(A67), 0, SUMIFS(Registros!F:F, Registros!A:A, \">=\" & fecha_inicial, Registros!A:A, \"<=\" & fecha_final,  Registros!B:B, \"=\" & '1000'!A67))","v":0},0]
[1409,"Código de Cuenta Incorrecto",{"$f":"IF(ISBLANK(A68),0, SUMIFS(Registros!F:F,Registros!A:A,\"<\"&fecha_inicial,Registros!B:B,\"=\"&A68)) - IF(ISBLANK(A68),0, SUMIFS(Registros!E:E,Registros!A:A,\"<\"&fecha_inicial,Registros!B:B,\"=\"&A68))","v":0},{"$f":"IF(ISBLANK(A68), 0, SUMIFS(Registros!E:E, Registros!A:A, \">=\" & fecha_inicial, Registros!A:A, \"<=\" & fecha_final,  Registros!B:B, \"=\" & '1000'!A68))","v":0},{"$f":"IF(ISBLANK(A68), 0, SUMIFS(Registros!F:F, Registros!A:A, \">=\" & fecha_inicial, Registros!A:A, \"<=\" & fecha_final,  Registros!B:B, \"=\" & '1000'!A68))","v":0},0]
[1410,"Código de Cuenta Incorrecto",{"$f":"IF(ISBLANK(A69),0, SUMIFS(Registros!F:F,Registros!A:A,\"<\"&fecha_inicial,Registros!B:B,\"=\"&A69)) - IF(ISBLANK(A69),0, SUMIFS(Registros!E:E,Registros!A:A,\"<\"&fecha_inicial,Registros!B:B,\"=\"&A69))","v":0},{"$f":"IF(ISBLANK(A69), 0, SUMIFS(Registros!E:E, Registros!A:A, \">=\" & fecha_inicial, Registros!A:A, \"<=\" & fecha_final,  Registros!B:B, \"=\" & '1000'!A69))","v":0},{"$f":"IF(ISBLANK(A69), 0, SUMIFS(Registros!F:F, Registros!A:A, \">=\" & fecha_inicial, Registros!A:A, \"<=\" & fecha_final,  Registros!B:B, \"=\" & '1000'!A69))","v":0},0]
[1411,"Código de Cuenta Incorrecto",{"$f":"IF(ISBLANK(A70),0, SUMIFS(Registros!F:F,Registros!A:A,\"<\"&fecha_inicial,Registros!B:B,\"=\"&A70)) - IF(ISBLANK(A70),0, SUMIFS(Registros!E:E,Registros!A:A,\"<\"&fecha_inicial,Registros!B:B,\"=\"&A70))","v":0},{"$f":"IF(ISBLANK(A70), 0, SUMIFS(Registros!E:E, Registros!A:A, \">=\" & fecha_inicial, Registros!A:A, \"<=\" & fecha_final,  Registros!B:B, \"=\" & '1000'!A70))","v":0},{"$f":"IF(ISBLANK(A70), 0, SUMIFS(Registros!F:F, Registros!A:A, \">=\" & fecha_inicial, Registros!A:A, \"<=\" & fecha_final,  Registros!B:B, \"=\" & '1000'!A70))","v":0},0]
[1412,"Código de Cuenta Incorrecto",{"$f":"IF(ISBLANK(A71),0, SUMIFS(Registros!F:F,Registros!A:A,\"<\"&fecha_inicial,Registros!B:B,\"=\"&A71)) - IF(ISBLANK(A71),0, SUMIFS(Registros!E:E,Registros!A:A,\"<\"&fecha_inicial,Registros!B:B,\"=\"&A71))","v":0},{"$f":"IF(ISBLANK(A71), 0, SUMIFS(Registros!E:E, Registros!A:A, \">=\" & fecha_inicial, Registros!A:A, \"<=\" & fecha_final,  Registros!B:B, \"=\" & '1000'!A71))","v":0},{"$f":"IF(ISBLANK(A71), 0, SUMIFS(Registros!F:F, Registros!A:A, \">=\" & fecha_inicial, Registros!A:A, \"<=\" & fecha_final,  Registros!B:B, \"=\" & '1000'!A71))","v":0},0]
[1413,"Código de Cuenta Incorrecto",{"$f":"IF(ISBLANK(A72),0, SUMIFS(Registros!F:F,Registros!A:A,\"<\"&fecha_inicial,Registros!B:B,\"=\"&A72)) - IF(ISBLANK(A72),0, SUMIFS(Registros!E:E,Registros!A:A,\"<\"&fecha_inicial,Registros!B:B,\"=\"&A72))","v":0},{"$f":"IF(ISBLANK(A72), 0, SUMIFS(Registros!E:E, Registros!A:A, \">=\" & fecha_inicial, Registros!A:A, \"<=\" & fecha_final,  Registros!B:B, \"=\" & '1000'!A72))","v":0},{"$f":"IF(ISBLANK(A72), 0, SUMIFS(Registros!F:F, Registros!A:A, \">=\" & fecha_inicial, Registros!A:A, \"<=\" & fecha_final,  Registros!B:B, \"=\" & '1000'!A72))","v":0},0]
[1414,"Código de Cuenta Incorrecto",{"$f":"IF(ISBLANK(A73),0, SUMIFS(Registros!F:F,Registros!A:A,\"<\"&fecha_inicial,Registros!B:B,\"=\"&A73)) - IF(ISBLANK(A73),0, SUMIFS(Registros!E:E,Registros!A:A,\"<\"&fecha_inicial,Registros!B:B,\"=\"&A73))","v":0},{"$f":"IF(ISBLANK(A73), 0, SUMIFS(Registros!E:E, Registros!A:A, \">=\" & fecha_inicial, Registros!A:A, \"<=\" & fecha_final,  Registros!B:B, \"=\" & '1000'!A73))","v":0},{"$f":"IF(ISBLANK(A73), 0, SUMIFS(Registros!F:F, Registros!A:A, \">=\" & fecha_inicial, Registros!A:A, \"<=\" & fecha_final,  Registros!B:B, \"=\" & '1000'!A73))","v":0},0]
[1415,"Código de Cuenta Incorrecto",{"$f":"IF(ISBLANK(A74),0, SUMIFS(Registros!F:F,Registros!A:A,\"<\"&fecha_inicial,Registros!B:B,\"=\"&A74)) - IF(ISBLANK(A74),0, SUMIFS(Registros!E:E,Registros!A:A,\"<\"&fecha_inicial,Registros!B:B,\"=\"&A74))","v":0},{"$f":"IF(ISBLANK(A74), 0, SUMIFS(Registros!E:E, Registros!A:A, \">=\" & fecha_inicial, Registros!A:A, \"<=\" & fecha_final,  Registros!B:B, \"=\" & '1000'!A74))","v":0},{"$f":"IF(ISBLANK(A74), 0, SUMIFS(Registros!F:F, Registros!A:A, \">=\" & fecha_inicial, Registros!A:A, \"<=\" & fecha_final,  Registros!B:B, \"=\" & '1000'!A74))","v":0},0]
[{"$f":"\"SALDO FINAL DE LA CUENTA AL \" &TEXT(fecha_final, \"dd\")&\" DE \"&UPPER(TEXT(fecha_final, \"MMMM\"))&\" DEL \"& TEXT(fecha_final, \"YYYY\")","v":"SALDO FINAL DE LA CUENTA AL 00 DE ENERO DEL 1900"},null,{"$f":"C11+C27+C43+C59","v":0},{"$f":"D11+D27+D43+D59","v":0},{"$f":"E11+E27+E43+E59","v":0},{"$f":"C75+D75-E75","v":0}]
[]
[]
[]
[]
["ELABORA",null,null,null,"REVISA"]
[{"$f":"VLOOKUP(A80, Usuarios!B12:E14, 2, FALSE)","v":"Arlen de Jesús Baltodano López"},null,null,null,{"$f":"VLOOKUP(E80, Usuarios!B12:E14, 2, FALSE)","v":"Gersan Arguello Prado"}]
[{"$f":"VLOOKUP(A80, Usuarios!B12:E14, 4, FALSE)","v":"Auxiliar de Contabilidad"},null,null,null,{"$f":"VLOOKUP(E80, Usuarios!B12:E14, 4, FALSE)","v":"Contador General"}]
[]
[]
[null,null,"AUTORIZA"]
[null,null,{"$f":"VLOOKUP(C85, Usuarios!B12:E14, 2, FALSE)","v":"Matilda Padilla Mayorga"}]
[null,null,{"$f":"VLOOKUP(C85, Usuarios!B12:E14, 4, FALSE)","v":"Gerente de Finanzas"}]

{"sheet":"2000","index":15,"n_rows":87,"n_cols":6,"rows_kept":87,"cut":false,"hidden":false,"merged":[[86,2,86,3],[80,0,80,1],[80,4,80,5],[81,0,81,1],[81,4,81,5],[84,2,84,3],[85,2,85,3],[7,5,8,5],[74,0,74,1],[78,0,78,1],[78,4,78,5],[79,0,79,1],[79,4,79,5],[7,0,8,0],[7,1,8,1],[7,2,8,2],[7,3,8,3],[7,4,8,4],[1,0,1,5],[2,0,2,5],[3,0,3,5],[4,0,4,5],[6,3,6,5]]}
[null,null,null,null,"Proteger"]
[{"$f":"nombre_empresa","v":"CONSULTORES DE OMETEPE"}]
[{"$f":"\"RESUMEN CONTABLE DE \"&B7","v":"RESUMEN CONTABLE DE PASIVOS"}]
[{"$f":"\"DEL \"&TEXT(fecha_inicial, \"DD\")&\" DE \"&UPPER(TEXT(fecha_inicial, \"MMMM\"))&\" AL \"&TEXT(fecha_final, \"DD\")&\" DE \"&UPPER(TEXT(fecha_final, \"MMMM\"))&\" DE \"&TEXT(fecha_final, \"YYYY\")","v":"DEL 00 DE ENERO AL 00 DE ENERO DE 1900"}]
[{"$f":"direccion & \" *** Tel/Fax:  \" & tel_fax & \" *** \" & email","v":"Barrio el Progreso, San Jorge, Rivas. *** Tel/Fax:  89040457 *** escribeme@radioometepe.com"}]
[]
[2000,{"$f":"UPPER(IF(ISBLANK(A7),\"\",IFERROR(VLOOKUP(A7,plan_cuentas,2,FALSE),\"Código de cuenta incorrecto\")))","v":"PASIVOS"},null,{"$f":"\"MOVIMIENTOS DE \"&UPPER(TEXT(fecha_final, \"MMMM\"))","v":"MOVIMIENTOS DE ENERO"}]
["CODIGO","NOMBRE DE LA CUENTA","SALDO INICIAL","DEBITOS","CREDITOS","SALDO FINAL"]
[]
[]
[2100,{"$f":"IF(A11<>0, IF(ISERROR(VLOOKUP(A11, plan_cuentas,2, FALSE)), \"Código de Cuenta Incorrecto\", UPPER(VLOOKUP(A11, plan_cuentas, 2, FALSE))), \"\")","v":"PASIVOS CIRCULANTES"},{"$f":"SUM(C12:C26)","v":0},{"$f":"SUM(D12:D26)","v":0},0,{"$f":"C11-D11+E11","v":0}]
[2101,"PROVEEDORES",{"$f":"IF(ISBLANK(A12),0, SUMIFS(Registros!F:F,Registros!A:A,\"<\"&fecha_inicial,Registros!B:B,\"=\"&'2000'!A12)) - IF(ISBLANK(A12),0, SUMIFS(Registros!E:E,Registros!A:A,\"<\"&fecha_inicial,Registros!B:B,\"=\"&'2000'!A12))","v":0},{"$f":"IF(ISBLANK(A12), 0, SUMIFS(Registros!E:E, Registros!A:A, \">=\" & fecha_inicial, Registros!A:A, \"<=\" & fecha_final,  Registros!B:B, \"=\" & '2000'!A12))","v":0},{"$f":"IF(ISBLANK(A12), 0, SUMIFS(Registros!F:F, Registros!A:A, \">=\" & fecha_inicial, Registros!A:A, \"<=\" & fecha_final,  Registros!B:B, \"=\" & '2000'!A12))","v":0},{"$f":"C12-D12+E12","v":0}]
[2102,"DOCUMENTOS POR PAGAR",{"$f":"IF(ISBLANK(A13),0, SUMIFS(Registros!F:F,Registros!A:A,\"<\"&fecha_inicial,Registros!B:B,\"=\"&'2000'!A13)) - IF(ISBLANK(A13),0, SUMIFS(Registros!E:E,Registros!A:A,\"<\"&fecha_inicial,Registros!B:B,\"=\"&'2000'!A13))","v":0},{"$f":"IF(ISBLANK(A13), 0, SUMIFS(Registros!E:E, Registros!A:A, \">=\" & fecha_inicial, Registros!A:A, \"<=\" & fecha_final,  Registros!B:B, \"=\" & '2000'!A13))","v":0},{"$f":"IF(ISBLANK(A13), 0, SUMIFS(Registros!F:F, Registros!A:A, \">=\" & fecha_inicial, Registros!A:A, \"<=\" & fecha_final,  Registros!B:B, \"=\" & '2000'!A13))","v":0},0]
[2103,"ACREEDORES",{"$f":"IF(ISBLANK(A14),0, SUMIFS(Registros!F:F,Registros!A:A,\"<\"&fecha_inicial,Registros!B:B,\"=\"&'2000'!A14)) - IF(ISBLANK(A14),0, SUMIFS(Registros!E:E,Registros!A:A,\"<\"&fecha_inicial,Registros!B:B,\"=\"&'2000'!A14))","v":0},{"$f":"IF(ISBLANK(A14), 0, SUMIFS(Registros!E:E, Registros!A:A, \">=\" & fecha_inicial, Registros!A:A, \"<=\" & fecha_final,  Registros!B:B, \"=\" & '2000'!A14))","v":0},{"$f":"IF(ISBLANK(A14), 0, SUMIFS(Registros!F:F, Registros!A:A, \">=\" & fecha_inicial, Registros!A:A, \"<=\" & fecha_final,  Registros!B:B, \"=\" & '2000'!A14))","v":0},0]
[2104,"ACREEDORES BANCARIOS",{"$f":"IF(ISBLANK(A15),0, SUMIFS(Registros!F:F,Registros!A:A,\"<\"&fecha_inicial,Registros!B:B,\"=\"&'2000'!A15)) - IF(ISBLANK(A15),0, SUMIFS(Registros!E:E,Registros!A:A,\"<\"&fecha_inicial,Registros!B:B,\"=\"&'2000'!A15))","v":0},{"$f":"IF(ISBLANK(A15), 0, SUMIFS(Registros!E:E, Registros!A:A, \">=\" & fecha_inicial, Registros!A:A, \"<=\" & fecha_final,  Registros!B:B, \"=\" & '2000'!A15))","v":0},{"$f":"IF(ISBLANK(A15), 0, SUMIFS(Registros!F:F, Registros!A:A, \">=\" & fecha_inicial, Registros!A:A, \"<=\" & fecha_final,  Registros!B:B, \"=\" & '2000'!A15))","v":0},0]
[2105,"ANTICIPOS DE CLIENTES",{"$f":"IF(ISBLANK(A16),0, SUMIFS(Registros!F:F,Registros!A:A,\"<\"&fecha_inicial,Registros!B:B,\"=\"&'2000'!A16)) - IF(ISBLANK(A16),0, SUMIFS(Registros!E:E,Registros!A:A,\"<\"&fecha_inicial,Registros!B:B,\"=\"&'2000'!A16))","v":0},{"$f":"IF(ISBLANK(A16), 0, SUMIFS(Registros!E:E, Registros!A:A, \">=\" & fecha_inicial, Registros!A:A, \"<=\" & fecha_final,  Registros!B:B, \"=\" & '2000'!A16))","v":0},{"$f":"IF(ISBLANK(A16), 0, SUMIFS(Registros!F:F, Registros!A:A, \">=\" & fecha_inicial, Registros!A:A, \"<=\" & fecha_final,  Registros!B:B, \"=\" & '2000'!A16))","v":0},0]
[2106,"IVA POR PAGAR",{"$f":"IF(ISBLANK(A17),0, SUMIFS(Registros!F:F,Registros!A:A,\"<\"&fecha_inicial,Registros!B:B,\"=\"&'2000'!A17)) - IF(ISBLANK(A17),0, SUMIFS(Registros!E:E,Registros!A:A,\"<\"&fecha_inicial,Registros!B:B,\"=\"&'2000'!A17))","v":0},{"$f":"IF(ISBLANK(A17), 0, SUMIFS(Registros!E:E, Registros!A:A, \">=\" & fecha_inicial, Registros!A:A, \"<=\" & fecha_final,  Registros!B:B, \"=\" & '2000'!A17))","v":0},{"$f":"IF(ISBLANK(A17), 0, SUMIFS(Registros!F:F, Registros!A:A, \">=\" & fecha_inicial, Registros!A:A, \"<=\" & fecha_final,  Registros!B:B, \"=\" & '2000'!A17))","v":0},0]
[2107,"IR POR PAGAR",{"$f":"IF(ISBLANK(A18),0, SUMIFS(Registros!F:F,Registros!A:A,\"<\"&fecha_inicial,Registros!B:B,\"=\"&'2000'!A18)) - IF(ISBLANK(A18),0, SUMIFS(Registros!E:E,Registros!A:A,\"<\"&fecha_inicial,Registros!B:B,\"=\"&'2000'!A18))","v":0},{"$f":"IF(ISBLANK(A18), 0, SUMIFS(Registros!E:E, Registros!A:A, \">=\" & fecha_inicial, Registros!A:A, \"<=\" & fecha_final,  Registros!B:B, \"=\" & '2000'!A18))","v":0},{"$f":"IF(ISBLANK(A18), 0, SUMIFS(Registros!F:F, Registros!A:A, \">=\" & fecha_inicial, Registros!A:A, \"<=\" & fecha_final,  Registros!B:B, \"=\" & '2000'!A18))","v":0},0]
[2108,"RENTAS COBRADAS POR ANTICIPADO",{"$f":"IF(ISBLANK(A19),0, SUMIFS(Registros!F:F,Registros!A:A,\"<\"&fecha_inicial,Registros!B:B,\"=\"&'2000'!A19)) - IF(ISBLANK(A19),0, SUMIFS(Registros!E:E,Registros!A:A,\"<\"&fecha_inicial,Registros!B:B,\"=\"&'2000'!A19))","v":0},{"$f":"IF(ISBLANK(A19), 0, SUMIFS(Registros!E:E, Registros!A:A, \">=\" & fecha_inicial, Registros!A:A, \"<=\" & fecha_final,  Registros!B:B, \"=\" & '2000'!A19))","v":0},{"$f":"IF(ISBLANK(A19), 0, SUMIFS(Registros!F:F, Registros!A:A, \">=\" & fecha_inicial, Registros!A:A, \"<=\" & fecha_final,  Registros!B:B, \"=\" & '2000'!A19))","v":0},0]
[2109,"INTERESES COBRADOS POR ANTICIPADOS",{"$f":"IF(ISBLANK(A20),0, SUMIFS(Registros!F:F,Registros!A:A,\"<\"&fecha_inicial,Registros!B:B,\"=\"&'2000'!A20)) - IF(ISBLANK(A20),0, SUMIFS(Registros!E:E,Registros!A:A,\"<\"&fecha_inicial,Registros!B:B,\"=\"&'2000'!A20))","v":0},{"$f":"IF(ISBLANK(A20), 0, SUMIFS(Registros!E:E, Registros!A:A, \">=\" & fecha_inicial, Registros!A:A, \"<=\" & fecha_final,  Registros!B:B, \"=\" & '2000'!A20))","v":0},{"$f":"IF(ISBLANK(A20), 0, SUMIFS(Registros!F:F, Registros!A:A, \">=\" & fecha_inicial, Registros!A:A, \"<=\" & fecha_final,  Registros!B:B, \"=\" & '2000'!A20))","v":0},0]
[2110,"Código de Cuenta Incorrecto",{"$f":"IF(ISBLANK(A21),0, SUMIFS(Registros!F:F,Registros!A:A,\"<\"&fecha_inicial,Registros!B:B,\"=\"&'2000'!A21)) - IF(ISBLANK(A21),0, SUMIFS(Registros!E:E,Registros!A:A,\"<\"&fecha_inicial,Registros!B:B,\"=\"&'2000'!A21))","v":0},{"$f":"IF(ISBLANK(A21), 0, SUMIFS(Registros!E:E, Registros!A:A, \">=\" & fecha_inicial, Registros!A:A, \"<=\" & fecha_final,  Registros!B:B, \"=\" & '2000'!A21))","v":0},{"$f":"IF(ISBLANK(A21), 0, SUMIFS(Registros!F:F, Registros!A:A, \">=\" & fecha_inicial, Registros!A:A, \"<=\" & fecha_final,  Registros!B:B, \"=\" & '2000'!A21))","v":0},0]
[2111,"Código de Cuenta Incorrecto",{"$f":"IF(ISBLANK(A22),0, SUMIFS(Registros!F:F,Registros!A:A,\"<\"&fecha_inicial,Registros!B:B,\"=\"&'2000'!A22)) - IF(ISBLANK(A22),0, SUMIFS(Registros!E:E,Registros!A:A,\"<\"&fecha_inicial,Registros!B:B,\"=\"&'2000'!A22))","v":0},{"$f":"IF(ISBLANK(A22), 0, SUMIFS(Registros!E:E, Registros!A:A, \">=\" & fecha_inicial, Registros!A:A, \"<=\" & fecha_final,  Registros!B:B, \"=\" & '2000'!A22))","v":0},{"$f":"IF(ISBLANK(A22), 0, SUMIFS(Registros!F:F, Registros!A:A, \">=\" & fecha_inicial, Registros!A:A, \"<=\" & fecha_final,  Registros!B:B, \"=\" & '2000'!A22))","v":0},0]
[2112,"Código de Cuenta Incorrecto",{"$f":"IF(ISBLANK(A23),0, SUMIFS(Registros!F:F,Registros!A:A,\"<\"&fecha_inicial,Registros!B:B,\"=\"&'2000'!A23)) - IF(ISBLANK(A23),0, SUMIFS(Registros!E:E,Registros!A:A,\"<\"&fecha_inicial,Registros!B:B,\"=\"&'2000'!A23))","v":0},{"$f":"IF(ISBLANK(A23), 0, SUMIFS(Registros!E:E, Registros!A:A, \">=\" & fecha_inicial, Registros!A:A, \"<=\" & fecha_final,  Registros!B:B, \"=\" & '2000'!A23))","v":0},{"$f":"IF(ISBLANK(A23), 0, SUMIFS(Registros!F:F, Registros!A:A, \">=\" & fecha_inicial, Registros!A:A, \"<=\" & fecha_final,  Registros!B:B, \"=\" & '2000'!A23))","v":0},0]
[2113,"Código de Cuenta Incorrecto",{"$f":"IF(ISBLANK(A24),0, SUMIFS(Registros!F:F,Registros!A:A,\"<\"&fecha_inicial,Registros!B:B,\"=\"&'2000'!A24)) - IF(ISBLANK(A24),0, SUMIFS(Registros!E:E,Registros!A:A,\"<\"&fecha_inicial,Registros!B:B,\"=\"&'2000'!A24))","v":0},{"$f":"IF(ISBLANK(A24), 0, SUMIFS(Registros!E:E, Registros!A:A, \">=\" & fecha_inicial, Registros!A:A, \"<=\" & fecha_final,  Registros!B:B, \"=\" & '2000'!A24))","v":0},{"$f":"IF(ISBLANK(A24), 0, SUMIFS(Registros!F:F, Registros!A:A, \">=\" & fecha_inicial, Registros!A:A, \"<=\" & fecha_final,  Registros!B:B, \"=\" & '2000'!A24))","v":0},0]
[2114,"Código de Cuenta Incorrecto",{"$f":"IF(ISBLANK(A25),0, SUMIFS(Registros!F:F,Registros!A:A,\"<\"&fecha_inicial,Registros!B:B,\"=\"&'2000'!A25)) - IF(ISBLANK(A25),0, SUMIFS(Registros!E:E,Registros!A:A,\"<\"&fecha_inicial,Registros!B:B,\"=\"&'2000'!A25))","v":0},{"$f":"IF(ISBLANK(A25), 0, SUMIFS(Registros!E:E, Registros!A:A, \">=\" & fecha_inicial, Registros!A:A, \"<=\" & fecha_final,  Registros!B:B, \"=\" & '2000'!A25))","v":0},{"$f":"IF(ISBLANK(A25), 0, SUMIFS(Registros!F:F, Registros!A:A, \">=\" & fecha_inicial, Registros!A:A, \"<=\" & fecha_final,  Registros!B:B, \"=\" & '2000'!A25))","v":0},0]
[2115,"Código de Cuenta Incorrecto",{"$f":"IF(ISBLANK(A26),0, SUMIFS(Registros!F:F,Registros!A:A,\"<\"&fecha_inicial,Registros!B:B,\"=\"&'2000'!A26)) - IF(ISBLANK(A26),0, SUMIFS(Registros!E:E,Registros!A:A,\"<\"&fecha_inicial,Registros!B:B,\"=\"&'2000'!A26))","v":0},{"$f":"IF(ISBLANK(A26), 0, SUMIFS(Registros!E:E, Registros!A:A, \">=\" & fecha_inicial, Registros!A:A, \"<=\" & fecha_final,  Registros!B:B, \"=\" & '2000'!A26))","v":0},{"$f":"IF(ISBLANK(A26), 0, SUMIFS(Registros!F:F, Registros!A:A, \">=\" & fecha_inicial, Registros!A:A, \"<=\" & fecha_final,  Registros!B:B, \"=\" & '2000'!A26))","v":0},0]
[2200,"PASIVOS FIJOS",{"$f":"SUM(C28:C42)","v":0},{"$f":"SUM(D28:D42)","v":0},{"$f":"SUM(E28:E42)","v":0},0]
[2201,"ACREEDORES HIPOTECARIOS",{"$f":"IF(ISBLANK(A28),0, SUMIFS(Registros!F:F,Registros!A:A,\"<\"&fecha_inicial,Registros!B:B,\"=\"&'2000'!A28)) - IF(ISBLANK(A28),0, SUMIFS(Registros!E:E,Registros!A:A,\"<\"&fecha_inicial,Registros!B:B,\"=\"&'2000'!A28))","v":0},{"$f":"IF(ISBLANK(A28), 0, SUMIFS(Registros!E:E, Registros!A:A, \">=\" & fecha_inicial, Registros!A:A, \"<=\" & fecha_final,  Registros!B:B, \"=\" & '2000'!A28))","v":0},{"$f":"IF(ISBLANK(A28), 0, SUMIFS(Registros!F:F, Registros!A:A, \">=\" & fecha_inicial, Registros!A:A, \"<=\" & fecha_final,  Registros!B:B, \"=\" & '2000'!A28))","v":0},0]
[2202,"ACREEDORES BANCARIOS",{"$f":"IF(ISBLANK(A29),0, SUMIFS(Registros!F:F,Registros!A:A,\"<\"&fecha_inicial,Registros!B:B,\"=\"&'2000'!A29)) - IF(ISBLANK(A29),0, SUMIFS(Registros!E:E,Registros!A:A,\"<\"&fecha_inicial,Registros!B:B,\"=\"&'2000'!A29))","v":0},{"$f":"IF(ISBLANK(A29), 0, SUMIFS(Registros!E:E, Registros!A:A, \">=\" & fecha_inicial, Registros!A:A, \"<=\" & fecha_final,  Registros!B:B, \"=\" & '2000'!A29))","v":0},{"$f":"IF(ISBLANK(A29), 0, SUMIFS(Registros!F:F, Registros!A:A, \">=\" & fecha_inicial, Registros!A:A, \"<=\" & fecha_final,  Registros!B:B, \"=\" & '2000'!A29))","v":0},0]
[2203,"DOCUMENTOS POR PAGAR L/P",{"$f":"IF(ISBLANK(A30),0, SUMIFS(Registros!F:F,Registros!A:A,\"<\"&fecha_inicial,Registros!B:B,\"=\"&'2000'!A30)) - IF(ISBLANK(A30),0, SUMIFS(Registros!E:E,Registros!A:A,\"<\"&fecha_inicial,Registros!B:B,\"=\"&'2000'!A30))","v":0},{"$f":"IF(ISBLANK(A30), 0, SUMIFS(Registros!E:E, Registros!A:A, \">=\" & fecha_inicial, Registros!A:A, \"<=\" & fecha_final,  Registros!B:B, \"=\" & '2000'!A30))","v":0},{"$f":"IF(ISBLANK(A30), 0, SUMIFS(Registros!F:F, Registros!A:A, \">=\" & fecha_inicial, Registros!A:A, \"<=\" & fecha_final,  Registros!B:B, \"=\" & '2000'!A30))","v":0},0]
[2204,"Código de Cuenta Incorrecto",{"$f":"IF(ISBLANK(A31),0, SUMIFS(Registros!F:F,Registros!A:A,\"<\"&fecha_inicial,Registros!B:B,\"=\"&'2000'!A31)) - IF(ISBLANK(A31),0, SUMIFS(Registros!E:E,Registros!A:A,\"<\"&fecha_inicial,Registros!B:B,\"=\"&'2000'!A31))","v":0},{"$f":"IF(ISBLANK(A31), 0, SUMIFS(Registros!E:E, Registros!A:A, \">=\" & fecha_inicial, Registros!A:A, \"<=\" & fecha_final,  Registros!B:B, \"=\" & '2000'!A31))","v":0},{"$f":"IF(ISBLANK(A31), 0, SUMIFS(Registros!F:F, Registros!A:A, \">=\" & fecha_inicial, Registros!A:A, \"<=\" & fecha_final,  Registros!B:B, \"=\" & '2000'!A31))","v":0},0]
[2205,"Código de Cuenta Incorrecto",{"$f":"IF(ISBLANK(A32),0, SUMIFS(Registros!F:F,Registros!A:A,\"<\"&fecha_inicial,Registros!B:B,\"=\"&'2000'!A32)) - IF(ISBLANK(A32),0, SUMIFS(Registros!E:E,Registros!A:A,\"<\"&fecha_inicial,Registros!B:B,\"=\"&'2000'!A32))","v":0},{"$f":"IF(ISBLANK(A32), 0, SUMIFS(Registros!E:E, Registros!A:A, \">=\" & fecha_inicial, Registros!A:A, \"<=\" & fecha_final,  Registros!B:B, \"=\" & '2000'!A32))","v":0},{"$f":"IF(ISBLANK(A32), 0, SUMIFS(Registros!F:F, Registros!A:A, \">=\" & fecha_inicial, Registros!A:A, \"<=\" & fecha_final,  Registros!B:B, \"=\" & '2000'!A32))","v":0},0]
[2206,"Código de Cuenta Incorrecto",{"$f":"IF(ISBLANK(A33),0, SUMIFS(Registros!F:F,Registros!A:A,\"<\"&fecha_inicial,Registros!B:B,\"=\"&'2000'!A33)) - IF(ISBLANK(A33),0, SUMIFS(Registros!E:E,Registros!A:A,\"<\"&fecha_inicial,Registros!B:B,\"=\"&'2000'!A33))","v":0},{"$f":"IF(ISBLANK(A33), 0, SUMIFS(Registros!E:E, Registros!A:A, \">=\" & fecha_inicial, Registros!A:A, \"<=\" & fecha_final,  Registros!B:B, \"=\" & '2000'!A33))","v":0},{"$f":"IF(ISBLANK(A33), 0, SUMIFS(Registros!F:F, Registros!A:A, \">=\" & fecha_inicial, Registros!A:A, \"<=\" & fecha_final,  Registros!B:B, \"=\" & '2000'!A33))","v":0},0]
[2207,"Código de Cuenta Incorrecto",{"$f":"IF(ISBLANK(A34),0, SUMIFS(Registros!F:F,Registros!A:A,\"<\"&fecha_inicial,Registros!B:B,\"=\"&'2000'!A34)) - IF(ISBLANK(A34),0, SUMIFS(Registros!E:E,Registros!A:A,\"<\"&fecha_inicial,Registros!B:B,\"=\"&'2000'!A34))","v":0},{"$f":"IF(ISBLANK(A34), 0, SUMIFS(Registros!E:E, Registros!A:A, \">=\" & fecha_inicial, Registros!A:A, \"<=\" & fecha_final,  Registros!B:B, \"=\" & '2000'!A34))","v":0},{"$f":"IF(ISBLANK(A34), 0, SUMIFS(Registros!F:F, Registros!A:A, \">=\" & fecha_inicial, Registros!A:A, \"<=\" & fecha_final,  Registros!B:B, \"=\" & '2000'!A34))","v":0},0]
[2208,"Código de Cuenta Incorrecto",{"$f":"IF(ISBLANK(A35),0, SUMIFS(Registros!F:F,Registros!A:A,\"<\"&fecha_inicial,Registros!B:B,\"=\"&'2000'!A35)) - IF(ISBLANK(A35),0, SUMIFS(Registros!E:E,Registros!A:A,\"<\"&fecha_inicial,Registros!B:B,\"=\"&'2000'!A35))","v":0},{"$f":"IF(ISBLANK(A35), 0, SUMIFS(Registros!E:E, Registros!A:A, \">=\" & fecha_inicial, Registros!A:A, \"<=\" & fecha_final,  Registros!B:B, \"=\" & '2000'!A35))","v":0},{"$f":"IF(ISBLANK(A35), 0, SUMIFS(Registros!F:F, Registros!A:A, \">=\" & fecha_inicial, Registros!A:A, \"<=\" & fecha_final,  Registros!B:B, \"=\" & '2000'!A35))","v":0},0]
[2209,"Código de Cuenta Incorrecto",{"$f":"IF(ISBLANK(A36),0, SUMIFS(Registros!F:F,Registros!A:A,\"<\"&fecha_inicial,Registros!B:B,\"=\"&'2000'!A36)) - IF(ISBLANK(A36),0, SUMIFS(Registros!E:E,Registros!A:A,\"<\"&fecha_inicial,Registros!B:B,\"=\"&'2000'!A36))","v":0},{"$f":"IF(ISBLANK(A36), 0, SUMIFS(Registros!E:E, Registros!A:A, \">=\" & fecha_inicial, Registros!A:A, \"<=\" & fecha_final,  Registros!B:B, \"=\" & '2000'!A36))","v":0},{"$f":"IF(ISBLANK(A36), 0, SUMIFS(Registros!F:F, Registros!A:A, \">=\" & fecha_inicial, Registros!A:A, \"<=\" & fecha_final,  Registros!B:B, \"=\" & '2000'!A36))","v":0},0]
[2210,"Código de Cuenta Incorrecto",{"$f":"IF(ISBLANK(A37),0, SUMIFS(Registros!F:F,Registros!A:A,\"<\"&fecha_inicial,Registros!B:B,\"=\"&'2000'!A37)) - IF(ISBLANK(A37),0, SUMIFS(Registros!E:E,Registros!A:A,\"<\"&fecha_inicial,Registros!B:B,\"=\"&'2000'!A37))","v":0},{"$f":"IF(ISBLANK(A37), 0, SUMIFS(Registros!E:E, Registros!A:A, \">=\" & fecha_inicial, Registros!A:A, \"<=\" & fecha_final,  Registros!B:B, \"=\" & '2000'!A37))","v":0},{"$f":"IF(ISBLANK(A37), 0, SUMIFS(Registros!F:F, Registros!A:A, \">=\" & fecha_inicial, Registros!A:A, \"<=\" & fecha_final,  Registros!B:B, \"=\" & '2000'!A37))","v":0},0]
[2211,"Código de Cuenta Incorrecto",{"$f":"IF(ISBLANK(A38),0, SUMIFS(Registros!F:F,Registros!A:A,\"<\"&fecha_inicial,Registros!B:B,\"=\"&'2000'!A38)) - IF(ISBLANK(A38),0, SUMIFS(Registros!E:E,Registros!A:A,\"<\"&fecha_inicial,Registros!B:B,\"=\"&'2000'!A38))","v":0},{"$f":"IF(ISBLANK(A38), 0, SUMIFS(Registros!E:E, Registros!A:A, \">=\" & fecha_inicial, Registros!A:A, \"<=\" & fecha_final,  Registros!B:B, \"=\" & '2000'!A38))","v":0},{"$f":"IF(ISBLANK(A38), 0, SUMIFS(Registros!F:F, Registros!A:A, \">=\" & fecha_inicial, Registros!A:A, \"<=\" & fecha_final,  Registros!B:B, \"=\" & '2000'!A38))","v":0},0]
[2212,"Código de Cuenta Incorrecto",{"$f":"IF(ISBLANK(A39),0, SUMIFS(Registros!F:F,Registros!A:A,\"<\"&fecha_inicial,Registros!B:B,\"=\"&'2000'!A39)) - IF(ISBLANK(A39),0, SUMIFS(Registros!E:E,Registros!A:A,\"<\"&fecha_inicial,Registros!B:B,\"=\"&'2000'!A39))","v":0},{"$f":"IF(ISBLANK(A39), 0, SUMIFS(Registros!E:E, Registros!A:A, \">=\" & fecha_inicial, Registros!A:A, \"<=\" & fecha_final,  Registros!B:B, \"=\" & '2000'!A39))","v":0},{"$f":"IF(ISBLANK(A39), 0, SUMIFS(Registros!F:F, Registros!A:A, \">=\" & fecha_inicial, Registros!A:A, \"<=\" & fecha_final,  Registros!B:B, \"=\" & '2000'!A39))","v":0},0]
[2213,"Código de Cuenta Incorrecto",{"$f":"IF(ISBLANK(A40),0, SUMIFS(Registros!F:F,Registros!A:A,\"<\"&fecha_inicial,Registros!B:B,\"=\"&'2000'!A40)) - IF(ISBLANK(A40),0, SUMIFS(Registros!E:E,Registros!A:A,\"<\"&fecha_inicial,Registros!B:B,\"=\"&'2000'!A40))","v":0},{"$f":"IF(ISBLANK(A40), 0, SUMIFS(Registros!E:E, Registros!A:A, \">=\" & fecha_inicial, Registros!A:A, \"<=\" & fecha_final,  Registros!B:B, \"=\" & '2000'!A40))","v":0},{"$f":"IF(ISBLANK(A40), 0, SUMIFS(Registros!F:F, Registros!A:A, \">=\" & fecha_inicial, Registros!A:A, \"<=\" & fecha_final,  Registros!B:B, \"=\" & '2000'!A40))","v":0},0]
[2214,"Código de Cuenta Incorrecto",{"$f":"IF(ISBLANK(A41),0, SUMIFS(Registros!F:F,Registros!A:A,\"<\"&fecha_inicial,Registros!B:B,\"=\"&'2000'!A41)) - IF(ISBLANK(A41),0, SUMIFS(Registros!E:E,Registros!A:A,\"<\"&fecha_inicial,Registros!B:B,\"=\"&'2000'!A41))","v":0},{"$f":"IF(ISBLANK(A41), 0, SUMIFS(Registros!E:E, Registros!A:A, \">=\" & fecha_inicial, Registros!A:A, \"<=\" & fecha_final,  Registros!B:B, \"=\" & '2000'!A41))","v":0},{"$f":"IF(ISBLANK(A41), 0, SUMIFS(Registros!F:F, Registros!A:A, \">=\" & fecha_inicial, Registros!A:A, \"<=\" & fecha_final,  Registros!B:B, \"=\" & '2000'!A41))","v":0},0]
[2215,"Código de Cuenta Incorrecto",{"$f":"IF(ISBLANK(A42),0, SUMIFS(Registros!F:F,Registros!A:A,\"<\"&fecha_inicial,Registros!B:B,\"=\"&'2000'!A42)) - IF(ISBLANK(A42),0, SUMIFS(Registros!E:E,Registros!A:A,\"<\"&fecha_inicial,Registros!B:B,\"=\"&'2000'!A42))","v":0},{"$f":"IF(ISBLANK(A42), 0, SUMIFS(Registros!E:E, Registros!A:A, \">=\" & fecha_inicial, Registros!A:A, \"<=\" & fecha_final,  Registros!B:B, \"=\" & '2000'!A42))","v":0},{"$f":"IF(ISBLANK(A42), 0, SUMIFS(Registros!F:F, Registros!A:A, \">=\" & fecha_inicial, Registros!A:A, \"<=\" & fecha_final,  Registros!B:B, \"=\" & '2000'!A42))","v":0},0]
[2300,"Código de Cuenta Incorrecto",{"$f":"SUM(C44:C58)","v":0},{"$f":"SUM(D44:D58)","v":0},0,0]
[2301,"Código de Cuenta Incorrecto",{"$f":"IF(ISBLANK(A44),0, SUMIFS(Registros!F:F,Registros!A:A,\"<\"&fecha_inicial,Registros!B:B,\"=\"&'2000'!A44)) - IF(ISBLANK(A44),0, SUMIFS(Registros!E:E,Registros!A:A,\"<\"&fecha_inicial,Registros!B:B,\"=\"&'2000'!A44))","v":0},{"$f":"IF(ISBLANK(A44), 0, SUMIFS(Registros!E:E, Registros!A:A, \">=\" & fecha_inicial, Registros!A:A, \"<=\" & fecha_final,  Registros!B:B, \"=\" & '2000'!A44))","v":0},{"$f":"IF(ISBLANK(A44), 0, SUMIFS(Registros!F:F, Registros!A:A, \">=\" & fecha_inicial, Registros!A:A, \"<=\" & fecha_final,  Registros!B:B, \"=\" & '2000'!A44))","v":0},0]
[2302,"Código de Cuenta Incorrecto",{"$f":"IF(ISBLANK(A45),0, SUMIFS(Registros!F:F,Registros!A:A,\"<\"&fecha_inicial,Registros!B:B,\"=\"&'2000'!A45)) - IF(ISBLANK(A45),0, SUMIFS(Registros!E:E,Registros!A:A,\"<\"&fecha_inicial,Registros!B:B,\"=\"&'2000'!A45))","v":0},{"$f":"IF(ISBLANK(A45), 0, SUMIFS(Registros!E:E, Registros!A:A, \">=\" & fecha_inicial, Registros!A:A, \"<=\" & fecha_final,  Registros!B:B, \"=\" & '2000'!A45))","v":0},{"$f":"IF(ISBLANK(A45), 0, SUMIFS(Registros!F:F, Registros!A:A, \">=\" & fecha_inicial, Registros!A:A, \"<=\" & fecha_final,  Registros!B:B, \"=\" & '2000'!A45))","v":0},0]
[2303,"Código de Cuenta Incorrecto",{"$f":"IF(ISBLANK(A46),0, SUMIFS(Registros!F:F,Registros!A:A,\"<\"&fecha_inicial,Registros!B:B,\"=\"&'2000'!A46)) - IF(ISBLANK(A46),0, SUMIFS(Registros!E:E,Registros!A:A,\"<\"&fecha_inicial,Registros!B:B,\"=\"&'2000'!A46))","v":0},{"$f":"IF(ISBLANK(A46), 0, SUMIFS(Registros!E:E, Registros!A:A, \">=\" & fecha_inicial, Registros!A:A, \"<=\" & fecha_final,  Registros!B:B, \"=\" & '2000'!A46))","v":0},{"$f":"IF(ISBLANK(A46), 0, SUMIFS(Registros!F:F, Registros!A:A, \">=\" & fecha_inicial, Registros!A:A, \"<=\" & fecha_final,  Registros!B:B, \"=\" & '2000'!A46))","v":0},0]
[2304,"Código de Cuenta Incorrecto",{"$f":"IF(ISBLANK(A47),0, SUMIFS(Registros!F:F,Registros!A:A,\"<\"&fecha_inicial,Registros!B:B,\"=\"&'2000'!A47)) - IF(ISBLANK(A47),0, SUMIFS(Registros!E:E,Registros!A:A,\"<\"&fecha_inicial,Registros!B:B,\"=\"&'2000'!A47))","v":0},{"$f":"IF(ISBLANK(A47), 0, SUMIFS(Registros!E:E, Registros!A:A, \">=\" & fecha_inicial, Registros!A:A, \"<=\" & fecha_final,  Registros!B:B, \"=\" & '2000'!A47))","v":0},{"$f":"IF(ISBLANK(A47), 0, SUMIFS(Registros!F:F, Registros!A:A, \">=\" & fecha_inicial, Registros!A:A, \"<=\" & fecha_final,  Registros!B:B, \"=\" & '2000'!A47))","v":0},0]
[2305,"Código de Cuenta Incorrecto",{"$f":"IF(ISBLANK(A48),0, SUMIFS(Registros!F:F,Registros!A:A,\"<\"&fecha_inicial,Registros!B:B,\"=\"&'2000'!A48)) - IF(ISBLANK(A48),0, SUMIFS(Registros!E:E,Registros!A:A,\"<\"&fecha_inicial,Registros!B:B,\"=\"&'2000'!A48))","v":0},{"$f":"IF(ISBLANK(A48), 0, SUMIFS(Registros!E:E, Registros!A:A, \">=\" & fecha_inicial, Registros!A:A, \"<=\" & fecha_final,  Registros!B:B, \"=\" & '2000'!A48))","v":0},{"$f":"IF(ISBLANK(A48), 0, SUMIFS(Registros!F:F, Registros!A:A, \">=\" & fecha_inicial, Registros!A:A, \"<=\" & fecha_final,  Registros!B:B, \"=\" & '2000'!A48))","v":0},0]
[2306,"Código de Cuenta Incorrecto",{"$f":"IF(ISBLANK(A49),0, SUMIFS(Registros!F:F,Registros!A:A,\"<\"&fecha_inicial,Registros!B:B,\"=\"&'2000'!A49)) - IF(ISBLANK(A49),0, SUMIFS(Registros!E:E,Registros!A:A,\"<\"&fecha_inicial,Registros!B:B,\"=\"&'2000'!A49))","v":0},{"$f":"IF(ISBLANK(A49), 0, SUMIFS(Registros!E:E, Registros!A:A, \">=\" & fecha_inicial, Registros!A:A, \"<=\" & fecha_final,  Registros!B:B, \"=\" & '2000'!A49))","v":0},{"$f":"IF(ISBLANK(A49), 0, SUMIFS(Registros!F:F, Registros!A:A, \">=\" & fecha_inicial, Registros!A:A, \"<=\" & fecha_final,  Registros!B:B, \"=\" & '2000'!A49))","v":0},0]
[2307,"Código de Cuenta Incorrecto",{"$f":"IF(ISBLANK(A50),0, SUMIFS(Registros!F:F,Registros!A:A,\"<\"&fecha_inicial,Registros!B:B,\"=\"&'2000'!A50)) - IF(ISBLANK(A50),0, SUMIFS(Registros!E:E,Registros!A:A,\"<\"&fecha_inicial,Registros!B:B,\"=\"&'2000'!A50))","v":0},{"$f":"IF(ISBLANK(A50), 0, SUMIFS(Registros!E:E, Registros!A:A, \">=\" & fecha_inicial, Registros!A:A, \"<=\" & fecha_final,  Registros!B:B, \"=\" & '2000'!A50))","v":0},{"$f":"IF(ISBLANK(A50), 0, SUMIFS(Registros!F:F, Registros!A:A, \">=\" & fecha_inicial, Registros!A:A, \"<=\" & fecha_final,  Registros!B:B, \"=\" & '2000'!A50))","v":0},0]
[2308,"Código de Cuenta Incorrecto",{"$f":"IF(ISBLANK(A51),0, SUMIFS(Registros!F:F,Registros!A:A,\"<\"&fecha_inicial,Registros!B:B,\"=\"&'2000'!A51)) - IF(ISBLANK(A51),0, SUMIFS(Registros!E:E,Registros!A:A,\"<\"&fecha_inicial,Registros!B:B,\"=\"&'2000'!A51))","v":0},{"$f":"IF(ISBLANK(A51), 0, SUMIFS(Registros!E:E, Registros!A:A, \">=\" & fecha_inicial, Registros!A:A, \"<=\" & fecha_final,  Registros!B:B, \"=\" & '2000'!A51))","v":0},{"$f":"IF(ISBLANK(A51), 0, SUMIFS(Registros!F:F, Registros!A:A, \">=\" & fecha_inicial, Registros!A:A, \"<=\" & fecha_final,  Registros!B:B, \"=\" & '2000'!A51))","v":0},0]
[2309,"Código de Cuenta Incorrecto",{"$f":"IF(ISBLANK(A52),0, SUMIFS(Registros!F:F,Registros!A:A,\"<\"&fecha_inicial,Registros!B:B,\"=\"&'2000'!A52)) - IF(ISBLANK(A52),0, SUMIFS(Registros!E:E,Registros!A:A,\"<\"&fecha_inicial,Registros!B:B,\"=\"&'2000'!A52))","v":0},{"$f":"IF(ISBLANK(A52), 0, SUMIFS(Registros!E:E, Registros!A:A, \">=\" & fecha_inicial, Registros!A:A, \"<=\" & fecha_final,  Registros!B:B, \"=\" & '2000'!A52))","v":0},{"$f":"IF(ISBLANK(A52), 0, SUMIFS(Registros!F:F, Registros!A:A, \">=\" & fecha_inicial, Registros!A:A, \"<=\" & fecha_final,  Registros!B:B, \"=\" & '2000'!A52))","v":0},0]
[2310,"Código de Cuenta Incorrecto",{"$f":"IF(ISBLANK(A53),0, SUMIFS(Registros!F:F,Registros!A:A,\"<\"&fecha_inicial,Registros!B:B,\"=\"&'2000'!A53)) - IF(ISBLANK(A53),0, SUMIFS(Registros!E:E,Registros!A:A,\"<\"&fecha_inicial,Registros!B:B,\"=\"&'2000'!A53))","v":0},{"$f":"IF(ISBLANK(A53), 0, SUMIFS(Registros!E:E, Registros!A:A, \">=\" & fecha_inicial, Registros!A:A, \"<=\" & fecha_final,  Registros!B:B, \"=\" & '2000'!A53))","v":0},{"$f":"IF(ISBLANK(A53), 0, SUMIFS(Registros!F:F, Registros!A:A, \">=\" & fecha_inicial, Registros!A:A, \"<=\" & fecha_final,  Registros!B:B, \"=\" & '2000'!A53))","v":0},0]
[2311,"Código de Cuenta Incorrecto",{"$f":"IF(ISBLANK(A54),0, SUMIFS(Registros!F:F,Registros!A:A,\"<\"&fecha_inicial,Registros!B:B,\"=\"&'2000'!A54)) - IF(ISBLANK(A54),0, SUMIFS(Registros!E:E,Registros!A:A,\"<\"&fecha_inicial,Registros!B:B,\"=\"&'2000'!A54))","v":0},{"$f":"IF(ISBLANK(A54), 0, SUMIFS(Registros!E:E, Registros!A:A, \">=\" & fecha_inicial, Registros!A:A, \"<=\" & fecha_final,  Registros!B:B, \"=\" & '2000'!A54))","v":0},{"$f":"IF(ISBLANK(A54), 0, SUMIFS(Registros!F:F, Registros!A:A, \">=\" & fecha_inicial, Registros!A:A, \"<=\" & fecha_final,  Registros!B:B, \"=\" & '2000'!A54))","v":0},0]
[2312,"Código de Cuenta Incorrecto",{"$f":"IF(ISBLANK(A55),0, SUMIFS(Registros!F:F,Registros!A:A,\"<\"&fecha_inicial,Registros!B:B,\"=\"&'2000'!A55)) - IF(ISBLANK(A55),0, SUMIFS(Registros!E:E,Registros!A:A,\"<\"&fecha_inicial,Registros!B:B,\"=\"&'2000'!A55))","v":0},{"$f":"IF(ISBLANK(A55), 0, SUMIFS(Registros!E:E, Registros!A:A, \">=\" & fecha_inicial, Registros!A:A, \"<=\" & fecha_final,  Registros!B:B, \"=\" & '2000'!A55))","v":0},{"$f":"IF(ISBLANK(A55), 0, SUMIFS(Registros!F:F, Registros!A:A, \">=\" & fecha_inicial, Registros!A:A, \"<=\" & fecha_final,  Registros!B:B, \"=\" & '2000'!A55))","v":0},0]
[2313,"Código de Cuenta Incorrecto",{"$f":"IF(ISBLANK(A56),0, SUMIFS(Registros!F:F,Registros!A:A,\"<\"&fecha_inicial,Registros!B:B,\"=\"&'2000'!A56)) - IF(ISBLANK(A56),0, SUMIFS(Registros!E:E,Registros!A:A,\"<\"&fecha_inicial,Registros!B:B,\"=\"&'2000'!A56))","v":0},{"$f":"IF(ISBLANK(A56), 0, SUMIFS(Registros!E:E, Registros!A:A, \">=\" & fecha_inicial, Registros!A:A, \"<=\" & fecha_final,  Registros!B:B, \"=\" & '2000'!A56))","v":0},{"$f":"IF(ISBLANK(A56), 0, SUMIFS(Registros!F:F, Registros!A:A, \">=\" & fecha_inicial, Registros!A:A, \"<=\" & fecha_final,  Registros!B:B, \"=\" & '2000'!A56))","v":0},0]
[2314,"Código de Cuenta Incorrecto",{"$f":"IF(ISBLANK(A57),0, SUMIFS(Registros!F:F,Registros!A:A,\"<\"&fecha_inicial,Registros!B:B,\"=\"&'2000'!A57)) - IF(ISBLANK(A57),0, SUMIFS(Registros!E:E,Registros!A:A,\"<\"&fecha_inicial,Registros!B:B,\"=\"&'2000'!A57))","v":0},{"$f":"IF(ISBLANK(A57), 0, SUMIFS(Registros!E:E, Registros!A:A, \">=\" & fecha_inicial, Registros!A:A, \"<=\" & fecha_final,  Registros!B:B, \"=\" & '2000'!A57))","v":0},{"$f":"IF(ISBLANK(A57), 0, SUMIFS(Registros!F:F, Registros!A:A, \">=\" & fecha_inicial, Registros!A:A, \"<=\" & fecha_final,  Registros!B:B, \"=\" & '2000'!A57))","v":0},0]
[2315,"Código de Cuenta Incorrecto",{"$f":"IF(ISBLANK(A58),0, SUMIFS(Registros!F:F,Registros!A:A,\"<\"&fecha_inicial,Registros!B:B,\"=\"&'2000'!A58)) - IF(ISBLANK(A58),0, SUMIFS(Registros!E:E,Registros!A:A,\"<\"&fecha_inicial,Registros!B:B,\"=\"&'2000'!A58))","v":0},{"$f":"IF(ISBLANK(A58), 0, SUMIFS(Registros!E:E, Registros!A:A, \">=\" & fecha_inicial, Registros!A:A, \"<=\" & fecha_final,  Registros!B:B, \"=\" & '2000'!A58))","v":0},{"$f":"IF(ISBLANK(A58), 0, SUMIFS(Registros!F:F, Registros!A:A, \">=\" & fecha_inicial, Registros!A:A, \"<=\" & fecha_final,  Registros!B:B, \"=\" & '2000'!A58))","v":0},0]
[2400,"Código de Cuenta Incorrecto",{"$f":"SUM(C60:C74)","v":0},{"$f":"SUM(D60:D74)","v":0},0,0]
[2401,"Código de Cuenta Incorrecto",{"$f":"IF(ISBLANK(A60),0, SUMIFS(Registros!F:F,Registros!A:A,\"<\"&fecha_inicial,Registros!B:B,\"=\"&'2000'!A60)) - IF(ISBLANK(A60),0, SUMIFS(Registros!E:E,Registros!A:A,\"<\"&fecha_inicial,Registros!B:B,\"=\"&'2000'!A60))","v":0},{"$f":"IF(ISBLANK(A60), 0, SUMIFS(Registros!E:E, Registros!A:A, \">=\" & fecha_inicial, Registros!A:A, \"<=\" & fecha_final,  Registros!B:B, \"=\" & '2000'!A60))","v":0},{"$f":"IF(ISBLANK(A60), 0, SUMIFS(Registros!F:F, Registros!A:A, \">=\" & fecha_inicial, Registros!A:A, \"<=\" & fecha_final,  Registros!B:B, \"=\" & '2000'!A60))","v":0},0]
[2402,"Código de Cuenta Incorrecto",{"$f":"IF(ISBLANK(A61),0, SUMIFS(Registros!F:F,Registros!A:A,\"<\"&fecha_inicial,Registros!B:B,\"=\"&'2000'!A61)) - IF(ISBLANK(A61),0, SUMIFS(Registros!E:E,Registros!A:A,\"<\"&fecha_inicial,Registros!B:B,\"=\"&'2000'!A61))","v":0},{"$f":"IF(ISBLANK(A61), 0, SUMIFS(Registros!E:E, Registros!A:A, \">=\" & fecha_inicial, Registros!A:A, \"<=\" & fecha_final,  Registros!B:B, \"=\" & '2000'!A61))","v":0},{"$f":"IF(ISBLANK(A61), 0, SUMIFS(Registros!F:F, Registros!A:A, \">=\" & fecha_inicial, Registros!A:A, \"<=\" & fecha_final,  Registros!B:B, \"=\" & '2000'!A61))","v":0},0]
[2403,"Código de Cuenta Incorrecto",{"$f":"IF(ISBLANK(A62),0, SUMIFS(Registros!F:F,Registros!A:A,\"<\"&fecha_inicial,Registros!B:B,\"=\"&'2000'!A62)) - IF(ISBLANK(A62),0, SUMIFS(Registros!E:E,Registros!A:A,\"<\"&fecha_inicial,Registros!B:B,\"=\"&'2000'!A62))","v":0},{"$f":"IF(ISBLANK(A62), 0, SUMIFS(Registros!E:E, Registros!A:A, \">=\" & fecha_inicial, Registros!A:A, \"<=\" & fecha_final,  Registros!B:B, \"=\" & '2000'!A62))","v":0},{"$f":"IF(ISBLANK(A62), 0, SUMIFS(Registros!F:F, Registros!A:A, \">=\" & fecha_inicial, Registros!A:A, \"<=\" & fecha_final,  Registros!B:B, \"=\" & '2000'!A62))","v":0},0]
[2404,"Código de Cuenta Incorrecto",{"$f":"IF(ISBLANK(A63),0, SUMIFS(Registros!F:F,Registros!A:A,\"<\"&fecha_inicial,Registros!B:B,\"=\"&'2000'!A63)) - IF(ISBLANK(A63),0, SUMIFS(Registros!E:E,Registros!A:A,\"<\"&fecha_inicial,Registros!B:B,\"=\"&'2000'!A63))","v":0},{"$f":"IF(ISBLANK(A63), 0, SUMIFS(Registros!E:E, Registros!A:A, \">=\" & fecha_inicial, Registros!A:A, \"<=\" & fecha_final,  Registros!B:B, \"=\" & '2000'!A63))","v":0},{"$f":"IF(ISBLANK(A63), 0, SUMIFS(Registros!F:F, Registros!A:A, \">=\" & fecha_inicial, Registros!A:A, \"<=\" & fecha_final,  Registros!B:B, \"=\" & '2000'!A63))","v":0},0]
[2405,"Código de Cuenta Incorrecto",{"$f":"IF(ISBLANK(A64),0, SUMIFS(Registros!F:F,Registros!A:A,\"<\"&fecha_inicial,Registros!B:B,\"=\"&'2000'!A64)) - IF(ISBLANK(A64),0, SUMIFS(Registros!E:E,Registros!A:A,\"<\"&fecha_inicial,Registros!B:B,\"=\"&'2000'!A64))","v":0},{"$f":"IF(ISBLANK(A64), 0, SUMIFS(Registros!E:E, Registros!A:A, \">=\" & fecha_inicial, Registros!A:A, \"<=\" & fecha_final,  Registros!B:B, \"=\" & '2000'!A64))","v":0},{"$f":"IF(ISBLANK(A64), 0, SUMIFS(Registros!F:F, Registros!A:A, \">=\" & fecha_inicial, Registros!A:A, \"<=\" & fecha_final,  Registros!B:B, \"=\" & '2000'!A64))","v":0},0]
[2406,"Código de Cuenta Incorrecto",{"$f":"IF(ISBLANK(A65),0, SUMIFS(Registros!F:F,Registros!A:A,\"<\"&fecha_inicial,Registros!B:B,\"=\"&'2000'!A65)) - IF(ISBLANK(A65),0, SUMIFS(Registros!E:E,Registros!A:A,\"<\"&fecha_inicial,Registros!B:B,\"=\"&'2000'!A65))","v":0},{"$f":"IF(ISBLANK(A65), 0, SUMIFS(Registros!E:E, Registros!A:A, \">=\" & fecha_inicial, Registros!A:A, \"<=\" & fecha_final,  Registros!B:B, \"=\" & '2000'!A65))","v":0},{"$f":"IF(ISBLANK(A65), 0, SUMIFS(Registros!F:F, Registros!A:A, \">=\" & fecha_inicial, Registros!A:A, \"<=\" & fecha_final,  Registros!B:B, \"=\" & '2000'!A65))","v":0},0]
[2407,"Código de Cuenta Incorrecto",{"$f":"IF(ISBLANK(A66),0, SUMIFS(Registros!F:F,Registros!A:A,\"<\"&fecha_inicial,Registros!B:B,\"=\"&'2000'!A66)) - IF(ISBLANK(A66),0, SUMIFS(Registros!E:E,Registros!A:A,\"<\"&fecha_inicial,Registros!B:B,\"=\"&'2000'!A66))","v":0},{"$f":"IF(ISBLANK(A66), 0, SUMIFS(Registros!E:E, Registros!A:A, \">=\" & fecha_inicial, Registros!A:A, \"<=\" & fecha_final,  Registros!B:B, \"=\" & '2000'!A66))","v":0},{"$f":"IF(ISBLANK(A66), 0, SUMIFS(Registros!F:F, Registros!A:A, \">=\" & fecha_inicial, Registros!A:A, \"<=\" & fecha_final,  Registros!B:B, \"=\" & '2000'!A66))","v":0},0]
[2408,"Código de Cuenta Incorrecto",{"$f":"IF(ISBLANK(A67),0, SUMIFS(Registros!F:F,Registros!A:A,\"<\"&fecha_inicial,Registros!B:B,\"=\"&'2000'!A67)) - IF(ISBLANK(A67),0, SUMIFS(Registros!E:E,Registros!A:A,\"<\"&fecha_inicial,Registros!B:B,\"=\"&'2000'!A67))","v":0},{"$f":"IF(ISBLANK(A67), 0, SUMIFS(Registros!E:E, Registros!A:A, \">=\" & fecha_inicial, Registros!A:A, \"<=\" & fecha_final,  Registros!B:B, \"=\" & '2000'!A67))","v":0},{"$f":"IF(ISBLANK(A67), 0, SUMIFS(Registros!F:F, Registros!A:A, \">=\" & fecha_inicial, Registros!A:A, \"<=\" & fecha_final,  Registros!B:B, \"=\" & '2000'!A67))","v":0},0]
[2409,"Código de Cuenta Incorrecto",{"$f":"IF(ISBLANK(A68),0, SUMIFS(Registros!F:F,Registros!A:A,\"<\"&fecha_inicial,Registros!B:B,\"=\"&'2000'!A68)) - IF(ISBLANK(A68),0, SUMIFS(Registros!E:E,Registros!A:A,\"<\"&fecha_inicial,Registros!B:B,\"=\"&'2000'!A68))","v":0},{"$f":"IF(ISBLANK(A68), 0, SUMIFS(Registros!E:E, Registros!A:A, \">=\" & fecha_inicial, Registros!A:A, \"<=\" & fecha_final,  Registros!B:B, \"=\" & '2000'!A68))","v":0},{"$f":"IF(ISBLANK(A68), 0, SUMIFS(Registros!F:F, Registros!A:A, \">=\" & fecha_inicial, Registros!A:A, \"<=\" & fecha_final,  Registros!B:B, \"=\" & '2000'!A68))","v":0},0]
[2410,"Código de Cuenta Incorrecto",{"$f":"IF(ISBLANK(A69),0, SUMIFS(Registros!F:F,Registros!A:A,\"<\"&fecha_inicial,Registros!B:B,\"=\"&'2000'!A69)) - IF(ISBLANK(A69),0, SUMIFS(Registros!E:E,Registros!A:A,\"<\"&fecha_inicial,Registros!B:B,\"=\"&'2000'!A69))","v":0},{"$f":"IF(ISBLANK(A69), 0, SUMIFS(Registros!E:E, Registros!A:A, \">=\" & fecha_inicial, Registros!A:A, \"<=\" & fecha_final,  Registros!B:B, \"=\" & '2000'!A69))","v":0},{"$f":"IF(ISBLANK(A69), 0, SUMIFS(Registros!F:F, Registros!A:A, \">=\" & fecha_inicial, Registros!A:A, \"<=\" & fecha_final,  Registros!B:B, \"=\" & '2000'!A69))","v":0},0]
[2411,"Código de Cuenta Incorrecto",{"$f":"IF(ISBLANK(A70),0, SUMIFS(Registros!F:F,Registros!A:A,\"<\"&fecha_inicial,Registros!B:B,\"=\"&'2000'!A70)) - IF(ISBLANK(A70),0, SUMIFS(Registros!E:E,Registros!A:A,\"<\"&fecha_inicial,Registros!B:B,\"=\"&'2000'!A70))","v":0},{"$f":"IF(ISBLANK(A70), 0, SUMIFS(Registros!E:E, Registros!A:A, \">=\" & fecha_inicial, Registros!A:A, \"<=\" & fecha_final,  Registros!B:B, \"=\" & '2000'!A70))","v":0},{"$f":"IF(ISBLANK(A70), 0, SUMIFS(Registros!F:F, Registros!A:A, \">=\" & fecha_inicial, Registros!A:A, \"<=\" & fecha_final,  Registros!B:B, \"=\" & '2000'!A70))","v":0},0]
[2412,"Código de Cuenta Incorrecto",{"$f":"IF(ISBLANK(A71),0, SUMIFS(Registros!F:F,Registros!A:A,\"<\"&fecha_inicial,Registros!B:B,\"=\"&'2000'!A71)) - IF(ISBLANK(A71),0, SUMIFS(Registros!E:E,Registros!A:A,\"<\"&fecha_inicial,Registros!B:B,\"=\"&'2000'!A71))","v":0},{"$f":"IF(ISBLANK(A71), 0, SUMIFS(Registros!E:E, Registros!A:A, \">=\" & fecha_inicial, Registros!A:A, \"<=\" & fecha_final,  Registros!B:B, \"=\" & '2000'!A71))","v":0},{"$f":"IF(ISBLANK(A71), 0, SUMIFS(Registros!F:F, Registros!A:A, \">=\" & fecha_inicial, Registros!A:A, \"<=\" & fecha_final,  Registros!B:B, \"=\" & '2000'!A71))","v":0},0]
[2413,"Código de Cuenta Incorrecto",{"$f":"IF(ISBLANK(A72),0, SUMIFS(Registros!F:F,Registros!A:A,\"<\"&fecha_inicial,Registros!B:B,\"=\"&'2000'!A72)) - IF(ISBLANK(A72),0, SUMIFS(Registros!E:E,Registros!A:A,\"<\"&fecha_inicial,Registros!B:B,\"=\"&'2000'!A72))","v":0},{"$f":"IF(ISBLANK(A72), 0, SUMIFS(Registros!E:E, Registros!A:A, \">=\" & fecha_inicial, Registros!A:A, \"<=\" & fecha_final,  Registros!B:B, \"=\" & '2000'!A72))","v":0},{"$f":"IF(ISBLANK(A72), 0, SUMIFS(Registros!F:F, Registros!A:A, \">=\" & fecha_inicial, Registros!A:A, \"<=\" & fecha_final,  Registros!B:B, \"=\" & '2000'!A72))","v":0},0]
[2414,"Código de Cuenta Incorrecto",{"$f":"IF(ISBLANK(A73),0, SUMIFS(Registros!F:F,Registros!A:A,\"<\"&fecha_inicial,Registros!B:B,\"=\"&'2000'!A73)) - IF(ISBLANK(A73),0, SUMIFS(Registros!E:E,Registros!A:A,\"<\"&fecha_inicial,Registros!B:B,\"=\"&'2000'!A73))","v":0},{"$f":"IF(ISBLANK(A73), 0, SUMIFS(Registros!E:E, Registros!A:A, \">=\" & fecha_inicial, Registros!A:A, \"<=\" & fecha_final,  Registros!B:B, \"=\" & '2000'!A73))","v":0},{"$f":"IF(ISBLANK(A73), 0, SUMIFS(Registros!F:F, Registros!A:A, \">=\" & fecha_inicial, Registros!A:A, \"<=\" & fecha_final,  Registros!B:B, \"=\" & '2000'!A73))","v":0},0]
[2415,"Código de Cuenta Incorrecto",{"$f":"IF(ISBLANK(A74),0, SUMIFS(Registros!F:F,Registros!A:A,\"<\"&fecha_inicial,Registros!B:B,\"=\"&'2000'!A74)) - IF(ISBLANK(A74),0, SUMIFS(Registros!E:E,Registros!A:A,\"<\"&fecha_inicial,Registros!B:B,\"=\"&'2000'!A74))","v":0},{"$f":"IF(ISBLANK(A74), 0, SUMIFS(Registros!E:E, Registros!A:A, \">=\" & fecha_inicial, Registros!A:A, \"<=\" & fecha_final,  Registros!B:B, \"=\" & '2000'!A74))","v":0},{"$f":"IF(ISBLANK(A74), 0, SUMIFS(Registros!F:F, Registros!A:A, \">=\" & fecha_inicial, Registros!A:A, \"<=\" & fecha_final,  Registros!B:B, \"=\" & '2000'!A74))","v":0},0]
[{"$f":"\"SALDO FINAL DE LA CUENTA AL \" &TEXT(fecha_final, \"dd\")&\" DE \"&UPPER(TEXT(fecha_final, \"MMMM\"))&\" DEL \"& TEXT(fecha_final, \"YYYY\")","v":"SALDO FINAL DE LA CUENTA AL 00 DE ENERO DEL 1900"},null,{"$f":"C11+C27+C43+C59","v":0},{"$f":"D11+D27+D43+D59","v":0},{"$f":"E11+E27+E43+E59","v":0},{"$f":"C75-D75+E75","v":0}]
[]
[]
[]
[]
["ELABORA",null,null,null,"REVISA"]
[{"$f":"VLOOKUP(A80, Usuarios!B12:E14, 2, FALSE)","v":"Arlen de Jesús Baltodano López"},null,null,null,{"$f":"VLOOKUP(E80, Usuarios!B12:E14, 2, FALSE)","v":"Gersan Arguello Prado"}]
[{"$f":"VLOOKUP(A80, Usuarios!B12:E14, 4, FALSE)","v":"Auxiliar de Contabilidad"},null,null,null,{"$f":"VLOOKUP(E80, Usuarios!B12:E14, 4, FALSE)","v":"Contador General"}]
[]
[]
[null,null,"AUTORIZA"]
[null,null,{"$f":"VLOOKUP(C85, Usuarios!B12:E14, 2, FALSE)","v":"Matilda Padilla Mayorga"}]
[null,null,{"$f":"VLOOKUP(C85, Usuarios!B12:E14, 4, FALSE)","v":"Gerente de Finanzas"}]

{"sheet":"3000","index":16,"n_rows":87,"n_cols":6,"rows_kept":87,"cut":false,"hidden":false,"merged":[[86,2,86,3],[80,0,80,1],[80,4,80,5],[81,0,81,1],[81,4,81,5],[84,2,84,3],[85,2,85,3],[7,5,8,5],[74,0,74,1],[78,0,78,1],[78,4,78,5],[79,0,79,1],[79,4,79,5],[7,0,8,0],[7,1,8,1],[7,2,8,2],[7,3,8,3],[7,4,8,4],[1,0,1,5],[2,0,2,5],[3,0,3,5],[4,0,4,5],[6,3,6,5]]}
[null,null,null,null,"Proteger"]
[{"$f":"nombre_empresa","v":"CONSULTORES DE OMETEPE"}]
[{"$f":"\"RESUMEN CONTABLE DE \"&B7","v":"RESUMEN CONTABLE DE CAPITAL CONTABLE"}]
[{"$f":"\"DEL \"&TEXT(fecha_inicial, \"DD\")&\" DE \"&UPPER(TEXT(fecha_inicial, \"MMMM\"))&\" AL \"&TEXT(fecha_final, \"DD\")&\" DE \"&UPPER(TEXT(fecha_final, \"MMMM\"))&\" DE \"&TEXT(fecha_final, \"YYYY\")","v":"DEL 00 DE ENERO AL 00 DE ENERO DE 1900"}]
[{"$f":"direccion & \" *** Tel/Fax:  \" & tel_fax & \" *** \" & email","v":"Barrio el Progreso, San Jorge, Rivas. *** Tel/Fax:  89040457 *** escribeme@radioometepe.com"}]
[]
[3000,{"$f":"UPPER(IF(ISBLANK(A7),\"\",IFERROR(VLOOKUP(A7,plan_cuentas,2,FALSE),\"Código de cuenta incorrecto\")))","v":"CAPITAL CONTABLE"},null,{"$f":"\"MOVIMIENTOS DE \"&UPPER(TEXT(fecha_final, \"MMMM\"))","v":"MOVIMIENTOS DE ENERO"}]
["CODIGO","NOMBRE DE LA CUENTA","SALDO INICIAL","DEBITOS","CREDITOS","SALDO FINAL"]
[]
[]
[3100,{"$f":"IF(A11<>0, IF(ISERROR(VLOOKUP(A11, plan_cuentas,2, FALSE)), \"Código de Cuenta Incorrecto\", UPPER(VLOOKUP(A11, plan_cuentas, 2, FALSE))), \"\")","v":"CAPITAL SOCIAL"},{"$f":"SUM(C12:C26)","v":0},{"$f":"SUM(D12:D26)","v":0},0,{"$f":"C11-D11+E11","v":0}]
[3101,"CAPITAL INICIAL",{"$f":"IF(ISBLANK(A12),0, SUMIFS(Registros!F:F,Registros!A:A,\"<\"&fecha_inicial,Registros!B:B,\"=\"&'3000'!A12)) - IF(ISBLANK(A12),0, SUMIFS(Registros!E:E,Registros!A:A,\"<\"&fecha_inicial,Registros!B:B,\"=\"&'3000'!A12))","v":0},{"$f":"IF(ISBLANK(A12), 0, SUMIFS(Registros!E:E, Registros!A:A, \">=\" & fecha_inicial, Registros!A:A, \"<=\" & fecha_final,  Registros!B:B, \"=\" & '3000'!A12))","v":0},{"$f":"IF(ISBLANK(A12), 0, SUMIFS(Registros!F:F, Registros!A:A, \">=\" & fecha_inicial, Registros!A:A, \"<=\" & fecha_final,  Registros!B:B, \"=\" & '3000'!A12))","v":0},{"$f":"C12-D12+E12","v":0}]
[3102,"APORTACIONES",{"$f":"IF(ISBLANK(A13),0, SUMIFS(Registros!F:F,Registros!A:A,\"<\"&fecha_inicial,Registros!B:B,\"=\"&'3000'!A13)) - IF(ISBLANK(A13),0, SUMIFS(Registros!E:E,Registros!A:A,\"<\"&fecha_inicial,Registros!B:B,\"=\"&'3000'!A13))","v":0},{"$f":"IF(ISBLANK(A13), 0, SUMIFS(Registros!E:E, Registros!A:A, \">=\" & fecha_inicial, Registros!A:A, \"<=\" & fecha_final,  Registros!B:B, \"=\" & '3000'!A13))","v":0},{"$f":"IF(ISBLANK(A13), 0, SUMIFS(Registros!F:F, Registros!A:A, \">=\" & fecha_inicial, Registros!A:A, \"<=\" & fecha_final,  Registros!B:B, \"=\" & '3000'!A13))","v":0},0]
[3103,"RESERVA",{"$f":"IF(ISBLANK(A14),0, SUMIFS(Registros!F:F,Registros!A:A,\"<\"&fecha_inicial,Registros!B:B,\"=\"&'3000'!A14)) - IF(ISBLANK(A14),0, SUMIFS(Registros!E:E,Registros!A:A,\"<\"&fecha_inicial,Registros!B:B,\"=\"&'3000'!A14))","v":0},{"$f":"IF(ISBLANK(A14), 0, SUMIFS(Registros!E:E, Registros!A:A, \">=\" & fecha_inicial, Registros!A:A, \"<=\" & fecha_final,  Registros!B:B, \"=\" & '3000'!A14))","v":0},{"$f":"IF(ISBLANK(A14), 0, SUMIFS(Registros!F:F, Registros!A:A, \">=\" & fecha_inicial, Registros!A:A, \"<=\" & fecha_final,  Registros!B:B, \"=\" & '3000'!A14))","v":0},0]
[3104,"UTILIDADES RETENIDAS",{"$f":"IF(ISBLANK(A15),0, SUMIFS(Registros!F:F,Registros!A:A,\"<\"&fecha_inicial,Registros!B:B,\"=\"&'3000'!A15)) - IF(ISBLANK(A15),0, SUMIFS(Registros!E:E,Registros!A:A,\"<\"&fecha_inicial,Registros!B:B,\"=\"&'3000'!A15))","v":0},{"$f":"IF(ISBLANK(A15), 0, SUMIFS(Registros!E:E, Registros!A:A, \">=\" & fecha_inicial, Registros!A:A, \"<=\" & fecha_final,  Registros!B:B, \"=\" & '3000'!A15))","v":0},{"$f":"IF(ISBLANK(A15), 0, SUMIFS(Registros!F:F, Registros!A:A, \">=\" & fecha_inicial, Registros!A:A, \"<=\" & fecha_final,  Registros!B:B, \"=\" & '3000'!A15))","v":0},0]
[3105,"UTILIDAD DEL EJERCICIO",{"$f":"IF(ISBLANK(A16),0, SUMIFS(Registros!F:F,Registros!A:A,\"<\"&fecha_inicial,Registros!B:B,\"=\"&'3000'!A16)) - IF(ISBLANK(A16),0, SUMIFS(Registros!E:E,Registros!A:A,\"<\"&fecha_inicial,Registros!B:B,\"=\"&'3000'!A16))","v":0},{"$f":"IF(ISBLANK(A16), 0, SUMIFS(Registros!E:E, Registros!A:A, \">=\" & fecha_inicial, Registros!A:A, \"<=\" & fecha_final,  Registros!B:B, \"=\" & A16))","v":0},{"$f":"IF(ISBLANK(A16), 0, SUMIFS(Registros!F:F, Registros!A:A, \">=\" & fecha_inicial, Registros!A:A, \"<=\" & fecha_final,  Registros!B:B, \"=\" & '3000'!A16))","v":0},0]
[3106,"Código de Cuenta Incorrecto",{"$f":"IF(ISBLANK(A17),0, SUMIFS(Registros!F:F,Registros!A:A,\"<\"&fecha_inicial,Registros!B:B,\"=\"&'3000'!A17)) - IF(ISBLANK(A17),0, SUMIFS(Registros!E:E,Registros!A:A,\"<\"&fecha_inicial,Registros!B:B,\"=\"&'3000'!A17))","v":0},{"$f":"IF(ISBLANK(A17), 0, SUMIFS(Registros!E:E, Registros!A:A, \">=\" & fecha_inicial, Registros!A:A, \"<=\" & fecha_final,  Registros!B:B, \"=\" & '3000'!A17))","v":0},{"$f":"IF(ISBLANK(A17), 0, SUMIFS(Registros!F:F, Registros!A:A, \">=\" & fecha_inicial, Registros!A:A, \"<=\" & fecha_final,  Registros!B:B, \"=\" & '3000'!A17))","v":0},0]
[3107,"Código de Cuenta Incorrecto",{"$f":"IF(ISBLANK(A18),0, SUMIFS(Registros!F:F,Registros!A:A,\"<\"&fecha_inicial,Registros!B:B,\"=\"&'3000'!A18)) - IF(ISBLANK(A18),0, SUMIFS(Registros!E:E,Registros!A:A,\"<\"&fecha_inicial,Registros!B:B,\"=\"&'3000'!A18))","v":0},{"$f":"IF(ISBLANK(A18), 0, SUMIFS(Registros!E:E, Registros!A:A, \">=\" & fecha_inicial, Registros!A:A, \"<=\" & fecha_final,  Registros!B:B, \"=\" & '3000'!A18))","v":0},{"$f":"IF(ISBLANK(A18), 0, SUMIFS(Registros!F:F, Registros!A:A, \">=\" & fecha_inicial, Registros!A:A, \"<=\" & fecha_final,  Registros!B:B, \"=\" & '3000'!A18))","v":0},0]
[3108,"Código de Cuenta Incorrecto",{"$f":"IF(ISBLANK(A19),0, SUMIFS(Registros!F:F,Registros!A:A,\"<\"&fecha_inicial,Registros!B:B,\"=\"&'3000'!A19)) - IF(ISBLANK(A19),0, SUMIFS(Registros!E:E,Registros!A:A,\"<\"&fecha_inicial,Registros!B:B,\"=\"&'3000'!A19))","v":0},{"$f":"IF(ISBLANK(A19), 0, SUMIFS(Registros!E:E, Registros!A:A, \">=\" & fecha_inicial, Registros!A:A, \"<=\" & fecha_final,  Registros!B:B, \"=\" & '3000'!A19))","v":0},{"$f":"IF(ISBLANK(A19), 0, SUMIFS(Registros!F:F, Registros!A:A, \">=\" & fecha_inicial, Registros!A:A, \"<=\" & fecha_final,  Registros!B:B, \"=\" & '3000'!A19))","v":0},0]
[3109,"Código de Cuenta Incorrecto",{"$f":"IF(ISBLANK(A20),0, SUMIFS(Registros!F:F,Registros!A:A,\"<\"&fecha_inicial,Registros!B:B,\"=\"&'3000'!A20)) - IF(ISBLANK(A20),0, SUMIFS(Registros!E:E,Registros!A:A,\"<\"&fecha_inicial,Registros!B:B,\"=\"&'3000'!A20))","v":0},{"$f":"IF(ISBLANK(A20), 0, SUMIFS(Registros!E:E, Registros!A:A, \">=\" & fecha_inicial, Registros!A:A, \"<=\" & fecha_final,  Registros!B:B, \"=\" & '3000'!A20))","v":0},{"$f":"IF(ISBLANK(A20), 0, SUMIFS(Registros!F:F, Registros!A:A, \">=\" & fecha_inicial, Registros!A:A, \"<=\" & fecha_final,  Registros!B:B, \"=\" & '3000'!A20))","v":0},0]
[3110,"Código de Cuenta Incorrecto",{"$f":"IF(ISBLANK(A21),0, SUMIFS(Registros!F:F,Registros!A:A,\"<\"&fecha_inicial,Registros!B:B,\"=\"&'3000'!A21)) - IF(ISBLANK(A21),0, SUMIFS(Registros!E:E,Registros!A:A,\"<\"&fecha_inicial,Registros!B:B,\"=\"&'3000'!A21))","v":0},{"$f":"IF(ISBLANK(A21), 0, SUMIFS(Registros!E:E, Registros!A:A, \">=\" & fecha_inicial, Registros!A:A, \"<=\" & fecha_final,  Registros!B:B, \"=\" & '3000'!A21))","v":0},{"$f":"IF(ISBLANK(A21), 0, SUMIFS(Registros!F:F, Registros!A:A, \">=\" & fecha_inicial, Registros!A:A, \"<=\" & fecha_final,  Registros!B:B, \"=\" & '3000'!A21))","v":0},0]
[3111,"Código de Cuenta Incorrecto",{"$f":"IF(ISBLANK(A22),0, SUMIFS(Registros!F:F,Registros!A:A,\"<\"&fecha_inicial,Registros!B:B,\"=\"&'3000'!A22)) - IF(ISBLANK(A22),0, SUMIFS(Registros!E:E,Registros!A:A,\"<\"&fecha_inicial,Registros!B:B,\"=\"&'3000'!A22))","v":0},{"$f":"IF(ISBLANK(A22), 0, SUMIFS(Registros!E:E, Registros!A:A, \">=\" & fecha_inicial, Registros!A:A, \"<=\" & fecha_final,  Registros!B:B, \"=\" & '3000'!A22))","v":0},{"$f":"IF(ISBLANK(A22), 0, SUMIFS(Registros!F:F, Registros!A:A, \">=\" & fecha_inicial, Registros!A:A, \"<=\" & fecha_final,  Registros!B:B, \"=\" & '3000'!A22))","v":0},0]
[3112,"Código de Cuenta Incorrecto",{"$f":"IF(ISBLANK(A23),0, SUMIFS(Registros!F:F,Registros!A:A,\"<\"&fecha_inicial,Registros!B:B,\"=\"&'3000'!A23)) - IF(ISBLANK(A23),0, SUMIFS(Registros!E:E,Registros!A:A,\"<\"&fecha_inicial,Registros!B:B,\"=\"&'3000'!A23))","v":0},{"$f":"IF(ISBLANK(A23), 0, SUMIFS(Registros!E:E, Registros!A:A, \">=\" & fecha_inicial, Registros!A:A, \"<=\" & fecha_final,  Registros!B:B, \"=\" & '3000'!A23))","v":0},{"$f":"IF(ISBLANK(A23), 0, SUMIFS(Registros!F:F, Registros!A:A, \">=\" & fecha_inicial, Registros!A:A, \"<=\" & fecha_final,  Registros!B:B, \"=\" & '3000'!A23))","v":0},0]
[3113,"Código de Cuenta Incorrecto",{"$f":"IF(ISBLANK(A24),0, SUMIFS(Registros!F:F,Registros!A:A,\"<\"&fecha_inicial,Registros!B:B,\"=\"&'3000'!A24)) - IF(ISBLANK(A24),0, SUMIFS(Registros!E:E,Registros!A:A,\"<\"&fecha_inicial,Registros!B:B,\"=\"&'3000'!A24))","v":0},{"$f":"IF(ISBLANK(A24), 0, SUMIFS(Registros!E:E, Registros!A:A, \">=\" & fecha_inicial, Registros!A:A, \"<=\" & fecha_final,  Registros!B:B, \"=\" & '3000'!A24))","v":0},{"$f":"IF(ISBLANK(A24), 0, SUMIFS(Registros!F:F, Registros!A:A, \">=\" & fecha_inicial, Registros!A:A, \"<=\" & fecha_final,  Registros!B:B, \"=\" & '3000'!A24))","v":0},0]
[3114,"Código de Cuenta Incorrecto",{"$f":"IF(ISBLANK(A25),0, SUMIFS(Registros!F:F,Registros!A:A,\"<\"&fecha_inicial,Registros!B:B,\"=\"&'3000'!A25)) - IF(ISBLANK(A25),0, SUMIFS(Registros!E:E,Registros!A:A,\"<\"&fecha_inicial,Registros!B:B,\"=\"&'3000'!A25))","v":0},{"$f":"IF(ISBLANK(A25), 0, SUMIFS(Registros!E:E, Registros!A:A, \">=\" & fecha_inicial, Registros!A:A, \"<=\" & fecha_final,  Registros!B:B, \"=\" & '3000'!A25))","v":0},{"$f":"IF(ISBLANK(A25), 0, SUMIFS(Registros!F:F, Registros!A:A, \">=\" & fecha_inicial, Registros!A:A, \"<=\" & fecha_final,  Registros!B:B, \"=\" & '3000'!A25))","v":0},0]
[3115,"Código de Cuenta Incorrecto",{"$f":"IF(ISBLANK(A26),0, SUMIFS(Registros!F:F,Registros!A:A,\"<\"&fecha_inicial,Registros!B:B,\"=\"&'3000'!A26)) - IF(ISBLANK(A26),0, SUMIFS(Registros!E:E,Registros!A:A,\"<\"&fecha_inicial,Registros!B:B,\"=\"&'3000'!A26))","v":0},{"$f":"IF(ISBLANK(A26), 0, SUMIFS(Registros!E:E, Registros!A:A, \">=\" & fecha_inicial, Registros!A:A, \"<=\" & fecha_final,  Registros!B:B, \"=\" & '3000'!A26))","v":0},{"$f":"IF(ISBLANK(A26), 0, SUMIFS(Registros!F:F, Registros!A:A, \">=\" & fecha_inicial, Registros!A:A, \"<=\" & fecha_final,  Registros!B:B, \"=\" & '3000'!A26))","v":0},0]
[3200,"Código de Cuenta Incorrecto",{"$f":"SUM(C28:C42)","v":0},{"$f":"SUM(D28:D42)","v":0},{"$f":"SUM(E28:E42)","v":0},0]
[3201,"Código de Cuenta Incorrecto",{"$f":"IF(ISBLANK(A28),0, SUMIFS(Registros!F:F,Registros!A:A,\"<\"&fecha_inicial,Registros!B:B,\"=\"&'3000'!A28)) - IF(ISBLANK(A28),0, SUMIFS(Registros!E:E,Registros!A:A,\"<\"&fecha_inicial,Registros!B:B,\"=\"&'3000'!A28))","v":0},{"$f":"IF(ISBLANK(A28), 0, SUMIFS(Registros!E:E, Registros!A:A, \">=\" & fecha_inicial, Registros!A:A, \"<=\" & fecha_final,  Registros!B:B, \"=\" & '3000'!A28))","v":0},{"$f":"IF(ISBLANK(A28), 0, SUMIFS(Registros!F:F, Registros!A:A, \">=\" & fecha_inicial, Registros!A:A, \"<=\" & fecha_final,  Registros!B:B, \"=\" & '3000'!A28))","v":0},0]
[3202,"Código de Cuenta Incorrecto",{"$f":"IF(ISBLANK(A29),0, SUMIFS(Registros!F:F,Registros!A:A,\"<\"&fecha_inicial,Registros!B:B,\"=\"&'3000'!A29)) - IF(ISBLANK(A29),0, SUMIFS(Registros!E:E,Registros!A:A,\"<\"&fecha_inicial,Registros!B:B,\"=\"&'3000'!A29))","v":0},{"$f":"IF(ISBLANK(A29), 0, SUMIFS(Registros!E:E, Registros!A:A, \">=\" & fecha_inicial, Registros!A:A, \"<=\" & fecha_final,  Registros!B:B, \"=\" & '3000'!A29))","v":0},{"$f":"IF(ISBLANK(A29), 0, SUMIFS(Registros!F:F, Registros!A:A, \">=\" & fecha_inicial, Registros!A:A, \"<=\" & fecha_final,  Registros!B:B, \"=\" & '3000'!A29))","v":0},0]
[3203,"Código de Cuenta Incorrecto",{"$f":"IF(ISBLANK(A30),0, SUMIFS(Registros!F:F,Registros!A:A,\"<\"&fecha_inicial,Registros!B:B,\"=\"&'3000'!A30)) - IF(ISBLANK(A30),0, SUMIFS(Registros!E:E,Registros!A:A,\"<\"&fecha_inicial,Registros!B:B,\"=\"&'3000'!A30))","v":0},{"$f":"IF(ISBLANK(A30), 0, SUMIFS(Registros!E:E, Registros!A:A, \">=\" & fecha_inicial, Registros!A:A, \"<=\" & fecha_final,  Registros!B:B, \"=\" & '3000'!A30))","v":0},{"$f":"IF(ISBLANK(A30), 0, SUMIFS(Registros!F:F, Registros!A:A, \">=\" & fecha_inicial, Registros!A:A, \"<=\" & fecha_final,  Registros!B:B, \"=\" & '3000'!A30))","v":0},0]
[3204,"Código de Cuenta Incorrecto",{"$f":"IF(ISBLANK(A31),0, SUMIFS(Registros!F:F,Registros!A:A,\"<\"&fecha_inicial,Registros!B:B,\"=\"&'3000'!A31)) - IF(ISBLANK(A31),0, SUMIFS(Registros!E:E,Registros!A:A,\"<\"&fecha_inicial,Registros!B:B,\"=\"&'3000'!A31))","v":0},{"$f":"IF(ISBLANK(A31), 0, SUMIFS(Registros!E:E, Registros!A:A, \">=\" & fecha_inicial, Registros!A:A, \"<=\" & fecha_final,  Registros!B:B, \"=\" & '3000'!A31))","v":0},{"$f":"IF(ISBLANK(A31), 0, SUMIFS(Registros!F:F, Registros!A:A, \">=\" & fecha_inicial, Registros!A:A, \"<=\" & fecha_final,  Registros!B:B, \"=\" & '3000'!A31))","v":0},0]
[3205,"Código de Cuenta Incorrecto",{"$f":"IF(ISBLANK(A32),0, SUMIFS(Registros!F:F,Registros!A:A,\"<\"&fecha_inicial,Registros!B:B,\"=\"&'3000'!A32)) - IF(ISBLANK(A32),0, SUMIFS(Registros!E:E,Registros!A:A,\"<\"&fecha_inicial,Registros!B:B,\"=\"&'3000'!A32))","v":0},{"$f":"IF(ISBLANK(A32), 0, SUMIFS(Registros!E:E, Registros!A:A, \">=\" & fecha_inicial, Registros!A:A, \"<=\" & fecha_final,  Registros!B:B, \"=\" & '3000'!A32))","v":0},{"$f":"IF(ISBLANK(A32), 0, SUMIFS(Registros!F:F, Registros!A:A, \">=\" & fecha_inicial, Registros!A:A, \"<=\" & fecha_final,  Registros!B:B, \"=\" & '3000'!A32))","v":0},0]
[3206,"Código de Cuenta Incorrecto",{"$f":"IF(ISBLANK(A33),0, SUMIFS(Registros!F:F,Registros!A:A,\"<\"&fecha_inicial,Registros!B:B,\"=\"&'3000'!A33)) - IF(ISBLANK(A33),0, SUMIFS(Registros!E:E,Registros!A:A,\"<\"&fecha_inicial,Registros!B:B,\"=\"&'3000'!A33))","v":0},{"$f":"IF(ISBLANK(A33), 0, SUMIFS(Registros!E:E, Registros!A:A, \">=\" & fecha_inicial, Registros!A:A, \"<=\" & fecha_final,  Registros!B:B, \"=\" & '3000'!A33))","v":0},{"$f":"IF(ISBLANK(A33), 0, SUMIFS(Registros!F:F, Registros!A:A, \">=\" & fecha_inicial, Registros!A:A, \"<=\" & fecha_final,  Registros!B:B, \"=\" & '3000'!A33))","v":0},0]
[3207,"Código de Cuenta Incorrecto",{"$f":"IF(ISBLANK(A34),0, SUMIFS(Registros!F:F,Registros!A:A,\"<\"&fecha_inicial,Registros!B:B,\"=\"&'3000'!A34)) - IF(ISBLANK(A34),0, SUMIFS(Registros!E:E,Registros!A:A,\"<\"&fecha_inicial,Registros!B:B,\"=\"&'3000'!A34))","v":0},{"$f":"IF(ISBLANK(A34), 0, SUMIFS(Registros!E:E, Registros!A:A, \">=\" & fecha_inicial, Registros!A:A, \"<=\" & fecha_final,  Registros!B:B, \"=\" & '3000'!A34))","v":0},{"$f":"IF(ISBLANK(A34), 0, SUMIFS(Registros!F:F, Registros!A:A, \">=\" & fecha_inicial, Registros!A:A, \"<=\" & fecha_final,  Registros!B:B, \"=\" & '3000'!A34))","v":0},0]
[3208,"Código de Cuenta Incorrecto",{"$f":"IF(ISBLANK(A35),0, SUMIFS(Registros!F:F,Registros!A:A,\"<\"&fecha_inicial,Registros!B:B,\"=\"&'3000'!A35)) - IF(ISBLANK(A35),0, SUMIFS(Registros!E:E,Registros!A:A,\"<\"&fecha_inicial,Registros!B:B,\"=\"&'3000'!A35))","v":0},{"$f":"IF(ISBLANK(A35), 0, SUMIFS(Registros!E:E, Registros!A:A, \">=\" & fecha_inicial, Registros!A:A, \"<=\" & fecha_final,  Registros!B:B, \"=\" & '3000'!A35))","v":0},{"$f":"IF(ISBLANK(A35), 0, SUMIFS(Registros!F:F, Registros!A:A, \">=\" & fecha_inicial, Registros!A:A, \"<=\" & fecha_final,  Registros!B:B, \"=\" & '3000'!A35))","v":0},0]
[3209,"Código de Cuenta Incorrecto",{"$f":"IF(ISBLANK(A36),0, SUMIFS(Registros!F:F,Registros!A:A,\"<\"&fecha_inicial,Registros!B:B,\"=\"&'3000'!A36)) - IF(ISBLANK(A36),0, SUMIFS(Registros!E:E,Registros!A:A,\"<\"&fecha_inicial,Registros!B:B,\"=\"&'3000'!A36))","v":0},{"$f":"IF(ISBLANK(A36), 0, SUMIFS(Registros!E:E, Registros!A:A, \">=\" & fecha_inicial, Registros!A:A, \"<=\" & fecha_final,  Registros!B:B, \"=\" & '3000'!A36))","v":0},{"$f":"IF(ISBLANK(A36), 0, SUMIFS(Registros!F:F, Registros!A:A, \">=\" & fecha_inicial, Registros!A:A, \"<=\" & fecha_final,  Registros!B:B, \"=\" & '3000'!A36))","v":0},0]
[3210,"Código de Cuenta Incorrecto",{"$f":"IF(ISBLANK(A37),0, SUMIFS(Registros!F:F,Registros!A:A,\"<\"&fecha_inicial,Registros!B:B,\"=\"&'3000'!A37)) - IF(ISBLANK(A37),0, SUMIFS(Registros!E:E,Registros!A:A,\"<\"&fecha_inicial,Registros!B:B,\"=\"&'3000'!A37))","v":0},{"$f":"IF(ISBLANK(A37), 0, SUMIFS(Registros!E:E, Registros!A:A, \">=\" & fecha_inicial, Registros!A:A, \"<=\" & fecha_final,  Registros!B:B, \"=\" & '3000'!A37))","v":0},{"$f":"IF(ISBLANK(A37), 0, SUMIFS(Registros!F:F, Registros!A:A, \">=\" & fecha_inicial, Registros!A:A, \"<=\" & fecha_final,  Registros!B:B, \"=\" & '3000'!A37))","v":0},0]
[3211,"Código de Cuenta Incorrecto",{"$f":"IF(ISBLANK(A38),0, SUMIFS(Registros!F:F,Registros!A:A,\"<\"&fecha_inicial,Registros!B:B,\"=\"&'3000'!A38)) - IF(ISBLANK(A38),0, SUMIFS(Registros!E:E,Registros!A:A,\"<\"&fecha_inicial,Registros!B:B,\"=\"&'3000'!A38))","v":0},{"$f":"IF(ISBLANK(A38), 0, SUMIFS(Registros!E:E, Registros!A:A, \">=\" & fecha_inicial, Registros!A:A, \"<=\" & fecha_final,  Registros!B:B, \"=\" & '3000'!A38))","v":0},{"$f":"IF(ISBLANK(A38), 0, SUMIFS(Registros!F:F, Registros!A:A, \">=\" & fecha_inicial, Registros!A:A, \"<=\" & fecha_final,  Registros!B:B, \"=\" & '3000'!A38))","v":0},0]
[3212,"Código de Cuenta Incorrecto",{"$f":"IF(ISBLANK(A39),0, SUMIFS(Registros!F:F,Registros!A:A,\"<\"&fecha_inicial,Registros!B:B,\"=\"&'3000'!A39)) - IF(ISBLANK(A39),0, SUMIFS(Registros!E:E,Registros!A:A,\"<\"&fecha_inicial,Registros!B:B,\"=\"&'3000'!A39))","v":0},{"$f":"IF(ISBLANK(A39), 0, SUMIFS(Registros!E:E, Registros!A:A, \">=\" & fecha_inicial, Registros!A:A, \"<=\" & fecha_final,  Registros!B:B, \"=\" & '3000'!A39))","v":0},{"$f":"IF(ISBLANK(A39), 0, SUMIFS(Registros!F:F, Registros!A:A, \">=\" & fecha_inicial, Registros!A:A, \"<=\" & fecha_final,  Registros!B:B, \"=\" & '3000'!A39))","v":0},0]
[3213,"Código de Cuenta Incorrecto",{"$f":"IF(ISBLANK(A40),0, SUMIFS(Registros!F:F,Registros!A:A,\"<\"&fecha_inicial,Registros!B:B,\"=\"&'3000'!A40)) - IF(ISBLANK(A40),0, SUMIFS(Registros!E:E,Registros!A:A,\"<\"&fecha_inicial,Registros!B:B,\"=\"&'3000'!A40))","v":0},{"$f":"IF(ISBLANK(A40), 0, SUMIFS(Registros!E:E, Registros!A:A, \">=\" & fecha_inicial, Registros!A:A, \"<=\" & fecha_final,  Registros!B:B, \"=\" & '3000'!A40))","v":0},{"$f":"IF(ISBLANK(A40), 0, SUMIFS(Registros!F:F, Registros!A:A, \">=\" & fecha_inicial, Registros!A:A, \"<=\" & fecha_final,  Registros!B:B, \"=\" & '3000'!A40))","v":0},0]
[3214,"Código de Cuenta Incorrecto",{"$f":"IF(ISBLANK(A41),0, SUMIFS(Registros!F:F,Registros!A:A,\"<\"&fecha_inicial,Registros!B:B,\"=\"&'3000'!A41)) - IF(ISBLANK(A41),0, SUMIFS(Registros!E:E,Registros!A:A,\"<\"&fecha_inicial,Registros!B:B,\"=\"&'3000'!A41))","v":0},{"$f":"IF(ISBLANK(A41), 0, SUMIFS(Registros!E:E, Registros!A:A, \">=\" & fecha_inicial, Registros!A:A, \"<=\" & fecha_final,  Registros!B:B, \"=\" & '3000'!A41))","v":0},{"$f":"IF(ISBLANK(A41), 0, SUMIFS(Registros!F:F, Registros!A:A, \">=\" & fecha_inicial, Registros!A:A, \"<=\" & fecha_final,  Registros!B:B, \"=\" & '3000'!A41))","v":0},0]
[3215,"Código de Cuenta Incorrecto",{"$f":"IF(ISBLANK(A42),0, SUMIFS(Registros!F:F,Registros!A:A,\"<\"&fecha_inicial,Registros!B:B,\"=\"&'3000'!A42)) - IF(ISBLANK(A42),0, SUMIFS(Registros!E:E,Registros!A:A,\"<\"&fecha_inicial,Registros!B:B,\"=\"&'3000'!A42))","v":0},{"$f":"IF(ISBLANK(A42), 0, SUMIFS(Registros!E:E, Registros!A:A, \">=\" & fecha_inicial, Registros!A:A, \"<=\" & fecha_final,  Registros!B:B, \"=\" & '3000'!A42))","v":0},{"$f":"IF(ISBLANK(A42), 0, SUMIFS(Registros!F:F, Registros!A:A, \">=\" & fecha_inicial, Registros!A:A, \"<=\" & fecha_final,  Registros!B:B, \"=\" & '3000'!A42))","v":0},0]
[3300,"Código de Cuenta Incorrecto",{"$f":"SUM(C44:C58)","v":0},{"$f":"SUM(D44:D58)","v":0},0,0]
[3301,"Código de Cuenta Incorrecto",{"$f":"IF(ISBLANK(A44),0, SUMIFS(Registros!F:F,Registros!A:A,\"<\"&fecha_inicial,Registros!B:B,\"=\"&'3000'!A44)) - IF(ISBLANK(A44),0, SUMIFS(Registros!E:E,Registros!A:A,\"<\"&fecha_inicial,Registros!B:B,\"=\"&'3000'!A44))","v":0},{"$f":"IF(ISBLANK(A44), 0, SUMIFS(Registros!E:E, Registros!A:A, \">=\" & fecha_inicial, Registros!A:A, \"<=\" & fecha_final,  Registros!B:B, \"=\" & '3000'!A44))","v":0},{"$f":"IF(ISBLANK(A44), 0, SUMIFS(Registros!F:F, Registros!A:A, \">=\" & fecha_inicial, Registros!A:A, \"<=\" & fecha_final,  Registros!B:B, \"=\" & '3000'!A44))","v":0},0]
[3302,"Código de Cuenta Incorrecto",{"$f":"IF(ISBLANK(A45),0, SUMIFS(Registros!F:F,Registros!A:A,\"<\"&fecha_inicial,Registros!B:B,\"=\"&'3000'!A45)) - IF(ISBLANK(A45),0, SUMIFS(Registros!E:E,Registros!A:A,\"<\"&fecha_inicial,Registros!B:B,\"=\"&'3000'!A45))","v":0},{"$f":"IF(ISBLANK(A45), 0, SUMIFS(Registros!E:E, Registros!A:A, \">=\" & fecha_inicial, Registros!A:A, \"<=\" & fecha_final,  Registros!B:B, \"=\" & '3000'!A45))","v":0},{"$f":"IF(ISBLANK(A45), 0, SUMIFS(Registros!F:F, Registros!A:A, \">=\" & fecha_inicial, Registros!A:A, \"<=\" & fecha_final,  Registros!B:B, \"=\" & '3000'!A45))","v":0},0]
[3303,"Código de Cuenta Incorrecto",{"$f":"IF(ISBLANK(A46),0, SUMIFS(Registros!F:F,Registros!A:A,\"<\"&fecha_inicial,Registros!B:B,\"=\"&'3000'!A46)) - IF(ISBLANK(A46),0, SUMIFS(Registros!E:E,Registros!A:A,\"<\"&fecha_inicial,Registros!B:B,\"=\"&'3000'!A46))","v":0},{"$f":"IF(ISBLANK(A46), 0, SUMIFS(Registros!E:E, Registros!A:A, \">=\" & fecha_inicial, Registros!A:A, \"<=\" & fecha_final,  Registros!B:B, \"=\" & '3000'!A46))","v":0},{"$f":"IF(ISBLANK(A46), 0, SUMIFS(Registros!F:F, Registros!A:A, \">=\" & fecha_inicial, Registros!A:A, \"<=\" & fecha_final,  Registros!B:B, \"=\" & '3000'!A46))","v":0},0]
[3304,"Código de Cuenta Incorrecto",{"$f":"IF(ISBLANK(A47),0, SUMIFS(Registros!F:F,Registros!A:A,\"<\"&fecha_inicial,Registros!B:B,\"=\"&'3000'!A47)) - IF(ISBLANK(A47),0, SUMIFS(Registros!E:E,Registros!A:A,\"<\"&fecha_inicial,Registros!B:B,\"=\"&'3000'!A47))","v":0},{"$f":"IF(ISBLANK(A47), 0, SUMIFS(Registros!E:E, Registros!A:A, \">=\" & fecha_inicial, Registros!A:A, \"<=\" & fecha_final,  Registros!B:B, \"=\" & '3000'!A47))","v":0},{"$f":"IF(ISBLANK(A47), 0, SUMIFS(Registros!F:F, Registros!A:A, \">=\" & fecha_inicial, Registros!A:A, \"<=\" & fecha_final,  Registros!B:B, \"=\" & '3000'!A47))","v":0},0]
[3305,"Código de Cuenta Incorrecto",{"$f":"IF(ISBLANK(A48),0, SUMIFS(Registros!F:F,Registros!A:A,\"<\"&fecha_inicial,Registros!B:B,\"=\"&'3000'!A48)) - IF(ISBLANK(A48),0, SUMIFS(Registros!E:E,Registros!A:A,\"<\"&fecha_inicial,Registros!B:B,\"=\"&'3000'!A48))","v":0},{"$f":"IF(ISBLANK(A48), 0, SUMIFS(Registros!E:E, Registros!A:A, \">=\" & fecha_inicial, Registros!A:A, \"<=\" & fecha_final,  Registros!B:B, \"=\" & '3000'!A48))","v":0},{"$f":"IF(ISBLANK(A48), 0, SUMIFS(Registros!F:F, Registros!A:A, \">=\" & fecha_inicial, Registros!A:A, \"<=\" & fecha_final,  Registros!B:B, \"=\" & '3000'!A48))","v":0},0]
[3306,"Código de Cuenta Incorrecto",{"$f":"IF(ISBLANK(A49),0, SUMIFS(Registros!F:F,Registros!A:A,\"<\"&fecha_inicial,Registros!B:B,\"=\"&'3000'!A49)) - IF(ISBLANK(A49),0, SUMIFS(Registros!E:E,Registros!A:A,\"<\"&fecha_inicial,Registros!B:B,\"=\"&'3000'!A49))","v":0},{"$f":"IF(ISBLANK(A49), 0, SUMIFS(Registros!E:E, Registros!A:A, \">=\" & fecha_inicial, Registros!A:A, \"<=\" & fecha_final,  Registros!B:B, \"=\" & '3000'!A49))","v":0},{"$f":"IF(ISBLANK(A49), 0, SUMIFS(Registros!F:F, Registros!A:A, \">=\" & fecha_inicial, Registros!A:A, \"<=\" & fecha_final,  Registros!B:B, \"=\" & '3000'!A49))","v":0},0]
[3307,"Código de Cuenta Incorrecto",{"$f":"IF(ISBLANK(A50),0, SUMIFS(Registros!F:F,Registros!A:A,\"<\"&fecha_inicial,Registros!B:B,\"=\"&'3000'!A50)) - IF(ISBLANK(A50),0, SUMIFS(Registros!E:E,Registros!A:A,\"<\"&fecha_inicial,Registros!B:B,\"=\"&'3000'!A50))","v":0},{"$f":"IF(ISBLANK(A50), 0, SUMIFS(Registros!E:E, Registros!A:A, \">=\" & fecha_inicial, Registros!A:A, \"<=\" & fecha_final,  Registros!B:B, \"=\" & '3000'!A50))","v":0},{"$f":"IF(ISBLANK(A50), 0, SUMIFS(Registros!F:F, Registros!A:A, \">=\" & fecha_inicial, Registros!A:A, \"<=\" & fecha_final,  Registros!B:B, \"=\" & '3000'!A50))","v":0},0]
[3308,"Código de Cuenta Incorrecto",{"$f":"IF(ISBLANK(A51),0, SUMIFS(Registros!F:F,Registros!A:A,\"<\"&fecha_inicial,Registros!B:B,\"=\"&'3000'!A51)) - IF(ISBLANK(A51),0, SUMIFS(Registros!E:E,Registros!A:A,\"<\"&fecha_inicial,Registros!B:B,\"=\"&'3000'!A51))","v":0},{"$f":"IF(ISBLANK(A51), 0, SUMIFS(Registros!E:E, Registros!A:A, \">=\" & fecha_inicial, Registros!A:A, \"<=\" & fecha_final,  Registros!B:B, \"=\" & '3000'!A51))","v":0},{"$f":"IF(ISBLANK(A51), 0, SUMIFS(Registros!F:F, Registros!A:A, \">=\" & fecha_inicial, Registros!A:A, \"<=\" & fecha_final,  Registros!B:B, \"=\" & '3000'!A51))","v":0},0]
[3309,"Código de Cuenta Incorrecto",{"$f":"IF(ISBLANK(A52),0, SUMIFS(Registros!F:F,Registros!A:A,\"<\"&fecha_inicial,Registros!B:B,\"=\"&'3000'!A52)) - IF(ISBLANK(A52),0, SUMIFS(Registros!E:E,Registros!A:A,\"<\"&fecha_inicial,Registros!B:B,\"=\"&'3000'!A52))","v":0},{"$f":"IF(ISBLANK(A52), 0, SUMIFS(Registros!E:E, Registros!A:A, \">=\" & fecha_inicial, Registros!A:A, \"<=\" & fecha_final,  Registros!B:B, \"=\" & '3000'!A52))","v":0},{"$f":"IF(ISBLANK(A52), 0, SUMIFS(Registros!F:F, Registros!A:A, \">=\" & fecha_inicial, Registros!A:A, \"<=\" & fecha_final,  Registros!B:B, \"=\" & '3000'!A52))","v":0},0]
[3310,"Código de Cuenta Incorrecto",{"$f":"IF(ISBLANK(A53),0, SUMIFS(Registros!F:F,Registros!A:A,\"<\"&fecha_inicial,Registros!B:B,\"=\"&'3000'!A53)) - IF(ISBLANK(A53),0, SUMIFS(Registros!E:E,Registros!A:A,\"<\"&fecha_inicial,Registros!B:B,\"=\"&'3000'!A53))","v":0},{"$f":"IF(ISBLANK(A53), 0, SUMIFS(Registros!E:E, Registros!A:A, \">=\" & fecha_inicial, Registros!A:A, \"<=\" & fecha_final,  Registros!B:B, \"=\" & '3000'!A53))","v":0},{"$f":"IF(ISBLANK(A53), 0, SUMIFS(Registros!F:F, Registros!A:A, \">=\" & fecha_inicial, Registros!A:A, \"<=\" & fecha_final,  Registros!B:B, \"=\" & '3000'!A53))","v":0},0]
[3311,"Código de Cuenta Incorrecto",{"$f":"IF(ISBLANK(A54),0, SUMIFS(Registros!F:F,Registros!A:A,\"<\"&fecha_inicial,Registros!B:B,\"=\"&'3000'!A54)) - IF(ISBLANK(A54),0, SUMIFS(Registros!E:E,Registros!A:A,\"<\"&fecha_inicial,Registros!B:B,\"=\"&'3000'!A54))","v":0},{"$f":"IF(ISBLANK(A54), 0, SUMIFS(Registros!E:E, Registros!A:A, \">=\" & fecha_inicial, Registros!A:A, \"<=\" & fecha_final,  Registros!B:B, \"=\" & '3000'!A54))","v":0},{"$f":"IF(ISBLANK(A54), 0, SUMIFS(Registros!F:F, Registros!A:A, \">=\" & fecha_inicial, Registros!A:A, \"<=\" & fecha_final,  Registros!B:B, \"=\" & '3000'!A54))","v":0},0]
[3312,"Código de Cuenta Incorrecto",{"$f":"IF(ISBLANK(A55),0, SUMIFS(Registros!F:F,Registros!A:A,\"<\"&fecha_inicial,Registros!B:B,\"=\"&'3000'!A55)) - IF(ISBLANK(A55),0, SUMIFS(Registros!E:E,Registros!A:A,\"<\"&fecha_inicial,Registros!B:B,\"=\"&'3000'!A55))","v":0},{"$f":"IF(ISBLANK(A55), 0, SUMIFS(Registros!E:E, Registros!A:A, \">=\" & fecha_inicial, Registros!A:A, \"<=\" & fecha_final,  Registros!B:B, \"=\" & '3000'!A55))","v":0},{"$f":"IF(ISBLANK(A55), 0, SUMIFS(Registros!F:F, Registros!A:A, \">=\" & fecha_inicial, Registros!A:A, \"<=\" & fecha_final,  Registros!B:B, \"=\" & '3000'!A55))","v":0},0]
[3313,"Código de Cuenta Incorrecto",{"$f":"IF(ISBLANK(A56),0, SUMIFS(Registros!F:F,Registros!A:A,\"<\"&fecha_inicial,Registros!B:B,\"=\"&'3000'!A56)) - IF(ISBLANK(A56),0, SUMIFS(Registros!E:E,Registros!A:A,\"<\"&fecha_inicial,Registros!B:B,\"=\"&'3000'!A56))","v":0},{"$f":"IF(ISBLANK(A56), 0, SUMIFS(Registros!E:E, Registros!A:A, \">=\" & fecha_inicial, Registros!A:A, \"<=\" & fecha_final,  Registros!B:B, \"=\" & '3000'!A56))","v":0},{"$f":"IF(ISBLANK(A56), 0, SUMIFS(Registros!F:F, Registros!A:A, \">=\" & fecha_inicial, Registros!A:A, \"<=\" & fecha_final,  Registros!B:B, \"=\" & '3000'!A56))","v":0},0]
[3314,"Código de Cuenta Incorrecto",{"$f":"IF(ISBLANK(A57),0, SUMIFS(Registros!F:F,Registros!A:A,\"<\"&fecha_inicial,Registros!B:B,\"=\"&'3000'!A57)) - IF(ISBLANK(A57),0, SUMIFS(Registros!E:E,Registros!A:A,\"<\"&fecha_inicial,Registros!B:B,\"=\"&'3000'!A57))","v":0},{"$f":"IF(ISBLANK(A57), 0, SUMIFS(Registros!E:E, Registros!A:A, \">=\" & fecha_inicial, Registros!A:A, \"<=\" & fecha_final,  Registros!B:B, \"=\" & '3000'!A57))","v":0},{"$f":"IF(ISBLANK(A57), 0, SUMIFS(Registros!F:F, Registros!A:A, \">=\" & fecha_inicial, Registros!A:A, \"<=\" & fecha_final,  Registros!B:B, \"=\" & '3000'!A57))","v":0},0]
[3315,"Código de Cuenta Incorrecto",{"$f":"IF(ISBLANK(A58),0, SUMIFS(Registros!F:F,Registros!A:A,\"<\"&fecha_inicial,Registros!B:B,\"=\"&'3000'!A58)) - IF(ISBLANK(A58),0, SUMIFS(Registros!E:E,Registros!A:A,\"<\"&fecha_inicial,Registros!B:B,\"=\"&'3000'!A58))","v":0},{"$f":"IF(ISBLANK(A58), 0, SUMIFS(Registros!E:E, Registros!A:A, \">=\" & fecha_inicial, Registros!A:A, \"<=\" & fecha_final,  Registros!B:B, \"=\" & '3000'!A58))","v":0},{"$f":"IF(ISBLANK(A58), 0, SUMIFS(Registros!F:F, Registros!A:A, \">=\" & fecha_inicial, Registros!A:A, \"<=\" & fecha_final,  Registros!B:B, \"=\" & '3000'!A58))","v":0},0]
[3400,"Código de Cuenta Incorrecto",{"$f":"SUM(C60:C74)","v":0},{"$f":"SUM(D60:D74)","v":0},0,0]
[3401,"Código de Cuenta Incorrecto",{"$f":"IF(ISBLANK(A60),0, SUMIFS(Registros!F:F,Registros!A:A,\"<\"&fecha_inicial,Registros!B:B,\"=\"&'3000'!A60)) - IF(ISBLANK(A60),0, SUMIFS(Registros!E:E,Registros!A:A,\"<\"&fecha_inicial,Registros!B:B,\"=\"&'3000'!A60))","v":0},{"$f":"IF(ISBLANK(A60), 0, SUMIFS(Registros!E:E, Registros!A:A, \">=\" & fecha_inicial, Registros!A:A, \"<=\" & fecha_final,  Registros!B:B, \"=\" & '3000'!A60))","v":0},{"$f":"IF(ISBLANK(A60), 0, SUMIFS(Registros!F:F, Registros!A:A, \">=\" & fecha_inicial, Registros!A:A, \"<=\" & fecha_final,  Registros!B:B, \"=\" & '3000'!A60))","v":0},0]
[3402,"Código de Cuenta Incorrecto",{"$f":"IF(ISBLANK(A61),0, SUMIFS(Registros!F:F,Registros!A:A,\"<\"&fecha_inicial,Registros!B:B,\"=\"&'3000'!A61)) - IF(ISBLANK(A61),0, SUMIFS(Registros!E:E,Registros!A:A,\"<\"&fecha_inicial,Registros!B:B,\"=\"&'3000'!A61))","v":0},{"$f":"IF(ISBLANK(A61), 0, SUMIFS(Registros!E:E, Registros!A:A, \">=\" & fecha_inicial, Registros!A:A, \"<=\" & fecha_final,  Registros!B:B, \"=\" & '3000'!A61))","v":0},{"$f":"IF(ISBLANK(A61), 0, SUMIFS(Registros!F:F, Registros!A:A, \">=\" & fecha_inicial, Registros!A:A, \"<=\" & fecha_final,  Registros!B:B, \"=\" & '3000'!A61))","v":0},0]
[3403,"Código de Cuenta Incorrecto",{"$f":"IF(ISBLANK(A62),0, SUMIFS(Registros!F:F,Registros!A:A,\"<\"&fecha_inicial,Registros!B:B,\"=\"&'3000'!A62)) - IF(ISBLANK(A62),0, SUMIFS(Registros!E:E,Registros!A:A,\"<\"&fecha_inicial,Registros!B:B,\"=\"&'3000'!A62))","v":0},{"$f":"IF(ISBLANK(A62), 0, SUMIFS(Registros!E:E, Registros!A:A, \">=\" & fecha_inicial, Registros!A:A, \"<=\" & fecha_final,  Registros!B:B, \"=\" & '3000'!A62))","v":0},{"$f":"IF(ISBLANK(A62), 0, SUMIFS(Registros!F:F, Registros!A:A, \">=\" & fecha_inicial, Registros!A:A, \"<=\" & fecha_final,  Registros!B:B, \"=\" & '3000'!A62))","v":0},0]
[3404,"Código de Cuenta Incorrecto",{"$f":"IF(ISBLANK(A63),0, SUMIFS(Registros!F:F,Registros!A:A,\"<\"&fecha_inicial,Registros!B:B,\"=\"&'3000'!A63)) - IF(ISBLANK(A63),0, SUMIFS(Registros!E:E,Registros!A:A,\"<\"&fecha_inicial,Registros!B:B,\"=\"&'3000'!A63))","v":0},{"$f":"IF(ISBLANK(A63), 0, SUMIFS(Registros!E:E, Registros!A:A, \">=\" & fecha_inicial, Registros!A:A, \"<=\" & fecha_final,  Registros!B:B, \"=\" & '3000'!A63))","v":0},{"$f":"IF(ISBLANK(A63), 0, SUMIFS(Registros!F:F, Registros!A:A, \">=\" & fecha_inicial, Registros!A:A, \"<=\" & fecha_final,  Registros!B:B, \"=\" & '3000'!A63))","v":0},0]
[3405,"Código de Cuenta Incorrecto",{"$f":"IF(ISBLANK(A64),0, SUMIFS(Registros!F:F,Registros!A:A,\"<\"&fecha_inicial,Registros!B:B,\"=\"&'3000'!A64)) - IF(ISBLANK(A64),0, SUMIFS(Registros!E:E,Registros!A:A,\"<\"&fecha_inicial,Registros!B:B,\"=\"&'3000'!A64))","v":0},{"$f":"IF(ISBLANK(A64), 0, SUMIFS(Registros!E:E, Registros!A:A, \">=\" & fecha_inicial, Registros!A:A, \"<=\" & fecha_final,  Registros!B:B, \"=\" & '3000'!A64))","v":0},{"$f":"IF(ISBLANK(A64), 0, SUMIFS(Registros!F:F, Registros!A:A, \">=\" & fecha_inicial, Registros!A:A, \"<=\" & fecha_final,  Registros!B:B, \"=\" & '3000'!A64))","v":0},0]
[3406,"Código de Cuenta Incorrecto",{"$f":"IF(ISBLANK(A65),0, SUMIFS(Registros!F:F,Registros!A:A,\"<\"&fecha_inicial,Registros!B:B,\"=\"&'3000'!A65)) - IF(ISBLANK(A65),0, SUMIFS(Registros!E:E,Registros!A:A,\"<\"&fecha_inicial,Registros!B:B,\"=\"&'3000'!A65))","v":0},{"$f":"IF(ISBLANK(A65), 0, SUMIFS(Registros!E:E, Registros!A:A, \">=\" & fecha_inicial, Registros!A:A, \"<=\" & fecha_final,  Registros!B:B, \"=\" & '3000'!A65))","v":0},{"$f":"IF(ISBLANK(A65), 0, SUMIFS(Registros!F:F, Registros!A:A, \">=\" & fecha_inicial, Registros!A:A, \"<=\" & fecha_final,  Registros!B:B, \"=\" & '3000'!A65))","v":0},0]
[3407,"Código de Cuenta Incorrecto",{"$f":"IF(ISBLANK(A66),0, SUMIFS(Registros!F:F,Registros!A:A,\"<\"&fecha_inicial,Registros!B:B,\"=\"&'3000'!A66)) - IF(ISBLANK(A66),0, SUMIFS(Registros!E:E,Registros!A:A,\"<\"&fecha_inicial,Registros!B:B,\"=\"&'3000'!A66))","v":0},{"$f":"IF(ISBLANK(A66), 0, SUMIFS(Registros!E:E, Registros!A:A, \">=\" & fecha_inicial, Registros!A:A, \"<=\" & fecha_final,  Registros!B:B, \"=\" & '3000'!A66))","v":0},{"$f":"IF(ISBLANK(A66), 0, SUMIFS(Registros!F:F, Registros!A:A, \">=\" & fecha_inicial, Registros!A:A, \"<=\" & fecha_final,  Registros!B:B, \"=\" & '3000'!A66))","v":0},0]
[3408,"Código de Cuenta Incorrecto",{"$f":"IF(ISBLANK(A67),0, SUMIFS(Registros!F:F,Registros!A:A,\"<\"&fecha_inicial,Registros!B:B,\"=\"&'3000'!A67)) - IF(ISBLANK(A67),0, SUMIFS(Registros!E:E,Registros!A:A,\"<\"&fecha_inicial,Registros!B:B,\"=\"&'3000'!A67))","v":0},{"$f":"IF(ISBLANK(A67), 0, SUMIFS(Registros!E:E, Registros!A:A, \">=\" & fecha_inicial, Registros!A:A, \"<=\" & fecha_final,  Registros!B:B, \"=\" & '3000'!A67))","v":0},{"$f":"IF(ISBLANK(A67), 0, SUMIFS(Registros!F:F, Registros!A:A, \">=\" & fecha_inicial, Registros!A:A, \"<=\" & fecha_final,  Registros!B:B, \"=\" & '3000'!A67))","v":0},0]
[3409,"Código de Cuenta Incorrecto",{"$f":"IF(ISBLANK(A68),0, SUMIFS(Registros!F:F,Registros!A:A,\"<\"&fecha_inicial,Registros!B:B,\"=\"&'3000'!A68)) - IF(ISBLANK(A68),0, SUMIFS(Registros!E:E,Registros!A:A,\"<\"&fecha_inicial,Registros!B:B,\"=\"&'3000'!A68))","v":0},{"$f":"IF(ISBLANK(A68), 0, SUMIFS(Registros!E:E, Registros!A:A, \">=\" & fecha_inicial, Registros!A:A, \"<=\" & fecha_final,  Registros!B:B, \"=\" & '3000'!A68))","v":0},{"$f":"IF(ISBLANK(A68), 0, SUMIFS(Registros!F:F, Registros!A:A, \">=\" & fecha_inicial, Registros!A:A, \"<=\" & fecha_final,  Registros!B:B, \"=\" & '3000'!A68))","v":0},0]
[3410,"Código de Cuenta Incorrecto",{"$f":"IF(ISBLANK(A69),0, SUMIFS(Registros!F:F,Registros!A:A,\"<\"&fecha_inicial,Registros!B:B,\"=\"&'3000'!A69)) - IF(ISBLANK(A69),0, SUMIFS(Registros!E:E,Registros!A:A,\"<\"&fecha_inicial,Registros!B:B,\"=\"&'3000'!A69))","v":0},{"$f":"IF(ISBLANK(A69), 0, SUMIFS(Registros!E:E, Registros!A:A, \">=\" & fecha_inicial, Registros!A:A, \"<=\" & fecha_final,  Registros!B:B, \"=\" & '3000'!A69))","v":0},{"$f":"IF(ISBLANK(A69), 0, SUMIFS(Registros!F:F, Registros!A:A, \">=\" & fecha_inicial, Registros!A:A, \"<=\" & fecha_final,  Registros!B:B, \"=\" & '3000'!A69))","v":0},0]
[3411,"Código de Cuenta Incorrecto",{"$f":"IF(ISBLANK(A70),0, SUMIFS(Registros!F:F,Registros!A:A,\"<\"&fecha_inicial,Registros!B:B,\"=\"&'3000'!A70)) - IF(ISBLANK(A70),0, SUMIFS(Registros!E:E,Registros!A:A,\"<\"&fecha_inicial,Registros!B:B,\"=\"&'3000'!A70))","v":0},{"$f":"IF(ISBLANK(A70), 0, SUMIFS(Registros!E:E, Registros!A:A, \">=\" & fecha_inicial, Registros!A:A, \"<=\" & fecha_final,  Registros!B:B, \"=\" & '3000'!A70))","v":0},{"$f":"IF(ISBLANK(A70), 0, SUMIFS(Registros!F:F, Registros!A:A, \">=\" & fecha_inicial, Registros!A:A, \"<=\" & fecha_final,  Registros!B:B, \"=\" & '3000'!A70))","v":0},0]
[3412,"Código de Cuenta Incorrecto",{"$f":"IF(ISBLANK(A71),0, SUMIFS(Registros!F:F,Registros!A:A,\"<\"&fecha_inicial,Registros!B:B,\"=\"&'3000'!A71)) - IF(ISBLANK(A71),0, SUMIFS(Registros!E:E,Registros!A:A,\"<\"&fecha_inicial,Registros!B:B,\"=\"&'3000'!A71))","v":0},{"$f":"IF(ISBLANK(A71), 0, SUMIFS(Registros!E:E, Registros!A:A, \">=\" & fecha_inicial, Registros!A:A, \"<=\" & fecha_final,  Registros!B:B, \"=\" & '3000'!A71))","v":0},{"$f":"IF(ISBLANK(A71), 0, SUMIFS(Registros!F:F, Registros!A:A, \">=\" & fecha_inicial, Registros!A:A, \"<=\" & fecha_final,  Registros!B:B, \"=\" & '3000'!A71))","v":0},0]
[3413,"Código de Cuenta Incorrecto",{"$f":"IF(ISBLANK(A72),0, SUMIFS(Registros!F:F,Registros!A:A,\"<\"&fecha_inicial,Registros!B:B,\"=\"&'3000'!A72)) - IF(ISBLANK(A72),0, SUMIFS(Registros!E:E,Registros!A:A,\"<\"&fecha_inicial,Registros!B:B,\"=\"&'3000'!A72))","v":0},{"$f":"IF(ISBLANK(A72), 0, SUMIFS(Registros!E:E, Registros!A:A, \">=\" & fecha_inicial, Registros!A:A, \"<=\" & fecha_final,  Registros!B:B, \"=\" & '3000'!A72))","v":0},{"$f":"IF(ISBLANK(A72), 0, SUMIFS(Registros!F:F, Registros!A:A, \">=\" & fecha_inicial, Registros!A:A, \"<=\" & fecha_final,  Registros!B:B, \"=\" & '3000'!A72))","v":0},0]
[3414,"Código de Cuenta Incorrecto",{"$f":"IF(ISBLANK(A73),0, SUMIFS(Registros!F:F,Registros!A:A,\"<\"&fecha_inicial,Registros!B:B,\"=\"&'3000'!A73)) - IF(ISBLANK(A73),0, SUMIFS(Registros!E:E,Registros!A:A,\"<\"&fecha_inicial,Registros!B:B,\"=\"&'3000'!A73))","v":0},{"$f":"IF(ISBLANK(A73), 0, SUMIFS(Registros!E:E, Registros!A:A, \">=\" & fecha_inicial, Registros!A:A, \"<=\" & fecha_final,  Registros!B:B, \"=\" & '3000'!A73))","v":0},{"$f":"IF(ISBLANK(A73), 0, SUMIFS(Registros!F:F, Registros!A:A, \">=\" & fecha_inicial, Registros!A:A, \"<=\" & fecha_final,  Registros!B:B, \"=\" & '3000'!A73))","v":0},0]
[3415,"Código de Cuenta Incorrecto",{"$f":"IF(ISBLANK(A74),0, SUMIFS(Registros!F:F,Registros!A:A,\"<\"&fecha_inicial,Registros!B:B,\"=\"&'3000'!A74)) - IF(ISBLANK(A74),0, SUMIFS(Registros!E:E,Registros!A:A,\"<\"&fecha_inicial,Registros!B:B,\"=\"&'3000'!A74))","v":0},{"$f":"IF(ISBLANK(A74), 0, SUMIFS(Registros!E:E, Registros!A:A, \">=\" & fecha_inicial, Registros!A:A, \"<=\" & fecha_final,  Registros!B:B, \"=\" & '3000'!A74))","v":0},{"$f":"IF(ISBLANK(A74), 0, SUMIFS(Registros!F:F, Registros!A:A, \">=\" & fecha_inicial, Registros!A:A, \"<=\" & fecha_final,  Registros!B:B, \"=\" & '3000'!A74))","v":0},0]
[{"$f":"\"SALDO FINAL DE LA CUENTA AL \" &TEXT(fecha_final, \"dd\")&\" DE \"&UPPER(TEXT(fecha_final, \"MMMM\"))&\" DEL \"& TEXT(fecha_final, \"YYYY\")","v":"SALDO FINAL DE LA CUENTA AL 00 DE ENERO DEL 1900"},null,{"$f":"C11+C27+C43+C59","v":0},{"$f":"D11+D27+D43+D59","v":0},{"$f":"E11+E27+E43+E59","v":0},{"$f":"C75-D75+E75","v":0}]
[]
[]
[]
[]
["ELABORA",null,null,null,"REVISA"]
[{"$f":"VLOOKUP(A80, Usuarios!B12:E14, 2, FALSE)","v":"Arlen de Jesús Baltodano López"},null,null,null,{"$f":"VLOOKUP(E80, Usuarios!B12:E14, 2, FALSE)","v":"Gersan Arguello Prado"}]
[{"$f":"VLOOKUP(A80, Usuarios!B12:E14, 4, FALSE)","v":"Auxiliar de Contabilidad"},null,null,null,{"$f":"VLOOKUP(E80, Usuarios!B12:E14, 4, FALSE)","v":"Contador General"}]
[]
[]
[null,null,"AUTORIZA"]
[null,null,{"$f":"VLOOKUP(C85, Usuarios!B12:E14, 2, FALSE)","v":"Matilda Padilla Mayorga"}]
[null,null,{"$f":"VLOOKUP(C85, Usuarios!B12:E14, 4, FALSE)","v":"Gerente de Finanzas"}]

{"sheet":"4000","index":17,"n_rows":87,"n_cols":6,"rows_kept":87,"cut":false,"hidden":false,"merged":[[86,2,86,3],[80,0,80,1],[80,4,80,5],[81,0,81,1],[81,4,81,5],[84,2,84,3],[85,2,85,3],[7,5,8,5],[74,0,74,1],[78,0,78,1],[78,4,78,5],[79,0,79,1],[79,4,79,5],[7,0,8,0],[7,1,8,1],[7,2,8,2],[7,3,8,3],[7,4,8,4],[1,0,1,5],[2,0,2,5],[3,0,3,5],[4,0,4,5],[6,3,6,5]]}
[null,null,null,null,"Proteger"]
[{"$f":"nombre_empresa","v":"CONSULTORES DE OMETEPE"}]
[{"$f":"\"RESUMEN CONTABLE DE \"&B7","v":"RESUMEN CONTABLE DE INGRESOS"}]
[{"$f":"\"DEL \"&TEXT(fecha_inicial, \"DD\")&\" DE \"&UPPER(TEXT(fecha_inicial, \"MMMM\"))&\" AL \"&TEXT(fecha_final, \"DD\")&\" DE \"&UPPER(TEXT(fecha_final, \"MMMM\"))&\" DE \"&TEXT(fecha_final, \"YYYY\")","v":"DEL 00 DE ENERO AL 00 DE ENERO DE 1900"}]
[{"$f":"direccion & \" *** Tel/Fax:  \" & tel_fax & \" *** \" & email","v":"Barrio el Progreso, San Jorge, Rivas. *** Tel/Fax:  89040457 *** escribeme@radioometepe.com"}]
[]
[4000,{"$f":"UPPER(IF(ISBLANK(A7),\"\",IFERROR(VLOOKUP(A7,plan_cuentas,2,FALSE),\"Código de cuenta incorrecto\")))","v":"INGRESOS"},null,{"$f":"\"MOVIMIENTOS DE \"&UPPER(TEXT(fecha_final, \"MMMM\"))","v":"MOVIMIENTOS DE ENERO"}]
["CODIGO","NOMBRE DE LA CUENTA","SALDO INICIAL","DEBITOS","CREDITOS","SALDO FINAL"]
[]
[]
[4100,{"$f":"IF(A11<>0, IF(ISERROR(VLOOKUP(A11, plan_cuentas,2, FALSE)), \"Código de Cuenta Incorrecto\", UPPER(VLOOKUP(A11, plan_cuentas, 2, FALSE))), \"\")","v":"VENTAS DE CONTADO"},{"$f":"SUM(C12:C26)","v":0},{"$f":"SUM(D12:D26)","v":0},0,{"$f":"C11-D11+E11","v":0}]
[4101,"VENTA DE MERCANCÍAS AL CONTADO",{"$f":"IF(ISBLANK(A12),0, SUMIFS(Registros!F:F,Registros!A:A,\"<\"&fecha_inicial,Registros!B:B,\"=\"&'4000'!A12)) - IF(ISBLANK(A12),0, SUMIFS(Registros!E:E,Registros!A:A,\"<\"&fecha_inicial,Registros!B:B,\"=\"&'4000'!A12))","v":0},{"$f":"IF(ISBLANK(A12), 0, SUMIFS(Registros!E:E, Registros!A:A, \">=\" & fecha_inicial, Registros!A:A, \"<=\" & fecha_final,  Registros!B:B, \"=\" & '4000'!A12))","v":0},{"$f":"IF(ISBLANK(A12), 0, SUMIFS(Registros!F:F, Registros!A:A, \">=\" & fecha_inicial, Registros!A:A, \"<=\" & fecha_final,  Registros!B:B, \"=\" & '4000'!A12))","v":0},{"$f":"C12-D12+E12","v":0}]
[4102,"OTROS INGRESOS",{"$f":"IF(ISBLANK(A13),0, SUMIFS(Registros!F:F,Registros!A:A,\"<\"&fecha_inicial,Registros!B:B,\"=\"&'4000'!A13)) - IF(ISBLANK(A13),0, SUMIFS(Registros!E:E,Registros!A:A,\"<\"&fecha_inicial,Registros!B:B,\"=\"&'4000'!A13))","v":0},{"$f":"IF(ISBLANK(A13), 0, SUMIFS(Registros!E:E, Registros!A:A, \">=\" & fecha_inicial, Registros!A:A, \"<=\" & fecha_final,  Registros!B:B, \"=\" & '4000'!A13))","v":0},{"$f":"IF(ISBLANK(A13), 0, SUMIFS(Registros!F:F, Registros!A:A, \">=\" & fecha_inicial, Registros!A:A, \"<=\" & fecha_final,  Registros!B:B, \"=\" & '4000'!A13))","v":0},0]
[4103,"Código de Cuenta Incorrecto",{"$f":"IF(ISBLANK(A14),0, SUMIFS(Registros!F:F,Registros!A:A,\"<\"&fecha_inicial,Registros!B:B,\"=\"&'4000'!A14)) - IF(ISBLANK(A14),0, SUMIFS(Registros!E:E,Registros!A:A,\"<\"&fecha_inicial,Registros!B:B,\"=\"&'4000'!A14))","v":0},{"$f":"IF(ISBLANK(A14), 0, SUMIFS(Registros!E:E, Registros!A:A, \">=\" & fecha_inicial, Registros!A:A, \"<=\" & fecha_final,  Registros!B:B, \"=\" & '4000'!A14))","v":0},{"$f":"IF(ISBLANK(A14), 0, SUMIFS(Registros!F:F, Registros!A:A, \">=\" & fecha_inicial, Registros!A:A, \"<=\" & fecha_final,  Registros!B:B, \"=\" & '4000'!A14))","v":0},0]
[4104,"Código de Cuenta Incorrecto",{"$f":"IF(ISBLANK(A15),0, SUMIFS(Registros!F:F,Registros!A:A,\"<\"&fecha_inicial,Registros!B:B,\"=\"&'4000'!A15)) - IF(ISBLANK(A15),0, SUMIFS(Registros!E:E,Registros!A:A,\"<\"&fecha_inicial,Registros!B:B,\"=\"&'4000'!A15))","v":0},{"$f":"IF(ISBLANK(A15), 0, SUMIFS(Registros!E:E, Registros!A:A, \">=\" & fecha_inicial, Registros!A:A, \"<=\" & fecha_final,  Registros!B:B, \"=\" & '4000'!A15))","v":0},{"$f":"IF(ISBLANK(A15), 0, SUMIFS(Registros!F:F, Registros!A:A, \">=\" & fecha_inicial, Registros!A:A, \"<=\" & fecha_final,  Registros!B:B, \"=\" & '4000'!A15))","v":0},0]
[4105,"Código de Cuenta Incorrecto",{"$f":"IF(ISBLANK(A16),0, SUMIFS(Registros!F:F,Registros!A:A,\"<\"&fecha_inicial,Registros!B:B,\"=\"&'4000'!A16)) - IF(ISBLANK(A16),0, SUMIFS(Registros!E:E,Registros!A:A,\"<\"&fecha_inicial,Registros!B:B,\"=\"&'4000'!A16))","v":0},{"$f":"IF(ISBLANK(A16), 0, SUMIFS(Registros!E:E, Registros!A:A, \">=\" & fecha_inicial, Registros!A:A, \"<=\" & fecha_final,  Registros!B:B, \"=\" & '4000'!A16))","v":0},{"$f":"IF(ISBLANK(A16), 0, SUMIFS(Registros!F:F, Registros!A:A, \">=\" & fecha_inicial, Registros!A:A, \"<=\" & fecha_final,  Registros!B:B, \"=\" & '4000'!A16))","v":0},0]
[4106,"Código de Cuenta Incorrecto",{"$f":"IF(ISBLANK(A17),0, SUMIFS(Registros!F:F,Registros!A:A,\"<\"&fecha_inicial,Registros!B:B,\"=\"&'4000'!A17)) - IF(ISBLANK(A17),0, SUMIFS(Registros!E:E,Registros!A:A,\"<\"&fecha_inicial,Registros!B:B,\"=\"&'4000'!A17))","v":0},{"$f":"IF(ISBLANK(A17), 0, SUMIFS(Registros!E:E, Registros!A:A, \">=\" & fecha_inicial, Registros!A:A, \"<=\" & fecha_final,  Registros!B:B, \"=\" & '4000'!A17))","v":0},{"$f":"IF(ISBLANK(A17), 0, SUMIFS(Registros!F:F, Registros!A:A, \">=\" & fecha_inicial, Registros!A:A, \"<=\" & fecha_final,  Registros!B:B, \"=\" & '4000'!A17))","v":0},0]
[4107,"Código de Cuenta Incorrecto",{"$f":"IF(ISBLANK(A18),0, SUMIFS(Registros!F:F,Registros!A:A,\"<\"&fecha_inicial,Registros!B:B,\"=\"&'4000'!A18)) - IF(ISBLANK(A18),0, SUMIFS(Registros!E:E,Registros!A:A,\"<\"&fecha_inicial,Registros!B:B,\"=\"&'4000'!A18))","v":0},{"$f":"IF(ISBLANK(A18), 0, SUMIFS(Registros!E:E, Registros!A:A, \">=\" & fecha_inicial, Registros!A:A, \"<=\" & fecha_final,  Registros!B:B, \"=\" & '4000'!A18))","v":0},{"$f":"IF(ISBLANK(A18), 0, SUMIFS(Registros!F:F, Registros!A:A, \">=\" & fecha_inicial, Registros!A:A, \"<=\" & fecha_final,  Registros!B:B, \"=\" & '4000'!A18))","v":0},0]
[4108,"Código de Cuenta Incorrecto",{"$f":"IF(ISBLANK(A19),0, SUMIFS(Registros!F:F,Registros!A:A,\"<\"&fecha_inicial,Registros!B:B,\"=\"&'4000'!A19)) - IF(ISBLANK(A19),0, SUMIFS(Registros!E:E,Registros!A:A,\"<\"&fecha_inicial,Registros!B:B,\"=\"&'4000'!A19))","v":0},{"$f":"IF(ISBLANK(A19), 0, SUMIFS(Registros!E:E, Registros!A:A, \">=\" & fecha_inicial, Registros!A:A, \"<=\" & fecha_final,  Registros!B:B, \"=\" & '4000'!A19))","v":0},{"$f":"IF(ISBLANK(A19), 0, SUMIFS(Registros!F:F, Registros!A:A, \">=\" & fecha_inicial, Registros!A:A, \"<=\" & fecha_final,  Registros!B:B, \"=\" & '4000'!A19))","v":0},0]
[4109,"Código de Cuenta Incorrecto",{"$f":"IF(ISBLANK(A20),0, SUMIFS(Registros!F:F,Registros!A:A,\"<\"&fecha_inicial,Registros!B:B,\"=\"&'4000'!A20)) - IF(ISBLANK(A20),0, SUMIFS(Registros!E:E,Registros!A:A,\"<\"&fecha_inicial,Registros!B:B,\"=\"&'4000'!A20))","v":0},{"$f":"IF(ISBLANK(A20), 0, SUMIFS(Registros!E:E, Registros!A:A, \">=\" & fecha_inicial, Registros!A:A, \"<=\" & fecha_final,  Registros!B:B, \"=\" & '4000'!A20))","v":0},{"$f":"IF(ISBLANK(A20), 0, SUMIFS(Registros!F:F, Registros!A:A, \">=\" & fecha_inicial, Registros!A:A, \"<=\" & fecha_final,  Registros!B:B, \"=\" & '4000'!A20))","v":0},0]
[4110,"Código de Cuenta Incorrecto",{"$f":"IF(ISBLANK(A21),0, SUMIFS(Registros!F:F,Registros!A:A,\"<\"&fecha_inicial,Registros!B:B,\"=\"&'4000'!A21)) - IF(ISBLANK(A21),0, SUMIFS(Registros!E:E,Registros!A:A,\"<\"&fecha_inicial,Registros!B:B,\"=\"&'4000'!A21))","v":0},{"$f":"IF(ISBLANK(A21), 0, SUMIFS(Registros!E:E, Registros!A:A, \">=\" & fecha_inicial, Registros!A:A, \"<=\" & fecha_final,  Registros!B:B, \"=\" & '4000'!A21))","v":0},{"$f":"IF(ISBLANK(A21), 0, SUMIFS(Registros!F:F, Registros!A:A, \">=\" & fecha_inicial, Registros!A:A, \"<=\" & fecha_final,  Registros!B:B, \"=\" & '4000'!A21))","v":0},0]
[4111,"Código de Cuenta Incorrecto",{"$f":"IF(ISBLANK(A22),0, SUMIFS(Registros!F:F,Registros!A:A,\"<\"&fecha_inicial,Registros!B:B,\"=\"&'4000'!A22)) - IF(ISBLANK(A22),0, SUMIFS(Registros!E:E,Registros!A:A,\"<\"&fecha_inicial,Registros!B:B,\"=\"&'4000'!A22))","v":0},{"$f":"IF(ISBLANK(A22), 0, SUMIFS(Registros!E:E, Registros!A:A, \">=\" & fecha_inicial, Registros!A:A, \"<=\" & fecha_final,  Registros!B:B, \"=\" & '4000'!A22))","v":0},{"$f":"IF(ISBLANK(A22), 0, SUMIFS(Registros!F:F, Registros!A:A, \">=\" & fecha_inicial, Registros!A:A, \"<=\" & fecha_final,  Registros!B:B, \"=\" & '4000'!A22))","v":0},0]
[4112,"Código de Cuenta Incorrecto",{"$f":"IF(ISBLANK(A23),0, SUMIFS(Registros!F:F,Registros!A:A,\"<\"&fecha_inicial,Registros!B:B,\"=\"&'4000'!A23)) - IF(ISBLANK(A23),0, SUMIFS(Registros!E:E,Registros!A:A,\"<\"&fecha_inicial,Registros!B:B,\"=\"&'4000'!A23))","v":0},{"$f":"IF(ISBLANK(A23), 0, SUMIFS(Registros!E:E, Registros!A:A, \">=\" & fecha_inicial, Registros!A:A, \"<=\" & fecha_final,  Registros!B:B, \"=\" & '4000'!A23))","v":0},{"$f":"IF(ISBLANK(A23), 0, SUMIFS(Registros!F:F, Registros!A:A, \">=\" & fecha_inicial, Registros!A:A, \"<=\" & fecha_final,  Registros!B:B, \"=\" & '4000'!A23))","v":0},0]
[4113,"Código de Cuenta Incorrecto",{"$f":"IF(ISBLANK(A24),0, SUMIFS(Registros!F:F,Registros!A:A,\"<\"&fecha_inicial,Registros!B:B,\"=\"&'4000'!A24)) - IF(ISBLANK(A24),0, SUMIFS(Registros!E:E,Registros!A:A,\"<\"&fecha_inicial,Registros!B:B,\"=\"&'4000'!A24))","v":0},{"$f":"IF(ISBLANK(A24), 0, SUMIFS(Registros!E:E, Registros!A:A, \">=\" & fecha_inicial, Registros!A:A, \"<=\" & fecha_final,  Registros!B:B, \"=\" & '4000'!A24))","v":0},{"$f":"IF(ISBLANK(A24), 0, SUMIFS(Registros!F:F, Registros!A:A, \">=\" & fecha_inicial, Registros!A:A, \"<=\" & fecha_final,  Registros!B:B, \"=\" & '4000'!A24))","v":0},0]
[4114,"Código de Cuenta Incorrecto",{"$f":"IF(ISBLANK(A25),0, SUMIFS(Registros!F:F,Registros!A:A,\"<\"&fecha_inicial,Registros!B:B,\"=\"&'4000'!A25)) - IF(ISBLANK(A25),0, SUMIFS(Registros!E:E,Registros!A:A,\"<\"&fecha_inicial,Registros!B:B,\"=\"&'4000'!A25))","v":0},{"$f":"IF(ISBLANK(A25), 0, SUMIFS(Registros!E:E, Registros!A:A, \">=\" & fecha_inicial, Registros!A:A, \"<=\" & fecha_final,  Registros!B:B, \"=\" & '4000'!A25))","v":0},{"$f":"IF(ISBLANK(A25), 0, SUMIFS(Registros!F:F, Registros!A:A, \">=\" & fecha_inicial, Registros!A:A, \"<=\" & fecha_final,  Registros!B:B, \"=\" & '4000'!A25))","v":0},0]
[4115,"Código de Cuenta Incorrecto",{"$f":"IF(ISBLANK(A26),0, SUMIFS(Registros!F:F,Registros!A:A,\"<\"&fecha_inicial,Registros!B:B,\"=\"&'4000'!A26)) - IF(ISBLANK(A26),0, SUMIFS(Registros!E:E,Registros!A:A,\"<\"&fecha_inicial,Registros!B:B,\"=\"&'4000'!A26))","v":0},{"$f":"IF(ISBLANK(A26), 0, SUMIFS(Registros!E:E, Registros!A:A, \">=\" & fecha_inicial, Registros!A:A, \"<=\" & fecha_final,  Registros!B:B, \"=\" & '4000'!A26))","v":0},{"$f":"IF(ISBLANK(A26), 0, SUMIFS(Registros!F:F, Registros!A:A, \">=\" & fecha_inicial, Registros!A:A, \"<=\" & fecha_final,  Registros!B:B, \"=\" & '4000'!A26))","v":0},0]
[4200,"VENTAS DE CREDITO",{"$f":"SUM(C28:C42)","v":0},{"$f":"SUM(D28:D42)","v":0},{"$f":"SUM(E28:E42)","v":0},0]
[4201,"VENTA DE MERCANCÍAS AL CRÉDITO",{"$f":"IF(ISBLANK(A28),0, SUMIFS(Registros!F:F,Registros!A:A,\"<\"&fecha_inicial,Registros!B:B,\"=\"&'4000'!A28)) - IF(ISBLANK(A28),0, SUMIFS(Registros!E:E,Registros!A:A,\"<\"&fecha_inicial,Registros!B:B,\"=\"&'4000'!A28))","v":0},{"$f":"IF(ISBLANK(A28), 0, SUMIFS(Registros!E:E, Registros!A:A, \">=\" & fecha_inicial, Registros!A:A, \"<=\" & fecha_final,  Registros!B:B, \"=\" & '4000'!A28))","v":0},{"$f":"IF(ISBLANK(A28), 0, SUMIFS(Registros!F:F, Registros!A:A, \">=\" & fecha_inicial, Registros!A:A, \"<=\" & fecha_final,  Registros!B:B, \"=\" & '4000'!A28))","v":0},0]
[4202,"OTROS INGRESOS",{"$f":"IF(ISBLANK(A29),0, SUMIFS(Registros!F:F,Registros!A:A,\"<\"&fecha_inicial,Registros!B:B,\"=\"&'4000'!A29)) - IF(ISBLANK(A29),0, SUMIFS(Registros!E:E,Registros!A:A,\"<\"&fecha_inicial,Registros!B:B,\"=\"&'4000'!A29))","v":0},{"$f":"IF(ISBLANK(A29), 0, SUMIFS(Registros!E:E, Registros!A:A, \">=\" & fecha_inicial, Registros!A:A, \"<=\" & fecha_final,  Registros!B:B, \"=\" & '4000'!A29))","v":0},{"$f":"IF(ISBLANK(A29), 0, SUMIFS(Registros!F:F, Registros!A:A, \">=\" & fecha_inicial, Registros!A:A, \"<=\" & fecha_final,  Registros!B:B, \"=\" & '4000'!A29))","v":0},0]
[4203,"Código de Cuenta Incorrecto",{"$f":"IF(ISBLANK(A30),0, SUMIFS(Registros!F:F,Registros!A:A,\"<\"&fecha_inicial,Registros!B:B,\"=\"&'4000'!A30)) - IF(ISBLANK(A30),0, SUMIFS(Registros!E:E,Registros!A:A,\"<\"&fecha_inicial,Registros!B:B,\"=\"&'4000'!A30))","v":0},{"$f":"IF(ISBLANK(A30), 0, SUMIFS(Registros!E:E, Registros!A:A, \">=\" & fecha_inicial, Registros!A:A, \"<=\" & fecha_final,  Registros!B:B, \"=\" & '4000'!A30))","v":0},{"$f":"IF(ISBLANK(A30), 0, SUMIFS(Registros!F:F, Registros!A:A, \">=\" & fecha_inicial, Registros!A:A, \"<=\" & fecha_final,  Registros!B:B, \"=\" & '4000'!A30))","v":0},0]
[4204,"Código de Cuenta Incorrecto",{"$f":"IF(ISBLANK(A31),0, SUMIFS(Registros!F:F,Registros!A:A,\"<\"&fecha_inicial,Registros!B:B,\"=\"&'4000'!A31)) - IF(ISBLANK(A31),0, SUMIFS(Registros!E:E,Registros!A:A,\"<\"&fecha_inicial,Registros!B:B,\"=\"&'4000'!A31))","v":0},{"$f":"IF(ISBLANK(A31), 0, SUMIFS(Registros!E:E, Registros!A:A, \">=\" & fecha_inicial, Registros!A:A, \"<=\" & fecha_final,  Registros!B:B, \"=\" & '4000'!A31))","v":0},{"$f":"IF(ISBLANK(A31), 0, SUMIFS(Registros!F:F, Registros!A:A, \">=\" & fecha_inicial, Registros!A:A, \"<=\" & fecha_final,  Registros!B:B, \"=\" & '4000'!A31))","v":0},0]
[4205,"Código de Cuenta Incorrecto",{"$f":"IF(ISBLANK(A32),0, SUMIFS(Registros!F:F,Registros!A:A,\"<\"&fecha_inicial,Registros!B:B,\"=\"&'4000'!A32)) - IF(ISBLANK(A32),0, SUMIFS(Registros!E:E,Registros!A:A,\"<\"&fecha_inicial,Registros!B:B,\"=\"&'4000'!A32))","v":0},{"$f":"IF(ISBLANK(A32), 0, SUMIFS(Registros!E:E, Registros!A:A, \">=\" & fecha_inicial, Registros!A:A, \"<=\" & fecha_final,  Registros!B:B, \"=\" & '4000'!A32))","v":0},{"$f":"IF(ISBLANK(A32), 0, SUMIFS(Registros!F:F, Registros!A:A, \">=\" & fecha_inicial, Registros!A:A, \"<=\" & fecha_final,  Registros!B:B, \"=\" & '4000'!A32))","v":0},0]
[4206,"Código de Cuenta Incorrecto",{"$f":"IF(ISBLANK(A33),0, SUMIFS(Registros!F:F,Registros!A:A,\"<\"&fecha_inicial,Registros!B:B,\"=\"&'4000'!A33)) - IF(ISBLANK(A33),0, SUMIFS(Registros!E:E,Registros!A:A,\"<\"&fecha_inicial,Registros!B:B,\"=\"&'4000'!A33))","v":0},{"$f":"IF(ISBLANK(A33), 0, SUMIFS(Registros!E:E, Registros!A:A, \">=\" & fecha_inicial, Registros!A:A, \"<=\" & fecha_final,  Registros!B:B, \"=\" & '4000'!A33))","v":0},{"$f":"IF(ISBLANK(A33), 0, SUMIFS(Registros!F:F, Registros!A:A, \">=\" & fecha_inicial, Registros!A:A, \"<=\" & fecha_final,  Registros!B:B, \"=\" & '4000'!A33))","v":0},0]
[4207,"Código de Cuenta Incorrecto",{"$f":"IF(ISBLANK(A34),0, SUMIFS(Registros!F:F,Registros!A:A,\"<\"&fecha_inicial,Registros!B:B,\"=\"&'4000'!A34)) - IF(ISBLANK(A34),0, SUMIFS(Registros!E:E,Registros!A:A,\"<\"&fecha_inicial,Registros!B:B,\"=\"&'4000'!A34))","v":0},{"$f":"IF(ISBLANK(A34), 0, SUMIFS(Registros!E:E, Registros!A:A, \">=\" & fecha_inicial, Registros!A:A, \"<=\" & fecha_final,  Registros!B:B, \"=\" & '4000'!A34))","v":0},{"$f":"IF(ISBLANK(A34), 0, SUMIFS(Registros!F:F, Registros!A:A, \">=\" & fecha_inicial, Registros!A:A, \"<=\" & fecha_final,  Registros!B:B, \"=\" & '4000'!A34))","v":0},0]
[4208,"Código de Cuenta Incorrecto",{"$f":"IF(ISBLANK(A35),0, SUMIFS(Registros!F:F,Registros!A:A,\"<\"&fecha_inicial,Registros!B:B,\"=\"&'4000'!A35)) - IF(ISBLANK(A35),0, SUMIFS(Registros!E:E,Registros!A:A,\"<\"&fecha_inicial,Registros!B:B,\"=\"&'4000'!A35))","v":0},{"$f":"IF(ISBLANK(A35), 0, SUMIFS(Registros!E:E, Registros!A:A, \">=\" & fecha_inicial, Registros!A:A, \"<=\" & fecha_final,  Registros!B:B, \"=\" & '4000'!A35))","v":0},{"$f":"IF(ISBLANK(A35), 0, SUMIFS(Registros!F:F, Registros!A:A, \">=\" & fecha_inicial, Registros!A:A, \"<=\" & fecha_final,  Registros!B:B, \"=\" & '4000'!A35))","v":0},0]
[4209,"Código de Cuenta Incorrecto",{"$f":"IF(ISBLANK(A36),0, SUMIFS(Registros!F:F,Registros!A:A,\"<\"&fecha_inicial,Registros!B:B,\"=\"&'4000'!A36)) - IF(ISBLANK(A36),0, SUMIFS(Registros!E:E,Registros!A:A,\"<\"&fecha_inicial,Registros!B:B,\"=\"&'4000'!A36))","v":0},{"$f":"IF(ISBLANK(A36), 0, SUMIFS(Registros!E:E, Registros!A:A, \">=\" & fecha_inicial, Registros!A:A, \"<=\" & fecha_final,  Registros!B:B, \"=\" & '4000'!A36))","v":0},{"$f":"IF(ISBLANK(A36), 0, SUMIFS(Registros!F:F, Registros!A:A, \">=\" & fecha_inicial, Registros!A:A, \"<=\" & fecha_final,  Registros!B:B, \"=\" & '4000'!A36))","v":0},0]
[4210,"Código de Cuenta Incorrecto",{"$f":"IF(ISBLANK(A37),0, SUMIFS(Registros!F:F,Registros!A:A,\"<\"&fecha_inicial,Registros!B:B,\"=\"&'4000'!A37)) - IF(ISBLANK(A37),0, SUMIFS(Registros!E:E,Registros!A:A,\"<\"&fecha_inicial,Registros!B:B,\"=\"&'4000'!A37))","v":0},{"$f":"IF(ISBLANK(A37), 0, SUMIFS(Registros!E:E, Registros!A:A, \">=\" & fecha_inicial, Registros!A:A, \"<=\" & fecha_final,  Registros!B:B, \"=\" & '4000'!A37))","v":0},{"$f":"IF(ISBLANK(A37), 0, SUMIFS(Registros!F:F, Registros!A:A, \">=\" & fecha_inicial, Registros!A:A, \"<=\" & fecha_final,  Registros!B:B, \"=\" & '4000'!A37))","v":0},0]
[4211,"Código de Cuenta Incorrecto",{"$f":"IF(ISBLANK(A38),0, SUMIFS(Registros!F:F,Registros!A:A,\"<\"&fecha_inicial,Registros!B:B,\"=\"&'4000'!A38)) - IF(ISBLANK(A38),0, SUMIFS(Registros!E:E,Registros!A:A,\"<\"&fecha_inicial,Registros!B:B,\"=\"&'4000'!A38))","v":0},{"$f":"IF(ISBLANK(A38), 0, SUMIFS(Registros!E:E, Registros!A:A, \">=\" & fecha_inicial, Registros!A:A, \"<=\" & fecha_final,  Registros!B:B, \"=\" & '4000'!A38))","v":0},{"$f":"IF(ISBLANK(A38), 0, SUMIFS(Registros!F:F, Registros!A:A, \">=\" & fecha_inicial, Registros!A:A, \"<=\" & fecha_final,  Registros!B:B, \"=\" & '4000'!A38))","v":0},0]
[4212,"Código de Cuenta Incorrecto",{"$f":"IF(ISBLANK(A39),0, SUMIFS(Registros!F:F,Registros!A:A,\"<\"&fecha_inicial,Registros!B:B,\"=\"&'4000'!A39)) - IF(ISBLANK(A39),0, SUMIFS(Registros!E:E,Registros!A:A,\"<\"&fecha_inicial,Registros!B:B,\"=\"&'4000'!A39))","v":0},{"$f":"IF(ISBLANK(A39), 0, SUMIFS(Registros!E:E, Registros!A:A, \">=\" & fecha_inicial, Registros!A:A, \"<=\" & fecha_final,  Registros!B:B, \"=\" & '4000'!A39))","v":0},{"$f":"IF(ISBLANK(A39), 0, SUMIFS(Registros!F:F, Registros!A:A, \">=\" & fecha_inicial, Registros!A:A, \"<=\" & fecha_final,  Registros!B:B, \"=\" & '4000'!A39))","v":0},0]
[4213,"Código de Cuenta Incorrecto",{"$f":"IF(ISBLANK(A40),0, SUMIFS(Registros!F:F,Registros!A:A,\"<\"&fecha_inicial,Registros!B:B,\"=\"&'4000'!A40)) - IF(ISBLANK(A40),0, SUMIFS(Registros!E:E,Registros!A:A,\"<\"&fecha_inicial,Registros!B:B,\"=\"&'4000'!A40))","v":0},{"$f":"IF(ISBLANK(A40), 0, SUMIFS(Registros!E:E, Registros!A:A, \">=\" & fecha_inicial, Registros!A:A, \"<=\" & fecha_final,  Registros!B:B, \"=\" & '4000'!A40))","v":0},{"$f":"IF(ISBLANK(A40), 0, SUMIFS(Registros!F:F, Registros!A:A, \">=\" & fecha_inicial, Registros!A:A, \"<=\" & fecha_final,  Registros!B:B, \"=\" & '4000'!A40))","v":0},0]
[4214,"Código de Cuenta Incorrecto",{"$f":"IF(ISBLANK(A41),0, SUMIFS(Registros!F:F,Registros!A:A,\"<\"&fecha_inicial,Registros!B:B,\"=\"&'4000'!A41)) - IF(ISBLANK(A41),0, SUMIFS(Registros!E:E,Registros!A:A,\"<\"&fecha_inicial,Registros!B:B,\"=\"&'4000'!A41))","v":0},{"$f":"IF(ISBLANK(A41), 0, SUMIFS(Registros!E:E, Registros!A:A, \">=\" & fecha_inicial, Registros!A:A, \"<=\" & fecha_final,  Registros!B:B, \"=\" & '4000'!A41))","v":0},{"$f":"IF(ISBLANK(A41), 0, SUMIFS(Registros!F:F, Registros!A:A, \">=\" & fecha_inicial, Registros!A:A, \"<=\" & fecha_final,  Registros!B:B, \"=\" & '4000'!A41))","v":0},0]
[4215,"Código de Cuenta Incorrecto",{"$f":"IF(ISBLANK(A42),0, SUMIFS(Registros!F:F,Registros!A:A,\"<\"&fecha_inicial,Registros!B:B,\"=\"&'4000'!A42)) - IF(ISBLANK(A42),0, SUMIFS(Registros!E:E,Registros!A:A,\"<\"&fecha_inicial,Registros!B:B,\"=\"&'4000'!A42))","v":0},{"$f":"IF(ISBLANK(A42), 0, SUMIFS(Registros!E:E, Registros!A:A, \">=\" & fecha_inicial, Registros!A:A, \"<=\" & fecha_final,  Registros!B:B, \"=\" & '4000'!A42))","v":0},{"$f":"IF(ISBLANK(A42), 0, SUMIFS(Registros!F:F, Registros!A:A, \">=\" & fecha_inicial, Registros!A:A, \"<=\" & fecha_final,  Registros!B:B, \"=\" & '4000'!A42))","v":0},0]
[4300,"Código de Cuenta Incorrecto",{"$f":"SUM(C44:C58)","v":0},{"$f":"SUM(D44:D58)","v":0},0,0]
[4301,"Código de Cuenta Incorrecto",{"$f":"IF(ISBLANK(A44),0, SUMIFS(Registros!F:F,Registros!A:A,\"<\"&fecha_inicial,Registros!B:B,\"=\"&'4000'!A44)) - IF(ISBLANK(A44),0, SUMIFS(Registros!E:E,Registros!A:A,\"<\"&fecha_inicial,Registros!B:B,\"=\"&'4000'!A44))","v":0},{"$f":"IF(ISBLANK(A44), 0, SUMIFS(Registros!E:E, Registros!A:A, \">=\" & fecha_inicial, Registros!A:A, \"<=\" & fecha_final,  Registros!B:B, \"=\" & '4000'!A44))","v":0},{"$f":"IF(ISBLANK(A44), 0, SUMIFS(Registros!F:F, Registros!A:A, \">=\" & fecha_inicial, Registros!A:A, \"<=\" & fecha_final,  Registros!B:B, \"=\" & '4000'!A44))","v":0},0]
[4302,"Código de Cuenta Incorrecto",{"$f":"IF(ISBLANK(A45),0, SUMIFS(Registros!F:F,Registros!A:A,\"<\"&fecha_inicial,Registros!B:B,\"=\"&'4000'!A45)) - IF(ISBLANK(A45),0, SUMIFS(Registros!E:E,Registros!A:A,\"<\"&fecha_inicial,Registros!B:B,\"=\"&'4000'!A45))","v":0},{"$f":"IF(ISBLANK(A45), 0, SUMIFS(Registros!E:E, Registros!A:A, \">=\" & fecha_inicial, Registros!A:A, \"<=\" & fecha_final,  Registros!B:B, \"=\" & '4000'!A45))","v":0},{"$f":"IF(ISBLANK(A45), 0, SUMIFS(Registros!F:F, Registros!A:A, \">=\" & fecha_inicial, Registros!A:A, \"<=\" & fecha_final,  Registros!B:B, \"=\" & '4000'!A45))","v":0},0]
[4303,"Código de Cuenta Incorrecto",{"$f":"IF(ISBLANK(A46),0, SUMIFS(Registros!F:F,Registros!A:A,\"<\"&fecha_inicial,Registros!B:B,\"=\"&'4000'!A46)) - IF(ISBLANK(A46),0, SUMIFS(Registros!E:E,Registros!A:A,\"<\"&fecha_inicial,Registros!B:B,\"=\"&'4000'!A46))","v":0},{"$f":"IF(ISBLANK(A46), 0, SUMIFS(Registros!E:E, Registros!A:A, \">=\" & fecha_inicial, Registros!A:A, \"<=\" & fecha_final,  Registros!B:B, \"=\" & '4000'!A46))","v":0},{"$f":"IF(ISBLANK(A46), 0, SUMIFS(Registros!F:F, Registros!A:A, \">=\" & fecha_inicial, Registros!A:A, \"<=\" & fecha_final,  Registros!B:B, \"=\" & '4000'!A46))","v":0},0]
[4304,"Código de Cuenta Incorrecto",{"$f":"IF(ISBLANK(A47),0, SUMIFS(Registros!F:F,Registros!A:A,\"<\"&fecha_inicial,Registros!B:B,\"=\"&'4000'!A47)) - IF(ISBLANK(A47),0, SUMIFS(Registros!E:E,Registros!A:A,\"<\"&fecha_inicial,Registros!B:B,\"=\"&'4000'!A47))","v":0},{"$f":"IF(ISBLANK(A47), 0, SUMIFS(Registros!E:E, Registros!A:A, \">=\" & fecha_inicial, Registros!A:A, \"<=\" & fecha_final,  Registros!B:B, \"=\" & '4000'!A47))","v":0},{"$f":"IF(ISBLANK(A47), 0, SUMIFS(Registros!F:F, Registros!A:A, \">=\" & fecha_inicial, Registros!A:A, \"<=\" & fecha_final,  Registros!B:B, \"=\" & '4000'!A47))","v":0},0]
[4305,"Código de Cuenta Incorrecto",{"$f":"IF(ISBLANK(A48),0, SUMIFS(Registros!F:F,Registros!A:A,\"<\"&fecha_inicial,Registros!B:B,\"=\"&'4000'!A48)) - IF(ISBLANK(A48),0, SUMIFS(Registros!E:E,Registros!A:A,\"<\"&fecha_inicial,Registros!B:B,\"=\"&'4000'!A48))","v":0},{"$f":"IF(ISBLANK(A48), 0, SUMIFS(Registros!E:E, Registros!A:A, \">=\" & fecha_inicial, Registros!A:A, \"<=\" & fecha_final,  Registros!B:B, \"=\" & '4000'!A48))","v":0},{"$f":"IF(ISBLANK(A48), 0, SUMIFS(Registros!F:F, Registros!A:A, \">=\" & fecha_inicial, Registros!A:A, \"<=\" & fecha_final,  Registros!B:B, \"=\" & '4000'!A48))","v":0},0]
[4306,"Código de Cuenta Incorrecto",{"$f":"IF(ISBLANK(A49),0, SUMIFS(Registros!F:F,Registros!A:A,\"<\"&fecha_inicial,Registros!B:B,\"=\"&'4000'!A49)) - IF(ISBLANK(A49),0, SUMIFS(Registros!E:E,Registros!A:A,\"<\"&fecha_inicial,Registros!B:B,\"=\"&'4000'!A49))","v":0},{"$f":"IF(ISBLANK(A49), 0, SUMIFS(Registros!E:E, Registros!A:A, \">=\" & fecha_inicial, Registros!A:A, \"<=\" & fecha_final,  Registros!B:B, \"=\" & '4000'!A49))","v":0},{"$f":"IF(ISBLANK(A49), 0, SUMIFS(Registros!F:F, Registros!A:A, \">=\" & fecha_inicial, Registros!A:A, \"<=\" & fecha_final,  Registros!B:B, \"=\" & '4000'!A49))","v":0},0]
[4307,"Código de Cuenta Incorrecto",{"$f":"IF(ISBLANK(A50),0, SUMIFS(Registros!F:F,Registros!A:A,\"<\"&fecha_inicial,Registros!B:B,\"=\"&'4000'!A50)) - IF(ISBLANK(A50),0, SUMIFS(Registros!E:E,Registros!A:A,\"<\"&fecha_inicial,Registros!B:B,\"=\"&'4000'!A50))","v":0},{"$f":"IF(ISBLANK(A50), 0, SUMIFS(Registros!E:E, Registros!A:A, \">=\" & fecha_inicial, Registros!A:A, \"<=\" & fecha_final,  Registros!B:B, \"=\" & '4000'!A50))","v":0},{"$f":"IF(ISBLANK(A50), 0, SUMIFS(Registros!F:F, Registros!A:A, \">=\" & fecha_inicial, Registros!A:A, \"<=\" & fecha_final,  Registros!B:B, \"=\" & '4000'!A50))","v":0},0]
[4308,"Código de Cuenta Incorrecto",{"$f":"IF(ISBLANK(A51),0, SUMIFS(Registros!F:F,Registros!A:A,\"<\"&fecha_inicial,Registros!B:B,\"=\"&'4000'!A51)) - IF(ISBLANK(A51),0, SUMIFS(Registros!E:E,Registros!A:A,\"<\"&fecha_inicial,Registros!B:B,\"=\"&'4000'!A51))","v":0},{"$f":"IF(ISBLANK(A51), 0, SUMIFS(Registros!E:E, Registros!A:A, \">=\" & fecha_inicial, Registros!A:A, \"<=\" & fecha_final,  Registros!B:B, \"=\" & '4000'!A51))","v":0},{"$f":"IF(ISBLANK(A51), 0, SUMIFS(Registros!F:F, Registros!A:A, \">=\" & fecha_inicial, Registros!A:A, \"<=\" & fecha_final,  Registros!B:B, \"=\" & '4000'!A51))","v":0},0]
[4309,"Código de Cuenta Incorrecto",{"$f":"IF(ISBLANK(A52),0, SUMIFS(Registros!F:F,Registros!A:A,\"<\"&fecha_inicial,Registros!B:B,\"=\"&'4000'!A52)) - IF(ISBLANK(A52),0, SUMIFS(Registros!E:E,Registros!A:A,\"<\"&fecha_inicial,Registros!B:B,\"=\"&'4000'!A52))","v":0},{"$f":"IF(ISBLANK(A52), 0, SUMIFS(Registros!E:E, Registros!A:A, \">=\" & fecha_inicial, Registros!A:A, \"<=\" & fecha_final,  Registros!B:B, \"=\" & '4000'!A52))","v":0},{"$f":"IF(ISBLANK(A52), 0, SUMIFS(Registros!F:F, Registros!A:A, \">=\" & fecha_inicial, Registros!A:A, \"<=\" & fecha_final,  Registros!B:B, \"=\" & '4000'!A52))","v":0},0]
[4310,"Código de Cuenta Incorrecto",{"$f":"IF(ISBLANK(A53),0, SUMIFS(Registros!F:F,Registros!A:A,\"<\"&fecha_inicial,Registros!B:B,\"=\"&'4000'!A53)) - IF(ISBLANK(A53),0, SUMIFS(Registros!E:E,Registros!A:A,\"<\"&fecha_inicial,Registros!B:B,\"=\"&'4000'!A53))","v":0},{"$f":"IF(ISBLANK(A53), 0, SUMIFS(Registros!E:E, Registros!A:A, \">=\" & fecha_inicial, Registros!A:A, \"<=\" & fecha_final,  Registros!B:B, \"=\" & '4000'!A53))","v":0},{"$f":"IF(ISBLANK(A53), 0, SUMIFS(Registros!F:F, Registros!A:A, \">=\" & fecha_inicial, Registros!A:A, \"<=\" & fecha_final,  Registros!B:B, \"=\" & '4000'!A53))","v":0},0]
[4311,"Código de Cuenta Incorrecto",{"$f":"IF(ISBLANK(A54),0, SUMIFS(Registros!F:F,Registros!A:A,\"<\"&fecha_inicial,Registros!B:B,\"=\"&'4000'!A54)) - IF(ISBLANK(A54),0, SUMIFS(Registros!E:E,Registros!A:A,\"<\"&fecha_inicial,Registros!B:B,\"=\"&'4000'!A54))","v":0},{"$f":"IF(ISBLANK(A54), 0, SUMIFS(Registros!E:E, Registros!A:A, \">=\" & fecha_inicial, Registros!A:A, \"<=\" & fecha_final,  Registros!B:B, \"=\" & '4000'!A54))","v":0},{"$f":"IF(ISBLANK(A54), 0, SUMIFS(Registros!F:F, Registros!A:A, \">=\" & fecha_inicial, Registros!A:A, \"<=\" & fecha_final,  Registros!B:B, \"=\" & '4000'!A54))","v":0},0]
[4312,"Código de Cuenta Incorrecto",{"$f":"IF(ISBLANK(A55),0, SUMIFS(Registros!F:F,Registros!A:A,\"<\"&fecha_inicial,Registros!B:B,\"=\"&'4000'!A55)) - IF(ISBLANK(A55),0, SUMIFS(Registros!E:E,Registros!A:A,\"<\"&fecha_inicial,Registros!B:B,\"=\"&'4000'!A55))","v":0},{"$f":"IF(ISBLANK(A55), 0, SUMIFS(Registros!E:E, Registros!A:A, \">=\" & fecha_inicial, Registros!A:A, \"<=\" & fecha_final,  Registros!B:B, \"=\" & '4000'!A55))","v":0},{"$f":"IF(ISBLANK(A55), 0, SUMIFS(Registros!F:F, Registros!A:A, \">=\" & fecha_inicial, Registros!A:A, \"<=\" & fecha_final,  Registros!B:B, \"=\" & '4000'!A55))","v":0},0]
[4313,"Código de Cuenta Incorrecto",{"$f":"IF(ISBLANK(A56),0, SUMIFS(Registros!F:F,Registros!A:A,\"<\"&fecha_inicial,Registros!B:B,\"=\"&'4000'!A56)) - IF(ISBLANK(A56),0, SUMIFS(Registros!E:E,Registros!A:A,\"<\"&fecha_inicial,Registros!B:B,\"=\"&'4000'!A56))","v":0},{"$f":"IF(ISBLANK(A56), 0, SUMIFS(Registros!E:E, Registros!A:A, \">=\" & fecha_inicial, Registros!A:A, \"<=\" & fecha_final,  Registros!B:B, \"=\" & '4000'!A56))","v":0},{"$f":"IF(ISBLANK(A56), 0, SUMIFS(Registros!F:F, Registros!A:A, \">=\" & fecha_inicial, Registros!A:A, \"<=\" & fecha_final,  Registros!B:B, \"=\" & '4000'!A56))","v":0},0]
[4314,"Código de Cuenta Incorrecto",{"$f":"IF(ISBLANK(A57),0, SUMIFS(Registros!F:F,Registros!A:A,\"<\"&fecha_inicial,Registros!B:B,\"=\"&'4000'!A57)) - IF(ISBLANK(A57),0, SUMIFS(Registros!E:E,Registros!A:A,\"<\"&fecha_inicial,Registros!B:B,\"=\"&'4000'!A57))","v":0},{"$f":"IF(ISBLANK(A57), 0, SUMIFS(Registros!E:E, Registros!A:A, \">=\" & fecha_inicial, Registros!A:A, \"<=\" & fecha_final,  Registros!B:B, \"=\" & '4000'!A57))","v":0},{"$f":"IF(ISBLANK(A57), 0, SUMIFS(Registros!F:F, Registros!A:A, \">=\" & fecha_inicial, Registros!A:A, \"<=\" & fecha_final,  Registros!B:B, \"=\" & '4000'!A57))","v":0},0]
[4315,"Código de Cuenta Incorrecto",{"$f":"IF(ISBLANK(A58),0, SUMIFS(Registros!F:F,Registros!A:A,\"<\"&fecha_inicial,Registros!B:B,\"=\"&'4000'!A58)) - IF(ISBLANK(A58),0, SUMIFS(Registros!E:E,Registros!A:A,\"<\"&fecha_inicial,Registros!B:B,\"=\"&'4000'!A58))","v":0},{"$f":"IF(ISBLANK(A58), 0, SUMIFS(Registros!E:E, Registros!A:A, \">=\" & fecha_inicial, Registros!A:A, \"<=\" & fecha_final,  Registros!B:B, \"=\" & '4000'!A58))","v":0},{"$f":"IF(ISBLANK(A58), 0, SUMIFS(Registros!F:F, Registros!A:A, \">=\" & fecha_inicial, Registros!A:A, \"<=\" & fecha_final,  Registros!B:B, \"=\" & '4000'!A58))","v":0},0]
[4400,"Código de Cuenta Incorrecto",{"$f":"SUM(C60:C74)","v":0},{"$f":"SUM(D60:D74)","v":0},0,0]
[4401,"Código de Cuenta Incorrecto",{"$f":"IF(ISBLANK(A60),0, SUMIFS(Registros!F:F,Registros!A:A,\"<\"&fecha_inicial,Registros!B:B,\"=\"&'4000'!A60)) - IF(ISBLANK(A60),0, SUMIFS(Registros!E:E,Registros!A:A,\"<\"&fecha_inicial,Registros!B:B,\"=\"&'4000'!A60))","v":0},{"$f":"IF(ISBLANK(A60), 0, SUMIFS(Registros!E:E, Registros!A:A, \">=\" & fecha_inicial, Registros!A:A, \"<=\" & fecha_final,  Registros!B:B, \"=\" & '4000'!A60))","v":0},{"$f":"IF(ISBLANK(A60), 0, SUMIFS(Registros!F:F, Registros!A:A, \">=\" & fecha_inicial, Registros!A:A, \"<=\" & fecha_final,  Registros!B:B, \"=\" & '4000'!A60))","v":0},0]
[4402,"Código de Cuenta Incorrecto",{"$f":"IF(ISBLANK(A61),0, SUMIFS(Registros!F:F,Registros!A:A,\"<\"&fecha_inicial,Registros!B:B,\"=\"&'4000'!A61)) - IF(ISBLANK(A61),0, SUMIFS(Registros!E:E,Registros!A:A,\"<\"&fecha_inicial,Registros!B:B,\"=\"&'4000'!A61))","v":0},{"$f":"IF(ISBLANK(A61), 0, SUMIFS(Registros!E:E, Registros!A:A, \">=\" & fecha_inicial, Registros!A:A, \"<=\" & fecha_final,  Registros!B:B, \"=\" & '4000'!A61))","v":0},{"$f":"IF(ISBLANK(A61), 0, SUMIFS(Registros!F:F, Registros!A:A, \">=\" & fecha_inicial, Registros!A:A, \"<=\" & fecha_final,  Registros!B:B, \"=\" & '4000'!A61))","v":0},0]
[4403,"Código de Cuenta Incorrecto",{"$f":"IF(ISBLANK(A62),0, SUMIFS(Registros!F:F,Registros!A:A,\"<\"&fecha_inicial,Registros!B:B,\"=\"&'4000'!A62)) - IF(ISBLANK(A62),0, SUMIFS(Registros!E:E,Registros!A:A,\"<\"&fecha_inicial,Registros!B:B,\"=\"&'4000'!A62))","v":0},{"$f":"IF(ISBLANK(A62), 0, SUMIFS(Registros!E:E, Registros!A:A, \">=\" & fecha_inicial, Registros!A:A, \"<=\" & fecha_final,  Registros!B:B, \"=\" & '4000'!A62))","v":0},{"$f":"IF(ISBLANK(A62), 0, SUMIFS(Registros!F:F, Registros!A:A, \">=\" & fecha_inicial, Registros!A:A, \"<=\" & fecha_final,  Registros!B:B, \"=\" & '4000'!A62))","v":0},0]
[4404,"Código de Cuenta Incorrecto",{"$f":"IF(ISBLANK(A63),0, SUMIFS(Registros!F:F,Registros!A:A,\"<\"&fecha_inicial,Registros!B:B,\"=\"&'4000'!A63)) - IF(ISBLANK(A63),0, SUMIFS(Registros!E:E,Registros!A:A,\"<\"&fecha_inicial,Registros!B:B,\"=\"&'4000'!A63))","v":0},{"$f":"IF(ISBLANK(A63), 0, SUMIFS(Registros!E:E, Registros!A:A, \">=\" & fecha_inicial, Registros!A:A, \"<=\" & fecha_final,  Registros!B:B, \"=\" & '4000'!A63))","v":0},{"$f":"IF(ISBLANK(A63), 0, SUMIFS(Registros!F:F, Registros!A:A, \">=\" & fecha_inicial, Registros!A:A, \"<=\" & fecha_final,  Registros!B:B, \"=\" & '4000'!A63))","v":0},0]
[4405,"Código de Cuenta Incorrecto",{"$f":"IF(ISBLANK(A64),0, SUMIFS(Registros!F:F,Registros!A:A,\"<\"&fecha_inicial,Registros!B:B,\"=\"&'4000'!A64)) - IF(ISBLANK(A64),0, SUMIFS(Registros!E:E,Registros!A:A,\"<\"&fecha_inicial,Registros!B:B,\"=\"&'4000'!A64))","v":0},{"$f":"IF(ISBLANK(A64), 0, SUMIFS(Registros!E:E, Registros!A:A, \">=\" & fecha_inicial, Registros!A:A, \"<=\" & fecha_final,  Registros!B:B, \"=\" & '4000'!A64))","v":0},{"$f":"IF(ISBLANK(A64), 0, SUMIFS(Registros!F:F, Registros!A:A, \">=\" & fecha_inicial, Registros!A:A, \"<=\" & fecha_final,  Registros!B:B, \"=\" & '4000'!A64))","v":0},0]
[4406,"Código de Cuenta Incorrecto",{"$f":"IF(ISBLANK(A65),0, SUMIFS(Registros!F:F,Registros!A:A,\"<\"&fecha_inicial,Registros!B:B,\"=\"&'4000'!A65)) - IF(ISBLANK(A65),0, SUMIFS(Registros!E:E,Registros!A:A,\"<\"&fecha_inicial,Registros!B:B,\"=\"&'4000'!A65))","v":0},{"$f":"IF(ISBLANK(A65), 0, SUMIFS(Registros!E:E, Registros!A:A, \">=\" & fecha_inicial, Registros!A:A, \"<=\" & fecha_final,  Registros!B:B, \"=\" & '4000'!A65))","v":0},{"$f":"IF(ISBLANK(A65), 0, SUMIFS(Registros!F:F, Registros!A:A, \">=\" & fecha_inicial, Registros!A:A, \"<=\" & fecha_final,  Registros!B:B, \"=\" & '4000'!A65))","v":0},0]
[4407,"Código de Cuenta Incorrecto",{"$f":"IF(ISBLANK(A66),0, SUMIFS(Registros!F:F,Registros!A:A,\"<\"&fecha_inicial,Registros!B:B,\"=\"&'4000'!A66)) - IF(ISBLANK(A66),0, SUMIFS(Registros!E:E,Registros!A:A,\"<\"&fecha_inicial,Registros!B:B,\"=\"&'4000'!A66))","v":0},{"$f":"IF(ISBLANK(A66), 0, SUMIFS(Registros!E:E, Registros!A:A, \">=\" & fecha_inicial, Registros!A:A, \"<=\" & fecha_final,  Registros!B:B, \"=\" & '4000'!A66))","v":0},{"$f":"IF(ISBLANK(A66), 0, SUMIFS(Registros!F:F, Registros!A:A, \">=\" & fecha_inicial, Registros!A:A, \"<=\" & fecha_final,  Registros!B:B, \"=\" & '4000'!A66))","v":0},0]
[4408,"Código de Cuenta Incorrecto",{"$f":"IF(ISBLANK(A67),0, SUMIFS(Registros!F:F,Registros!A:A,\"<\"&fecha_inicial,Registros!B:B,\"=\"&'4000'!A67)) - IF(ISBLANK(A67),0, SUMIFS(Registros!E:E,Registros!A:A,\"<\"&fecha_inicial,Registros!B:B,\"=\"&'4000'!A67))","v":0},{"$f":"IF(ISBLANK(A67), 0, SUMIFS(Registros!E:E, Registros!A:A, \">=\" & fecha_inicial, Registros!A:A, \"<=\" & fecha_final,  Registros!B:B, \"=\" & '4000'!A67))","v":0},{"$f":"IF(ISBLANK(A67), 0, SUMIFS(Registros!F:F, Registros!A:A, \">=\" & fecha_inicial, Registros!A:A, \"<=\" & fecha_final,  Registros!B:B, \"=\" & '4000'!A67))","v":0},0]
[4409,"Código de Cuenta Incorrecto",{"$f":"IF(ISBLANK(A68),0, SUMIFS(Registros!F:F,Registros!A:A,\"<\"&fecha_inicial,Registros!B:B,\"=\"&'4000'!A68)) - IF(ISBLANK(A68),0, SUMIFS(Registros!E:E,Registros!A:A,\"<\"&fecha_inicial,Registros!B:B,\"=\"&'4000'!A68))","v":0},{"$f":"IF(ISBLANK(A68), 0, SUMIFS(Registros!E:E, Registros!A:A, \">=\" & fecha_inicial, Registros!A:A, \"<=\" & fecha_final,  Registros!B:B, \"=\" & '4000'!A68))","v":0},{"$f":"IF(ISBLANK(A68), 0, SUMIFS(Registros!F:F, Registros!A:A, \">=\" & fecha_inicial, Registros!A:A, \"<=\" & fecha_final,  Registros!B:B, \"=\" & '4000'!A68))","v":0},0]
[4410,"Código de Cuenta Incorrecto",{"$f":"IF(ISBLANK(A69),0, SUMIFS(Registros!F:F,Registros!A:A,\"<\"&fecha_inicial,Registros!B:B,\"=\"&'4000'!A69)) - IF(ISBLANK(A69),0, SUMIFS(Registros!E:E,Registros!A:A,\"<\"&fecha_inicial,Registros!B:B,\"=\"&'4000'!A69))","v":0},{"$f":"IF(ISBLANK(A69), 0, SUMIFS(Registros!E:E, Registros!A:A, \">=\" & fecha_inicial, Registros!A:A, \"<=\" & fecha_final,  Registros!B:B, \"=\" & '4000'!A69))","v":0},{"$f":"IF(ISBLANK(A69), 0, SUMIFS(Registros!F:F, Registros!A:A, \">=\" & fecha_inicial, Registros!A:A, \"<=\" & fecha_final,  Registros!B:B, \"=\" & '4000'!A69))","v":0},0]
[4411,"Código de Cuenta Incorrecto",{"$f":"IF(ISBLANK(A70),0, SUMIFS(Registros!F:F,Registros!A:A,\"<\"&fecha_inicial,Registros!B:B,\"=\"&'4000'!A70)) - IF(ISBLANK(A70),0, SUMIFS(Registros!E:E,Registros!A:A,\"<\"&fecha_inicial,Registros!B:B,\"=\"&'4000'!A70))","v":0},{"$f":"IF(ISBLANK(A70), 0, SUMIFS(Registros!E:E, Registros!A:A, \">=\" & fecha_inicial, Registros!A:A, \"<=\" & fecha_final,  Registros!B:B, \"=\" & '4000'!A70))","v":0},{"$f":"IF(ISBLANK(A70), 0, SUMIFS(Registros!F:F, Registros!A:A, \">=\" & fecha_inicial, Registros!A:A, \"<=\" & fecha_final,  Registros!B:B, \"=\" & '4000'!A70))","v":0},0]
[4412,"Código de Cuenta Incorrecto",{"$f":"IF(ISBLANK(A71),0, SUMIFS(Registros!F:F,Registros!A:A,\"<\"&fecha_inicial,Registros!B:B,\"=\"&'4000'!A71)) - IF(ISBLANK(A71),0, SUMIFS(Registros!E:E,Registros!A:A,\"<\"&fecha_inicial,Registros!B:B,\"=\"&'4000'!A71))","v":0},{"$f":"IF(ISBLANK(A71), 0, SUMIFS(Registros!E:E, Registros!A:A, \">=\" & fecha_inicial, Registros!A:A, \"<=\" & fecha_final,  Registros!B:B, \"=\" & '4000'!A71))","v":0},{"$f":"IF(ISBLANK(A71), 0, SUMIFS(Registros!F:F, Registros!A:A, \">=\" & fecha_inicial, Registros!A:A, \"<=\" & fecha_final,  Registros!B:B, \"=\" & '4000'!A71))","v":0},0]
[4413,"Código de Cuenta Incorrecto",{"$f":"IF(ISBLANK(A72),0, SUMIFS(Registros!F:F,Registros!A:A,\"<\"&fecha_inicial,Registros!B:B,\"=\"&'4000'!A72)) - IF(ISBLANK(A72),0, SUMIFS(Registros!E:E,Registros!A:A,\"<\"&fecha_inicial,Registros!B:B,\"=\"&'4000'!A72))","v":0},{"$f":"IF(ISBLANK(A72), 0, SUMIFS(Registros!E:E, Registros!A:A, \">=\" & fecha_inicial, Registros!A:A, \"<=\" & fecha_final,  Registros!B:B, \"=\" & '4000'!A72))","v":0},{"$f":"IF(ISBLANK(A72), 0, SUMIFS(Registros!F:F, Registros!A:A, \">=\" & fecha_inicial, Registros!A:A, \"<=\" & fecha_final,  Registros!B:B, \"=\" & '4000'!A72))","v":0},0]
[4414,"Código de Cuenta Incorrecto",{"$f":"IF(ISBLANK(A73),0, SUMIFS(Registros!F:F,Registros!A:A,\"<\"&fecha_inicial,Registros!B:B,\"=\"&'4000'!A73)) - IF(ISBLANK(A73),0, SUMIFS(Registros!E:E,Registros!A:A,\"<\"&fecha_inicial,Registros!B:B,\"=\"&'4000'!A73))","v":0},{"$f":"IF(ISBLANK(A73), 0, SUMIFS(Registros!E:E, Registros!A:A, \">=\" & fecha_inicial, Registros!A:A, \"<=\" & fecha_final,  Registros!B:B, \"=\" & '4000'!A73))","v":0},{"$f":"IF(ISBLANK(A73), 0, SUMIFS(Registros!F:F, Registros!A:A, \">=\" & fecha_inicial, Registros!A:A, \"<=\" & fecha_final,  Registros!B:B, \"=\" & '4000'!A73))","v":0},0]
[4415,"Código de Cuenta Incorrecto",{"$f":"IF(ISBLANK(A74),0, SUMIFS(Registros!F:F,Registros!A:A,\"<\"&fecha_inicial,Registros!B:B,\"=\"&'4000'!A74)) - IF(ISBLANK(A74),0, SUMIFS(Registros!E:E,Registros!A:A,\"<\"&fecha_inicial,Registros!B:B,\"=\"&'4000'!A74))","v":0},{"$f":"IF(ISBLANK(A74), 0, SUMIFS(Registros!E:E, Registros!A:A, \">=\" & fecha_inicial, Registros!A:A, \"<=\" & fecha_final,  Registros!B:B, \"=\" & '4000'!A74))","v":0},{"$f":"IF(ISBLANK(A74), 0, SUMIFS(Registros!F:F, Registros!A:A, \">=\" & fecha_inicial, Registros!A:A, \"<=\" & fecha_final,  Registros!B:B, \"=\" & '4000'!A74))","v":0},0]
[{"$f":"\"SALDO FINAL DE LA CUENTA AL \" &TEXT(fecha_final, \"dd\")&\" DE \"&UPPER(TEXT(fecha_final, \"MMMM\"))&\" DEL \"& TEXT(fecha_final, \"YYYY\")","v":"SALDO FINAL DE LA CUENTA AL 00 DE ENERO DEL 1900"},null,{"$f":"C11+C27+C43+C59","v":0},{"$f":"D11+D27+D43+D59","v":0},{"$f":"E11+E27+E43+E59","v":0},{"$f":"C75-D75+E75","v":0}]
[]
[]
[]
[]
["ELABORA",null,null,null,"REVISA"]
[{"$f":"VLOOKUP(A80, Usuarios!B12:E14, 2, FALSE)","v":"Arlen de Jesús Baltodano López"},null,null,null,{"$f":"VLOOKUP(E80, Usuarios!B12:E14, 2, FALSE)","v":"Gersan Arguello Prado"}]
[{"$f":"VLOOKUP(A80, Usuarios!B12:E14, 4, FALSE)","v":"Auxiliar de Contabilidad"},null,null,null,{"$f":"VLOOKUP(E80, Usuarios!B12:E14, 4, FALSE)","v":"Contador General"}]
[]
[]
[null,null,"AUTORIZA"]
[null,null,{"$f":"VLOOKUP(C85, Usuarios!B12:E14, 2, FALSE)","v":"Matilda Padilla Mayorga"}]
[null,null,{"$f":"VLOOKUP(C85, Usuarios!B12:E14, 4, FALSE)","v":"Gerente de Finanzas"}]

{"sheet":"5000","index":18,"n_rows":87,"n_cols":6,"rows_kept":87,"cut":false,"hidden":false,"merged":[[86,2,86,3],[80,0,80,1],[80,4,80,5],[81,0,81,1],[81,4,81,5],[84,2,84,3],[85,2,85,3],[7,5,8,5],[74,0,74,1],[78,0,78,1],[78,4,78,5],[79,0,79,1],[79,4,79,5],[7,0,8,0],[7,1,8,1],[7,2,8,2],[7,3,8,3],[7,4,8,4],[1,0,1,5],[2,0,2,5],[3,0,3,5],[4,0,4,5],[6,3,6,5]]}
[null,null,null,null,"Proteger"]
[{"$f":"nombre_empresa","v":"CONSULTORES DE OMETEPE"}]
[{"$f":"\"RESUMEN CONTABLE DE \"&B7","v":"RESUMEN CONTABLE DE COSTOS"}]
[{"$f":"\"DEL \"&TEXT(fecha_inicial, \"DD\")&\" DE \"&UPPER(TEXT(fecha_inicial, \"MMMM\"))&\" AL \"&TEXT(fecha_final, \"DD\")&\" DE \"&UPPER(TEXT(fecha_final, \"MMMM\"))&\" DE \"&TEXT(fecha_final, \"YYYY\")","v":"DEL 00 DE ENERO AL 00 DE ENERO DE 1900"}]
[{"$f":"direccion & \" *** Tel/Fax:  \" & tel_fax & \" *** \" & email","v":"Barrio el Progreso, San Jorge, Rivas. *** Tel/Fax:  89040457 *** escribeme@radioometepe.com"}]
[]
[5000,{"$f":"UPPER(IF(ISBLANK(A7),\"\",IFERROR(VLOOKUP(A7,plan_cuentas,2,FALSE),\"Código de cuenta incorrecto\")))","v":"COSTOS"},null,{"$f":"\"MOVIMIENTOS DE \"&UPPER(TEXT(fecha_final, \"MMMM\"))","v":"MOVIMIENTOS DE ENERO"}]
["CODIGO","NOMBRE DE LA CUENTA","SALDO INICIAL","DEBITOS","CREDITOS","SALDO FINAL"]
[]
[]
[5100,{"$f":"IF(A11<>\"\", IF(ISERROR(VLOOKUP(A11, plan_cuentas,2, FALSE)), \"Código de Cuenta Incorrecto\", UPPER(VLOOKUP(A11, plan_cuentas, 2, FALSE))), \"\")","v":"COSTO DE VENTAS"},{"$f":"SUM(C12:C26)","v":0},{"$f":"SUM(D12:D26)","v":0},0,{"$f":"C11+D11-E11","v":0}]
[5101,{"$f":"IF(A12<>\"\", IF(ISERROR(VLOOKUP(A12, plan_cuentas,2, FALSE)), \"Código de Cuenta Incorrecto\", UPPER(VLOOKUP(A12, plan_cuentas, 2, FALSE))), \"\")","v":"COSTO DE BIENES"},{"$f":"IF(ISBLANK(A12),0, SUMIFS(Registros!E:E,Registros!A:A,\"<\"&fecha_inicial,Registros!B:B,\"=\"&'5000'!A12)) - IF(ISBLANK(A12),0, SUMIFS(Registros!F:F,Registros!A:A,\"<\"&fecha_inicial,Registros!B:B,\"=\"&'5000'!A12))","v":0},{"$f":"IF(ISBLANK(A12), 0, SUMIFS(Registros!E:E, Registros!A:A, \">=\" & fecha_inicial, Registros!A:A, \"<=\" & fecha_final,  Registros!B:B, \"=\" & '5000'!A12))","v":0},{"$f":"IF(ISBLANK(A12), 0, SUMIFS(Registros!F:F, Registros!A:A, \">=\" & fecha_inicial, Registros!A:A, \"<=\" & fecha_final,  Registros!B:B, \"=\" & '5000'!A12))","v":0},{"$f":"C12+D12-E12","v":0}]
[5102,{"$f":"IF(A13<>0, IF(ISERROR(VLOOKUP(A13, plan_cuentas,2, FALSE)), \"Código de Cuenta Incorrecto\", UPPER(VLOOKUP(A13, plan_cuentas, 2, FALSE))), \"\")","v":"OTROS COSTOS"},{"$f":"IF(ISBLANK(A13),0, SUMIFS(Registros!E:E,Registros!A:A,\"<\"&fecha_inicial,Registros!B:B,\"=\"&'5000'!A13)) - IF(ISBLANK(A13),0, SUMIFS(Registros!F:F,Registros!A:A,\"<\"&fecha_inicial,Registros!B:B,\"=\"&'5000'!A13))","v":0},{"$f":"IF(ISBLANK(A13), 0, SUMIFS(Registros!E:E, Registros!A:A, \">=\" & fecha_inicial, Registros!A:A, \"<=\" & fecha_final,  Registros!B:B, \"=\" & '5000'!A13))","v":0},{"$f":"IF(ISBLANK(A13), 0, SUMIFS(Registros!F:F, Registros!A:A, \">=\" & fecha_inicial, Registros!A:A, \"<=\" & fecha_final,  Registros!B:B, \"=\" & '5000'!A13))","v":0},0]
[5103,"Código de Cuenta Incorrecto",{"$f":"IF(ISBLANK(A14),0, SUMIFS(Registros!E:E,Registros!A:A,\"<\"&fecha_inicial,Registros!B:B,\"=\"&'5000'!A14)) - IF(ISBLANK(A14),0, SUMIFS(Registros!F:F,Registros!A:A,\"<\"&fecha_inicial,Registros!B:B,\"=\"&'5000'!A14))","v":0},{"$f":"IF(ISBLANK(A14), 0, SUMIFS(Registros!E:E, Registros!A:A, \">=\" & fecha_inicial, Registros!A:A, \"<=\" & fecha_final,  Registros!B:B, \"=\" & '5000'!A14))","v":0},{"$f":"IF(ISBLANK(A14), 0, SUMIFS(Registros!F:F, Registros!A:A, \">=\" & fecha_inicial, Registros!A:A, \"<=\" & fecha_final,  Registros!B:B, \"=\" & '5000'!A14))","v":0},0]
[5104,"Código de Cuenta Incorrecto",{"$f":"IF(ISBLANK(A15),0, SUMIFS(Registros!E:E,Registros!A:A,\"<\"&fecha_inicial,Registros!B:B,\"=\"&'5000'!A15)) - IF(ISBLANK(A15),0, SUMIFS(Registros!F:F,Registros!A:A,\"<\"&fecha_inicial,Registros!B:B,\"=\"&'5000'!A15))","v":0},{"$f":"IF(ISBLANK(A15), 0, SUMIFS(Registros!E:E, Registros!A:A, \">=\" & fecha_inicial, Registros!A:A, \"<=\" & fecha_final,  Registros!B:B, \"=\" & '5000'!A15))","v":0},{"$f":"IF(ISBLANK(A15), 0, SUMIFS(Registros!F:F, Registros!A:A, \">=\" & fecha_inicial, Registros!A:A, \"<=\" & fecha_final,  Registros!B:B, \"=\" & '5000'!A15))","v":0},0]
[5105,"Código de Cuenta Incorrecto",{"$f":"IF(ISBLANK(A16),0, SUMIFS(Registros!E:E,Registros!A:A,\"<\"&fecha_inicial,Registros!B:B,\"=\"&'5000'!A16)) - IF(ISBLANK(A16),0, SUMIFS(Registros!F:F,Registros!A:A,\"<\"&fecha_inicial,Registros!B:B,\"=\"&'5000'!A16))","v":0},{"$f":"IF(ISBLANK(A16), 0, SUMIFS(Registros!E:E, Registros!A:A, \">=\" & fecha_inicial, Registros!A:A, \"<=\" & fecha_final,  Registros!B:B, \"=\" & '5000'!A16))","v":0},{"$f":"IF(ISBLANK(A16), 0, SUMIFS(Registros!F:F, Registros!A:A, \">=\" & fecha_inicial, Registros!A:A, \"<=\" & fecha_final,  Registros!B:B, \"=\" & '5000'!A16))","v":0},0]
[5106,"Código de Cuenta Incorrecto",{"$f":"IF(ISBLANK(A17),0, SUMIFS(Registros!E:E,Registros!A:A,\"<\"&fecha_inicial,Registros!B:B,\"=\"&'5000'!A17)) - IF(ISBLANK(A17),0, SUMIFS(Registros!F:F,Registros!A:A,\"<\"&fecha_inicial,Registros!B:B,\"=\"&'5000'!A17))","v":0},{"$f":"IF(ISBLANK(A17), 0, SUMIFS(Registros!E:E, Registros!A:A, \">=\" & fecha_inicial, Registros!A:A, \"<=\" & fecha_final,  Registros!B:B, \"=\" & '5000'!A17))","v":0},{"$f":"IF(ISBLANK(A17), 0, SUMIFS(Registros!F:F, Registros!A:A, \">=\" & fecha_inicial, Registros!A:A, \"<=\" & fecha_final,  Registros!B:B, \"=\" & '5000'!A17))","v":0},0]
[5107,"Código de Cuenta Incorrecto",{"$f":"IF(ISBLANK(A18),0, SUMIFS(Registros!E:E,Registros!A:A,\"<\"&fecha_inicial,Registros!B:B,\"=\"&'5000'!A18)) - IF(ISBLANK(A18),0, SUMIFS(Registros!F:F,Registros!A:A,\"<\"&fecha_inicial,Registros!B:B,\"=\"&'5000'!A18))","v":0},{"$f":"IF(ISBLANK(A18), 0, SUMIFS(Registros!E:E, Registros!A:A, \">=\" & fecha_inicial, Registros!A:A, \"<=\" & fecha_final,  Registros!B:B, \"=\" & '5000'!A18))","v":0},{"$f":"IF(ISBLANK(A18), 0, SUMIFS(Registros!F:F, Registros!A:A, \">=\" & fecha_inicial, Registros!A:A, \"<=\" & fecha_final,  Registros!B:B, \"=\" & '5000'!A18))","v":0},0]
[5108,"Código de Cuenta Incorrecto",{"$f":"IF(ISBLANK(A19),0, SUMIFS(Registros!E:E,Registros!A:A,\"<\"&fecha_inicial,Registros!B:B,\"=\"&'5000'!A19)) - IF(ISBLANK(A19),0, SUMIFS(Registros!F:F,Registros!A:A,\"<\"&fecha_inicial,Registros!B:B,\"=\"&'5000'!A19))","v":0},{"$f":"IF(ISBLANK(A19), 0, SUMIFS(Registros!E:E, Registros!A:A, \">=\" & fecha_inicial, Registros!A:A, \"<=\" & fecha_final,  Registros!B:B, \"=\" & '5000'!A19))","v":0},{"$f":"IF(ISBLANK(A19), 0, SUMIFS(Registros!F:F, Registros!A:A, \">=\" & fecha_inicial, Registros!A:A, \"<=\" & fecha_final,  Registros!B:B, \"=\" & '5000'!A19))","v":0},0]
[5109,"Código de Cuenta Incorrecto",{"$f":"IF(ISBLANK(A20),0, SUMIFS(Registros!E:E,Registros!A:A,\"<\"&fecha_inicial,Registros!B:B,\"=\"&'5000'!A20)) - IF(ISBLANK(A20),0, SUMIFS(Registros!F:F,Registros!A:A,\"<\"&fecha_inicial,Registros!B:B,\"=\"&'5000'!A20))","v":0},{"$f":"IF(ISBLANK(A20), 0, SUMIFS(Registros!E:E, Registros!A:A, \">=\" & fecha_inicial, Registros!A:A, \"<=\" & fecha_final,  Registros!B:B, \"=\" & '5000'!A20))","v":0},{"$f":"IF(ISBLANK(A20), 0, SUMIFS(Registros!F:F, Registros!A:A, \">=\" & fecha_inicial, Registros!A:A, \"<=\" & fecha_final,  Registros!B:B, \"=\" & '5000'!A20))","v":0},0]
[5110,"Código de Cuenta Incorrecto",{"$f":"IF(ISBLANK(A21),0, SUMIFS(Registros!E:E,Registros!A:A,\"<\"&fecha_inicial,Registros!B:B,\"=\"&'5000'!A21)) - IF(ISBLANK(A21),0, SUMIFS(Registros!F:F,Registros!A:A,\"<\"&fecha_inicial,Registros!B:B,\"=\"&'5000'!A21))","v":0},{"$f":"IF(ISBLANK(A21), 0, SUMIFS(Registros!E:E, Registros!A:A, \">=\" & fecha_inicial, Registros!A:A, \"<=\" & fecha_final,  Registros!B:B, \"=\" & '5000'!A21))","v":0},{"$f":"IF(ISBLANK(A21), 0, SUMIFS(Registros!F:F, Registros!A:A, \">=\" & fecha_inicial, Registros!A:A, \"<=\" & fecha_final,  Registros!B:B, \"=\" & '5000'!A21))","v":0},0]
[5111,"Código de Cuenta Incorrecto",{"$f":"IF(ISBLANK(A22),0, SUMIFS(Registros!E:E,Registros!A:A,\"<\"&fecha_inicial,Registros!B:B,\"=\"&'5000'!A22)) - IF(ISBLANK(A22),0, SUMIFS(Registros!F:F,Registros!A:A,\"<\"&fecha_inicial,Registros!B:B,\"=\"&'5000'!A22))","v":0},{"$f":"IF(ISBLANK(A22), 0, SUMIFS(Registros!E:E, Registros!A:A, \">=\" & fecha_inicial, Registros!A:A, \"<=\" & fecha_final,  Registros!B:B, \"=\" & '5000'!A22))","v":0},{"$f":"IF(ISBLANK(A22), 0, SUMIFS(Registros!F:F, Registros!A:A, \">=\" & fecha_inicial, Registros!A:A, \"<=\" & fecha_final,  Registros!B:B, \"=\" & '5000'!A22))","v":0},0]
[5112,"Código de Cuenta Incorrecto",{"$f":"IF(ISBLANK(A23),0, SUMIFS(Registros!E:E,Registros!A:A,\"<\"&fecha_inicial,Registros!B:B,\"=\"&'5000'!A23)) - IF(ISBLANK(A23),0, SUMIFS(Registros!F:F,Registros!A:A,\"<\"&fecha_inicial,Registros!B:B,\"=\"&'5000'!A23))","v":0},{"$f":"IF(ISBLANK(A23), 0, SUMIFS(Registros!E:E, Registros!A:A, \">=\" & fecha_inicial, Registros!A:A, \"<=\" & fecha_final,  Registros!B:B, \"=\" & '5000'!A23))","v":0},{"$f":"IF(ISBLANK(A23), 0, SUMIFS(Registros!F:F, Registros!A:A, \">=\" & fecha_inicial, Registros!A:A, \"<=\" & fecha_final,  Registros!B:B, \"=\" & '5000'!A23))","v":0},0]
[5113,"Código de Cuenta Incorrecto",{"$f":"IF(ISBLANK(A24),0, SUMIFS(Registros!E:E,Registros!A:A,\"<\"&fecha_inicial,Registros!B:B,\"=\"&'5000'!A24)) - IF(ISBLANK(A24),0, SUMIFS(Registros!F:F,Registros!A:A,\"<\"&fecha_inicial,Registros!B:B,\"=\"&'5000'!A24))","v":0},{"$f":"IF(ISBLANK(A24), 0, SUMIFS(Registros!E:E, Registros!A:A, \">=\" & fecha_inicial, Registros!A:A, \"<=\" & fecha_final,  Registros!B:B, \"=\" & '5000'!A24))","v":0},{"$f":"IF(ISBLANK(A24), 0, SUMIFS(Registros!F:F, Registros!A:A, \">=\" & fecha_inicial, Registros!A:A, \"<=\" & fecha_final,  Registros!B:B, \"=\" & '5000'!A24))","v":0},0]
[5114,"Código de Cuenta Incorrecto",{"$f":"IF(ISBLANK(A25),0, SUMIFS(Registros!E:E,Registros!A:A,\"<\"&fecha_inicial,Registros!B:B,\"=\"&'5000'!A25)) - IF(ISBLANK(A25),0, SUMIFS(Registros!F:F,Registros!A:A,\"<\"&fecha_inicial,Registros!B:B,\"=\"&'5000'!A25))","v":0},{"$f":"IF(ISBLANK(A25), 0, SUMIFS(Registros!E:E, Registros!A:A, \">=\" & fecha_inicial, Registros!A:A, \"<=\" & fecha_final,  Registros!B:B, \"=\" & '5000'!A25))","v":0},{"$f":"IF(ISBLANK(A25), 0, SUMIFS(Registros!F:F, Registros!A:A, \">=\" & fecha_inicial, Registros!A:A, \"<=\" & fecha_final,  Registros!B:B, \"=\" & '5000'!A25))","v":0},0]
[5115,"Código de Cuenta Incorrecto",{"$f":"IF(ISBLANK(A26),0, SUMIFS(Registros!E:E,Registros!A:A,\"<\"&fecha_inicial,Registros!B:B,\"=\"&'5000'!A26)) - IF(ISBLANK(A26),0, SUMIFS(Registros!F:F,Registros!A:A,\"<\"&fecha_inicial,Registros!B:B,\"=\"&'5000'!A26))","v":0},{"$f":"IF(ISBLANK(A26), 0, SUMIFS(Registros!E:E, Registros!A:A, \">=\" & fecha_inicial, Registros!A:A, \"<=\" & fecha_final,  Registros!B:B, \"=\" & '5000'!A26))","v":0},{"$f":"IF(ISBLANK(A26), 0, SUMIFS(Registros!F:F, Registros!A:A, \">=\" & fecha_inicial, Registros!A:A, \"<=\" & fecha_final,  Registros!B:B, \"=\" & '5000'!A26))","v":0},0]
[5200,"Código de Cuenta Incorrecto",{"$f":"SUM(C28:C42)","v":0},{"$f":"SUM(D28:D42)","v":0},{"$f":"SUM(E28:E42)","v":0},0]
[5201,"Código de Cuenta Incorrecto",{"$f":"IF(ISBLANK(A28),0, SUMIFS(Registros!E:E,Registros!A:A,\"<\"&fecha_inicial,Registros!B:B,\"=\"&'5000'!A28)) - IF(ISBLANK(A28),0, SUMIFS(Registros!F:F,Registros!A:A,\"<\"&fecha_inicial,Registros!B:B,\"=\"&'5000'!A28))","v":0},{"$f":"IF(ISBLANK(A28), 0, SUMIFS(Registros!E:E, Registros!A:A, \">=\" & fecha_inicial, Registros!A:A, \"<=\" & fecha_final,  Registros!B:B, \"=\" & '5000'!A28))","v":0},{"$f":"IF(ISBLANK(A28), 0, SUMIFS(Registros!F:F, Registros!A:A, \">=\" & fecha_inicial, Registros!A:A, \"<=\" & fecha_final,  Registros!B:B, \"=\" & '5000'!A28))","v":0},0]
[5202,"Código de Cuenta Incorrecto",{"$f":"IF(ISBLANK(A29),0, SUMIFS(Registros!E:E,Registros!A:A,\"<\"&fecha_inicial,Registros!B:B,\"=\"&'5000'!A29)) - IF(ISBLANK(A29),0, SUMIFS(Registros!F:F,Registros!A:A,\"<\"&fecha_inicial,Registros!B:B,\"=\"&'5000'!A29))","v":0},{"$f":"IF(ISBLANK(A29), 0, SUMIFS(Registros!E:E, Registros!A:A, \">=\" & fecha_inicial, Registros!A:A, \"<=\" & fecha_final,  Registros!B:B, \"=\" & '5000'!A29))","v":0},{"$f":"IF(ISBLANK(A29), 0, SUMIFS(Registros!F:F, Registros!A:A, \">=\" & fecha_inicial, Registros!A:A, \"<=\" & fecha_final,  Registros!B:B, \"=\" & '5000'!A29))","v":0},0]
[5203,"Código de Cuenta Incorrecto",{"$f":"IF(ISBLANK(A30),0, SUMIFS(Registros!E:E,Registros!A:A,\"<\"&fecha_inicial,Registros!B:B,\"=\"&'5000'!A30)) - IF(ISBLANK(A30),0, SUMIFS(Registros!F:F,Registros!A:A,\"<\"&fecha_inicial,Registros!B:B,\"=\"&'5000'!A30))","v":0},{"$f":"IF(ISBLANK(A30), 0, SUMIFS(Registros!E:E, Registros!A:A, \">=\" & fecha_inicial, Registros!A:A, \"<=\" & fecha_final,  Registros!B:B, \"=\" & '5000'!A30))","v":0},{"$f":"IF(ISBLANK(A30), 0, SUMIFS(Registros!F:F, Registros!A:A, \">=\" & fecha_inicial, Registros!A:A, \"<=\" & fecha_final,  Registros!B:B, \"=\" & '5000'!A30))","v":0},0]
[5204,"Código de Cuenta Incorrecto",{"$f":"IF(ISBLANK(A31),0, SUMIFS(Registros!E:E,Registros!A:A,\"<\"&fecha_inicial,Registros!B:B,\"=\"&'5000'!A31)) - IF(ISBLANK(A31),0, SUMIFS(Registros!F:F,Registros!A:A,\"<\"&fecha_inicial,Registros!B:B,\"=\"&'5000'!A31))","v":0},{"$f":"IF(ISBLANK(A31), 0, SUMIFS(Registros!E:E, Registros!A:A, \">=\" & fecha_inicial, Registros!A:A, \"<=\" & fecha_final,  Registros!B:B, \"=\" & '5000'!A31))","v":0},{"$f":"IF(ISBLANK(A31), 0, SUMIFS(Registros!F:F, Registros!A:A, \">=\" & fecha_inicial, Registros!A:A, \"<=\" & fecha_final,  Registros!B:B, \"=\" & '5000'!A31))","v":0},0]
[5205,"Código de Cuenta Incorrecto",{"$f":"IF(ISBLANK(A32),0, SUMIFS(Registros!E:E,Registros!A:A,\"<\"&fecha_inicial,Registros!B:B,\"=\"&'5000'!A32)) - IF(ISBLANK(A32),0, SUMIFS(Registros!F:F,Registros!A:A,\"<\"&fecha_inicial,Registros!B:B,\"=\"&'5000'!A32))","v":0},{"$f":"IF(ISBLANK(A32), 0, SUMIFS(Registros!E:E, Registros!A:A, \">=\" & fecha_inicial, Registros!A:A, \"<=\" & fecha_final,  Registros!B:B, \"=\" & '5000'!A32))","v":0},{"$f":"IF(ISBLANK(A32), 0, SUMIFS(Registros!F:F, Registros!A:A, \">=\" & fecha_inicial, Registros!A:A, \"<=\" & fecha_final,  Registros!B:B, \"=\" & '5000'!A32))","v":0},0]
[5206,"Código de Cuenta Incorrecto",{"$f":"IF(ISBLANK(A33),0, SUMIFS(Registros!E:E,Registros!A:A,\"<\"&fecha_inicial,Registros!B:B,\"=\"&'5000'!A33)) - IF(ISBLANK(A33),0, SUMIFS(Registros!F:F,Registros!A:A,\"<\"&fecha_inicial,Registros!B:B,\"=\"&'5000'!A33))","v":0},{"$f":"IF(ISBLANK(A33), 0, SUMIFS(Registros!E:E, Registros!A:A, \">=\" & fecha_inicial, Registros!A:A, \"<=\" & fecha_final,  Registros!B:B, \"=\" & '5000'!A33))","v":0},{"$f":"IF(ISBLANK(A33), 0, SUMIFS(Registros!F:F, Registros!A:A, \">=\" & fecha_inicial, Registros!A:A, \"<=\" & fecha_final,  Registros!B:B, \"=\" & '5000'!A33))","v":0},0]
[5207,"Código de Cuenta Incorrecto",{"$f":"IF(ISBLANK(A34),0, SUMIFS(Registros!E:E,Registros!A:A,\"<\"&fecha_inicial,Registros!B:B,\"=\"&'5000'!A34)) - IF(ISBLANK(A34),0, SUMIFS(Registros!F:F,Registros!A:A,\"<\"&fecha_inicial,Registros!B:B,\"=\"&'5000'!A34))","v":0},{"$f":"IF(ISBLANK(A34), 0, SUMIFS(Registros!E:E, Registros!A:A, \">=\" & fecha_inicial, Registros!A:A, \"<=\" & fecha_final,  Registros!B:B, \"=\" & '5000'!A34))","v":0},{"$f":"IF(ISBLANK(A34), 0, SUMIFS(Registros!F:F, Registros!A:A, \">=\" & fecha_inicial, Registros!A:A, \"<=\" & fecha_final,  Registros!B:B, \"=\" & '5000'!A34))","v":0},0]
[5208,"Código de Cuenta Incorrecto",{"$f":"IF(ISBLANK(A35),0, SUMIFS(Registros!E:E,Registros!A:A,\"<\"&fecha_inicial,Registros!B:B,\"=\"&'5000'!A35)) - IF(ISBLANK(A35),0, SUMIFS(Registros!F:F,Registros!A:A,\"<\"&fecha_inicial,Registros!B:B,\"=\"&'5000'!A35))","v":0},{"$f":"IF(ISBLANK(A35), 0, SUMIFS(Registros!E:E, Registros!A:A, \">=\" & fecha_inicial, Registros!A:A, \"<=\" & fecha_final,  Registros!B:B, \"=\" & '5000'!A35))","v":0},{"$f":"IF(ISBLANK(A35), 0, SUMIFS(Registros!F:F, Registros!A:A, \">=\" & fecha_inicial, Registros!A:A, \"<=\" & fecha_final,  Registros!B:B, \"=\" & '5000'!A35))","v":0},0]
[5209,"Código de Cuenta Incorrecto",{"$f":"IF(ISBLANK(A36),0, SUMIFS(Registros!E:E,Registros!A:A,\"<\"&fecha_inicial,Registros!B:B,\"=\"&'5000'!A36)) - IF(ISBLANK(A36),0, SUMIFS(Registros!F:F,Registros!A:A,\"<\"&fecha_inicial,Registros!B:B,\"=\"&'5000'!A36))","v":0},{"$f":"IF(ISBLANK(A36), 0, SUMIFS(Registros!E:E, Registros!A:A, \">=\" & fecha_inicial, Registros!A:A, \"<=\" & fecha_final,  Registros!B:B, \"=\" & '5000'!A36))","v":0},{"$f":"IF(ISBLANK(A36), 0, SUMIFS(Registros!F:F, Registros!A:A, \">=\" & fecha_inicial, Registros!A:A, \"<=\" & fecha_final,  Registros!B:B, \"=\" & '5000'!A36))","v":0},0]
[5210,"Código de Cuenta Incorrecto",{"$f":"IF(ISBLANK(A37),0, SUMIFS(Registros!E:E,Registros!A:A,\"<\"&fecha_inicial,Registros!B:B,\"=\"&'5000'!A37)) - IF(ISBLANK(A37),0, SUMIFS(Registros!F:F,Registros!A:A,\"<\"&fecha_inicial,Registros!B:B,\"=\"&'5000'!A37))","v":0},{"$f":"IF(ISBLANK(A37), 0, SUMIFS(Registros!E:E, Registros!A:A, \">=\" & fecha_inicial, Registros!A:A, \"<=\" & fecha_final,  Registros!B:B, \"=\" & '5000'!A37))","v":0},{"$f":"IF(ISBLANK(A37), 0, SUMIFS(Registros!F:F, Registros!A:A, \">=\" & fecha_inicial, Registros!A:A, \"<=\" & fecha_final,  Registros!B:B, \"=\" & '5000'!A37))","v":0},0]
[5211,"Código de Cuenta Incorrecto",{"$f":"IF(ISBLANK(A38),0, SUMIFS(Registros!E:E,Registros!A:A,\"<\"&fecha_inicial,Registros!B:B,\"=\"&'5000'!A38)) - IF(ISBLANK(A38),0, SUMIFS(Registros!F:F,Registros!A:A,\"<\"&fecha_inicial,Registros!B:B,\"=\"&'5000'!A38))","v":0},{"$f":"IF(ISBLANK(A38), 0, SUMIFS(Registros!E:E, Registros!A:A, \">=\" & fecha_inicial, Registros!A:A, \"<=\" & fecha_final,  Registros!B:B, \"=\" & '5000'!A38))","v":0},{"$f":"IF(ISBLANK(A38), 0, SUMIFS(Registros!F:F, Registros!A:A, \">=\" & fecha_inicial, Registros!A:A, \"<=\" & fecha_final,  Registros!B:B, \"=\" & '5000'!A38))","v":0},0]
[5212,"Código de Cuenta Incorrecto",{"$f":"IF(ISBLANK(A39),0, SUMIFS(Registros!E:E,Registros!A:A,\"<\"&fecha_inicial,Registros!B:B,\"=\"&'5000'!A39)) - IF(ISBLANK(A39),0, SUMIFS(Registros!F:F,Registros!A:A,\"<\"&fecha_inicial,Registros!B:B,\"=\"&'5000'!A39))","v":0},{"$f":"IF(ISBLANK(A39), 0, SUMIFS(Registros!E:E, Registros!A:A, \">=\" & fecha_inicial, Registros!A:A, \"<=\" & fecha_final,  Registros!B:B, \"=\" & '5000'!A39))","v":0},{"$f":"IF(ISBLANK(A39), 0, SUMIFS(Registros!F:F, Registros!A:A, \">=\" & fecha_inicial, Registros!A:A, \"<=\" & fecha_final,  Registros!B:B, \"=\" & '5000'!A39))","v":0},0]
[5213,"Código de Cuenta Incorrecto",{"$f":"IF(ISBLANK(A40),0, SUMIFS(Registros!E:E,Registros!A:A,\"<\"&fecha_inicial,Registros!B:B,\"=\"&'5000'!A40)) - IF(ISBLANK(A40),0, SUMIFS(Registros!F:F,Registros!A:A,\"<\"&fecha_inicial,Registros!B:B,\"=\"&'5000'!A40))","v":0},{"$f":"IF(ISBLANK(A40), 0, SUMIFS(Registros!E:E, Registros!A:A, \">=\" & fecha_inicial, Registros!A:A, \"<=\" & fecha_final,  Registros!B:B, \"=\" & '5000'!A40))","v":0},{"$f":"IF(ISBLANK(A40), 0, SUMIFS(Registros!F:F, Registros!A:A, \">=\" & fecha_inicial, Registros!A:A, \"<=\" & fecha_final,  Registros!B:B, \"=\" & '5000'!A40))","v":0},0]
[5214,"Código de Cuenta Incorrecto",{"$f":"IF(ISBLANK(A41),0, SUMIFS(Registros!E:E,Registros!A:A,\"<\"&fecha_inicial,Registros!B:B,\"=\"&'5000'!A41)) - IF(ISBLANK(A41),0, SUMIFS(Registros!F:F,Registros!A:A,\"<\"&fecha_inicial,Registros!B:B,\"=\"&'5000'!A41))","v":0},{"$f":"IF(ISBLANK(A41), 0, SUMIFS(Registros!E:E, Registros!A:A, \">=\" & fecha_inicial, Registros!A:A, \"<=\" & fecha_final,  Registros!B:B, \"=\" & '5000'!A41))","v":0},{"$f":"IF(ISBLANK(A41), 0, SUMIFS(Registros!F:F, Registros!A:A, \">=\" & fecha_inicial, Registros!A:A, \"<=\" & fecha_final,  Registros!B:B, \"=\" & '5000'!A41))","v":0},0]
[5215,"Código de Cuenta Incorrecto",{"$f":"IF(ISBLANK(A42),0, SUMIFS(Registros!E:E,Registros!A:A,\"<\"&fecha_inicial,Registros!B:B,\"=\"&'5000'!A42)) - IF(ISBLANK(A42),0, SUMIFS(Registros!F:F,Registros!A:A,\"<\"&fecha_inicial,Registros!B:B,\"=\"&'5000'!A42))","v":0},{"$f":"IF(ISBLANK(A42), 0, SUMIFS(Registros!E:E, Registros!A:A, \">=\" & fecha_inicial, Registros!A:A, \"<=\" & fecha_final,  Registros!B:B, \"=\" & '5000'!A42))","v":0},{"$f":"IF(ISBLANK(A42), 0, SUMIFS(Registros!F:F, Registros!A:A, \">=\" & fecha_inicial, Registros!A:A, \"<=\" & fecha_final,  Registros!B:B, \"=\" & '5000'!A42))","v":0},0]
[5300,"Código de Cuenta Incorrecto",{"$f":"SUM(C44:C58)","v":0},{"$f":"SUM(D44:D58)","v":0},0,0]
[5301,"Código de Cuenta Incorrecto",{"$f":"IF(ISBLANK(A44),0, SUMIFS(Registros!E:E,Registros!A:A,\"<\"&fecha_inicial,Registros!B:B,\"=\"&'5000'!A44)) - IF(ISBLANK(A44),0, SUMIFS(Registros!F:F,Registros!A:A,\"<\"&fecha_inicial,Registros!B:B,\"=\"&'5000'!A44))","v":0},{"$f":"IF(ISBLANK(A44), 0, SUMIFS(Registros!E:E, Registros!A:A, \">=\" & fecha_inicial, Registros!A:A, \"<=\" & fecha_final,  Registros!B:B, \"=\" & '5000'!A44))","v":0},{"$f":"IF(ISBLANK(A44), 0, SUMIFS(Registros!F:F, Registros!A:A, \">=\" & fecha_inicial, Registros!A:A, \"<=\" & fecha_final,  Registros!B:B, \"=\" & '5000'!A44))","v":0},0]
[5302,"Código de Cuenta Incorrecto",{"$f":"IF(ISBLANK(A45),0, SUMIFS(Registros!E:E,Registros!A:A,\"<\"&fecha_inicial,Registros!B:B,\"=\"&'5000'!A45)) - IF(ISBLANK(A45),0, SUMIFS(Registros!F:F,Registros!A:A,\"<\"&fecha_inicial,Registros!B:B,\"=\"&'5000'!A45))","v":0},{"$f":"IF(ISBLANK(A45), 0, SUMIFS(Registros!E:E, Registros!A:A, \">=\" & fecha_inicial, Registros!A:A, \"<=\" & fecha_final,  Registros!B:B, \"=\" & '5000'!A45))","v":0},{"$f":"IF(ISBLANK(A45), 0, SUMIFS(Registros!F:F, Registros!A:A, \">=\" & fecha_inicial, Registros!A:A, \"<=\" & fecha_final,  Registros!B:B, \"=\" & '5000'!A45))","v":0},0]
[5303,"Código de Cuenta Incorrecto",{"$f":"IF(ISBLANK(A46),0, SUMIFS(Registros!E:E,Registros!A:A,\"<\"&fecha_inicial,Registros!B:B,\"=\"&'5000'!A46)) - IF(ISBLANK(A46),0, SUMIFS(Registros!F:F,Registros!A:A,\"<\"&fecha_inicial,Registros!B:B,\"=\"&'5000'!A46))","v":0},{"$f":"IF(ISBLANK(A46), 0, SUMIFS(Registros!E:E, Registros!A:A, \">=\" & fecha_inicial, Registros!A:A, \"<=\" & fecha_final,  Registros!B:B, \"=\" & '5000'!A46))","v":0},{"$f":"IF(ISBLANK(A46), 0, SUMIFS(Registros!F:F, Registros!A:A, \">=\" & fecha_inicial, Registros!A:A, \"<=\" & fecha_final,  Registros!B:B, \"=\" & '5000'!A46))","v":0},0]
[5304,"Código de Cuenta Incorrecto",{"$f":"IF(ISBLANK(A47),0, SUMIFS(Registros!E:E,Registros!A:A,\"<\"&fecha_inicial,Registros!B:B,\"=\"&'5000'!A47)) - IF(ISBLANK(A47),0, SUMIFS(Registros!F:F,Registros!A:A,\"<\"&fecha_inicial,Registros!B:B,\"=\"&'5000'!A47))","v":0},{"$f":"IF(ISBLANK(A47), 0, SUMIFS(Registros!E:E, Registros!A:A, \">=\" & fecha_inicial, Registros!A:A, \"<=\" & fecha_final,  Registros!B:B, \"=\" & '5000'!A47))","v":0},{"$f":"IF(ISBLANK(A47), 0, SUMIFS(Registros!F:F, Registros!A:A, \">=\" & fecha_inicial, Registros!A:A, \"<=\" & fecha_final,  Registros!B:B, \"=\" & '5000'!A47))","v":0},0]
[5305,"Código de Cuenta Incorrecto",{"$f":"IF(ISBLANK(A48),0, SUMIFS(Registros!E:E,Registros!A:A,\"<\"&fecha_inicial,Registros!B:B,\"=\"&'5000'!A48)) - IF(ISBLANK(A48),0, SUMIFS(Registros!F:F,Registros!A:A,\"<\"&fecha_inicial,Registros!B:B,\"=\"&'5000'!A48))","v":0},{"$f":"IF(ISBLANK(A48), 0, SUMIFS(Registros!E:E, Registros!A:A, \">=\" & fecha_inicial, Registros!A:A, \"<=\" & fecha_final,  Registros!B:B, \"=\" & '5000'!A48))","v":0},{"$f":"IF(ISBLANK(A48), 0, SUMIFS(Registros!F:F, Registros!A:A, \">=\" & fecha_inicial, Registros!A:A, \"<=\" & fecha_final,  Registros!B:B, \"=\" & '5000'!A48))","v":0},0]
[5306,"Código de Cuenta Incorrecto",{"$f":"IF(ISBLANK(A49),0, SUMIFS(Registros!E:E,Registros!A:A,\"<\"&fecha_inicial,Registros!B:B,\"=\"&'5000'!A49)) - IF(ISBLANK(A49),0, SUMIFS(Registros!F:F,Registros!A:A,\"<\"&fecha_inicial,Registros!B:B,\"=\"&'5000'!A49))","v":0},{"$f":"IF(ISBLANK(A49), 0, SUMIFS(Registros!E:E, Registros!A:A, \">=\" & fecha_inicial, Registros!A:A, \"<=\" & fecha_final,  Registros!B:B, \"=\" & '5000'!A49))","v":0},{"$f":"IF(ISBLANK(A49), 0, SUMIFS(Registros!F:F, Registros!A:A, \">=\" & fecha_inicial, Registros!A:A, \"<=\" & fecha_final,  Registros!B:B, \"=\" & '5000'!A49))","v":0},0]
[5307,"Código de Cuenta Incorrecto",{"$f":"IF(ISBLANK(A50),0, SUMIFS(Registros!E:E,Registros!A:A,\"<\"&fecha_inicial,Registros!B:B,\"=\"&'5000'!A50)) - IF(ISBLANK(A50),0, SUMIFS(Registros!F:F,Registros!A:A,\"<\"&fecha_inicial,Registros!B:B,\"=\"&'5000'!A50))","v":0},{"$f":"IF(ISBLANK(A50), 0, SUMIFS(Registros!E:E, Registros!A:A, \">=\" & fecha_inicial, Registros!A:A, \"<=\" & fecha_final,  Registros!B:B, \"=\" & '5000'!A50))","v":0},{"$f":"IF(ISBLANK(A50), 0, SUMIFS(Registros!F:F, Registros!A:A, \">=\" & fecha_inicial, Registros!A:A, \"<=\" & fecha_final,  Registros!B:B, \"=\" & '5000'!A50))","v":0},0]
[5308,"Código de Cuenta Incorrecto",{"$f":"IF(ISBLANK(A51),0, SUMIFS(Registros!E:E,Registros!A:A,\"<\"&fecha_inicial,Registros!B:B,\"=\"&'5000'!A51)) - IF(ISBLANK(A51),0, SUMIFS(Registros!F:F,Registros!A:A,\"<\"&fecha_inicial,Registros!B:B,\"=\"&'5000'!A51))","v":0},{"$f":"IF(ISBLANK(A51), 0, SUMIFS(Registros!E:E, Registros!A:A, \">=\" & fecha_inicial, Registros!A:A, \"<=\" & fecha_final,  Registros!B:B, \"=\" & '5000'!A51))","v":0},{"$f":"IF(ISBLANK(A51), 0, SUMIFS(Registros!F:F, Registros!A:A, \">=\" & fecha_inicial, Registros!A:A, \"<=\" & fecha_final,  Registros!B:B, \"=\" & '5000'!A51))","v":0},0]
[5309,"Código de Cuenta Incorrecto",{"$f":"IF(ISBLANK(A52),0, SUMIFS(Registros!E:E,Registros!A:A,\"<\"&fecha_inicial,Registros!B:B,\"=\"&'5000'!A52)) - IF(ISBLANK(A52),0, SUMIFS(Registros!F:F,Registros!A:A,\"<\"&fecha_inicial,Registros!B:B,\"=\"&'5000'!A52))","v":0},{"$f":"IF(ISBLANK(A52), 0, SUMIFS(Registros!E:E, Registros!A:A, \">=\" & fecha_inicial, Registros!A:A, \"<=\" & fecha_final,  Registros!B:B, \"=\" & '5000'!A52))","v":0},{"$f":"IF(ISBLANK(A52), 0, SUMIFS(Registros!F:F, Registros!A:A, \">=\" & fecha_inicial, Registros!A:A, \"<=\" & fecha_final,  Registros!B:B, \"=\" & '5000'!A52))","v":0},0]
[5310,"Código de Cuenta Incorrecto",{"$f":"IF(ISBLANK(A53),0, SUMIFS(Registros!E:E,Registros!A:A,\"<\"&fecha_inicial,Registros!B:B,\"=\"&'5000'!A53)) - IF(ISBLANK(A53),0, SUMIFS(Registros!F:F,Registros!A:A,\"<\"&fecha_inicial,Registros!B:B,\"=\"&'5000'!A53))","v":0},{"$f":"IF(ISBLANK(A53), 0, SUMIFS(Registros!E:E, Registros!A:A, \">=\" & fecha_inicial, Registros!A:A, \"<=\" & fecha_final,  Registros!B:B, \"=\" & '5000'!A53))","v":0},{"$f":"IF(ISBLANK(A53), 0, SUMIFS(Registros!F:F, Registros!A:A, \">=\" & fecha_inicial, Registros!A:A, \"<=\" & fecha_final,  Registros!B:B, \"=\" & '5000'!A53))","v":0},0]
[5311,"Código de Cuenta Incorrecto",{"$f":"IF(ISBLANK(A54),0, SUMIFS(Registros!E:E,Registros!A:A,\"<\"&fecha_inicial,Registros!B:B,\"=\"&'5000'!A54)) - IF(ISBLANK(A54),0, SUMIFS(Registros!F:F,Registros!A:A,\"<\"&fecha_inicial,Registros!B:B,\"=\"&'5000'!A54))","v":0},{"$f":"IF(ISBLANK(A54), 0, SUMIFS(Registros!E:E, Registros!A:A, \">=\" & fecha_inicial, Registros!A:A, \"<=\" & fecha_final,  Registros!B:B, \"=\" & '5000'!A54))","v":0},{"$f":"IF(ISBLANK(A54), 0, SUMIFS(Registros!F:F, Registros!A:A, \">=\" & fecha_inicial, Registros!A:A, \"<=\" & fecha_final,  Registros!B:B, \"=\" & '5000'!A54))","v":0},0]
[5312,"Código de Cuenta Incorrecto",{"$f":"IF(ISBLANK(A55),0, SUMIFS(Registros!E:E,Registros!A:A,\"<\"&fecha_inicial,Registros!B:B,\"=\"&'5000'!A55)) - IF(ISBLANK(A55),0, SUMIFS(Registros!F:F,Registros!A:A,\"<\"&fecha_inicial,Registros!B:B,\"=\"&'5000'!A55))","v":0},{"$f":"IF(ISBLANK(A55), 0, SUMIFS(Registros!E:E, Registros!A:A, \">=\" & fecha_inicial, Registros!A:A, \"<=\" & fecha_final,  Registros!B:B, \"=\" & '5000'!A55))","v":0},{"$f":"IF(ISBLANK(A55), 0, SUMIFS(Registros!F:F, Registros!A:A, \">=\" & fecha_inicial, Registros!A:A, \"<=\" & fecha_final,  Registros!B:B, \"=\" & '5000'!A55))","v":0},0]
[5313,"Código de Cuenta Incorrecto",{"$f":"IF(ISBLANK(A56),0, SUMIFS(Registros!E:E,Registros!A:A,\"<\"&fecha_inicial,Registros!B:B,\"=\"&'5000'!A56)) - IF(ISBLANK(A56),0, SUMIFS(Registros!F:F,Registros!A:A,\"<\"&fecha_inicial,Registros!B:B,\"=\"&'5000'!A56))","v":0},{"$f":"IF(ISBLANK(A56), 0, SUMIFS(Registros!E:E, Registros!A:A, \">=\" & fecha_inicial, Registros!A:A, \"<=\" & fecha_final,  Registros!B:B, \"=\" & '5000'!A56))","v":0},{"$f":"IF(ISBLANK(A56), 0, SUMIFS(Registros!F:F, Registros!A:A, \">=\" & fecha_inicial, Registros!A:A, \"<=\" & fecha_final,  Registros!B:B, \"=\" & '5000'!A56))","v":0},0]
[5314,"Código de Cuenta Incorrecto",{"$f":"IF(ISBLANK(A57),0, SUMIFS(Registros!E:E,Registros!A:A,\"<\"&fecha_inicial,Registros!B:B,\"=\"&'5000'!A57)) - IF(ISBLANK(A57),0, SUMIFS(Registros!F:F,Registros!A:A,\"<\"&fecha_inicial,Registros!B:B,\"=\"&'5000'!A57))","v":0},{"$f":"IF(ISBLANK(A57), 0, SUMIFS(Registros!E:E, Registros!A:A, \">=\" & fecha_inicial, Registros!A:A, \"<=\" & fecha_final,  Registros!B:B, \"=\" & '5000'!A57))","v":0},{"$f":"IF(ISBLANK(A57), 0, SUMIFS(Registros!F:F, Registros!A:A, \">=\" & fecha_inicial, Registros!A:A, \"<=\" & fecha_final,  Registros!B:B, \"=\" & '5000'!A57))","v":0},0]
[5315,"Código de Cuenta Incorrecto",{"$f":"IF(ISBLANK(A58),0, SUMIFS(Registros!E:E,Registros!A:A,\"<\"&fecha_inicial,Registros!B:B,\"=\"&'5000'!A58)) - IF(ISBLANK(A58),0, SUMIFS(Registros!F:F,Registros!A:A,\"<\"&fecha_inicial,Registros!B:B,\"=\"&'5000'!A58))","v":0},{"$f":"IF(ISBLANK(A58), 0, SUMIFS(Registros!E:E, Registros!A:A, \">=\" & fecha_inicial, Registros!A:A, \"<=\" & fecha_final,  Registros!B:B, \"=\" & '5000'!A58))","v":0},{"$f":"IF(ISBLANK(A58), 0, SUMIFS(Registros!F:F, Registros!A:A, \">=\" & fecha_inicial, Registros!A:A, \"<=\" & fecha_final,  Registros!B:B, \"=\" & '5000'!A58))","v":0},0]
[5400,"Código de Cuenta Incorrecto",{"$f":"SUM(C60:C74)","v":0},{"$f":"SUM(D60:D74)","v":0},0,0]
[5401,"Código de Cuenta Incorrecto",{"$f":"IF(ISBLANK(A60),0, SUMIFS(Registros!E:E,Registros!A:A,\"<\"&fecha_inicial,Registros!B:B,\"=\"&'5000'!A60)) - IF(ISBLANK(A60),0, SUMIFS(Registros!F:F,Registros!A:A,\"<\"&fecha_inicial,Registros!B:B,\"=\"&'5000'!A60))","v":0},{"$f":"IF(ISBLANK(A60), 0, SUMIFS(Registros!E:E, Registros!A:A, \">=\" & fecha_inicial, Registros!A:A, \"<=\" & fecha_final,  Registros!B:B, \"=\" & '5000'!A60))","v":0},{"$f":"IF(ISBLANK(A60), 0, SUMIFS(Registros!F:F, Registros!A:A, \">=\" & fecha_inicial, Registros!A:A, \"<=\" & fecha_final,  Registros!B:B, \"=\" & '5000'!A60))","v":0},0]
[5402,"Código de Cuenta Incorrecto",{"$f":"IF(ISBLANK(A61),0, SUMIFS(Registros!E:E,Registros!A:A,\"<\"&fecha_inicial,Registros!B:B,\"=\"&'5000'!A61)) - IF(ISBLANK(A61),0, SUMIFS(Registros!F:F,Registros!A:A,\"<\"&fecha_inicial,Registros!B:B,\"=\"&'5000'!A61))","v":0},{"$f":"IF(ISBLANK(A61), 0, SUMIFS(Registros!E:E, Registros!A:A, \">=\" & fecha_inicial, Registros!A:A, \"<=\" & fecha_final,  Registros!B:B, \"=\" & '5000'!A61))","v":0},{"$f":"IF(ISBLANK(A61), 0, SUMIFS(Registros!F:F, Registros!A:A, \">=\" & fecha_inicial, Registros!A:A, \"<=\" & fecha_final,  Registros!B:B, \"=\" & '5000'!A61))","v":0},0]
[5403,"Código de Cuenta Incorrecto",{"$f":"IF(ISBLANK(A62),0, SUMIFS(Registros!E:E,Registros!A:A,\"<\"&fecha_inicial,Registros!B:B,\"=\"&'5000'!A62)) - IF(ISBLANK(A62),0, SUMIFS(Registros!F:F,Registros!A:A,\"<\"&fecha_inicial,Registros!B:B,\"=\"&'5000'!A62))","v":0},{"$f":"IF(ISBLANK(A62), 0, SUMIFS(Registros!E:E, Registros!A:A, \">=\" & fecha_inicial, Registros!A:A, \"<=\" & fecha_final,  Registros!B:B, \"=\" & '5000'!A62))","v":0},{"$f":"IF(ISBLANK(A62), 0, SUMIFS(Registros!F:F, Registros!A:A, \">=\" & fecha_inicial, Registros!A:A, \"<=\" & fecha_final,  Registros!B:B, \"=\" & '5000'!A62))","v":0},0]
[5404,"Código de Cuenta Incorrecto",{"$f":"IF(ISBLANK(A63),0, SUMIFS(Registros!E:E,Registros!A:A,\"<\"&fecha_inicial,Registros!B:B,\"=\"&'5000'!A63)) - IF(ISBLANK(A63),0, SUMIFS(Registros!F:F,Registros!A:A,\"<\"&fecha_inicial,Registros!B:B,\"=\"&'5000'!A63))","v":0},{"$f":"IF(ISBLANK(A63), 0, SUMIFS(Registros!E:E, Registros!A:A, \">=\" & fecha_inicial, Registros!A:A, \"<=\" & fecha_final,  Registros!B:B, \"=\" & '5000'!A63))","v":0},{"$f":"IF(ISBLANK(A63), 0, SUMIFS(Registros!F:F, Registros!A:A, \">=\" & fecha_inicial, Registros!A:A, \"<=\" & fecha_final,  Registros!B:B, \"=\" & '5000'!A63))","v":0},0]
[5405,"Código de Cuenta Incorrecto",{"$f":"IF(ISBLANK(A64),0, SUMIFS(Registros!E:E,Registros!A:A,\"<\"&fecha_inicial,Registros!B:B,\"=\"&'5000'!A64)) - IF(ISBLANK(A64),0, SUMIFS(Registros!F:F,Registros!A:A,\"<\"&fecha_inicial,Registros!B:B,\"=\"&'5000'!A64))","v":0},{"$f":"IF(ISBLANK(A64), 0, SUMIFS(Registros!E:E, Registros!A:A, \">=\" & fecha_inicial, Registros!A:A, \"<=\" & fecha_final,  Registros!B:B, \"=\" & '5000'!A64))","v":0},{"$f":"IF(ISBLANK(A64), 0, SUMIFS(Registros!F:F, Registros!A:A, \">=\" & fecha_inicial, Registros!A:A, \"<=\" & fecha_final,  Registros!B:B, \"=\" & '5000'!A64))","v":0},0]
[5406,"Código de Cuenta Incorrecto",{"$f":"IF(ISBLANK(A65),0, SUMIFS(Registros!E:E,Registros!A:A,\"<\"&fecha_inicial,Registros!B:B,\"=\"&'5000'!A65)) - IF(ISBLANK(A65),0, SUMIFS(Registros!F:F,Registros!A:A,\"<\"&fecha_inicial,Registros!B:B,\"=\"&'5000'!A65))","v":0},{"$f":"IF(ISBLANK(A65), 0, SUMIFS(Registros!E:E, Registros!A:A, \">=\" & fecha_inicial, Registros!A:A, \"<=\" & fecha_final,  Registros!B:B, \"=\" & '5000'!A65))","v":0},{"$f":"IF(ISBLANK(A65), 0, SUMIFS(Registros!F:F, Registros!A:A, \">=\" & fecha_inicial, Registros!A:A, \"<=\" & fecha_final,  Registros!B:B, \"=\" & '5000'!A65))","v":0},0]
[5407,"Código de Cuenta Incorrecto",{"$f":"IF(ISBLANK(A66),0, SUMIFS(Registros!E:E,Registros!A:A,\"<\"&fecha_inicial,Registros!B:B,\"=\"&'5000'!A66)) - IF(ISBLANK(A66),0, SUMIFS(Registros!F:F,Registros!A:A,\"<\"&fecha_inicial,Registros!B:B,\"=\"&'5000'!A66))","v":0},{"$f":"IF(ISBLANK(A66), 0, SUMIFS(Registros!E:E, Registros!A:A, \">=\" & fecha_inicial, Registros!A:A, \"<=\" & fecha_final,  Registros!B:B, \"=\" & '5000'!A66))","v":0},{"$f":"IF(ISBLANK(A66), 0, SUMIFS(Registros!F:F, Registros!A:A, \">=\" & fecha_inicial, Registros!A:A, \"<=\" & fecha_final,  Registros!B:B, \"=\" & '5000'!A66))","v":0},0]
[5408,"Código de Cuenta Incorrecto",{"$f":"IF(ISBLANK(A67),0, SUMIFS(Registros!E:E,Registros!A:A,\"<\"&fecha_inicial,Registros!B:B,\"=\"&'5000'!A67)) - IF(ISBLANK(A67),0, SUMIFS(Registros!F:F,Registros!A:A,\"<\"&fecha_inicial,Registros!B:B,\"=\"&'5000'!A67))","v":0},{"$f":"IF(ISBLANK(A67), 0, SUMIFS(Registros!E:E, Registros!A:A, \">=\" & fecha_inicial, Registros!A:A, \"<=\" & fecha_final,  Registros!B:B, \"=\" & '5000'!A67))","v":0},{"$f":"IF(ISBLANK(A67), 0, SUMIFS(Registros!F:F, Registros!A:A, \">=\" & fecha_inicial, Registros!A:A, \"<=\" & fecha_final,  Registros!B:B, \"=\" & '5000'!A67))","v":0},0]
[5409,"Código de Cuenta Incorrecto",{"$f":"IF(ISBLANK(A68),0, SUMIFS(Registros!E:E,Registros!A:A,\"<\"&fecha_inicial,Registros!B:B,\"=\"&'5000'!A68)) - IF(ISBLANK(A68),0, SUMIFS(Registros!F:F,Registros!A:A,\"<\"&fecha_inicial,Registros!B:B,\"=\"&'5000'!A68))","v":0},{"$f":"IF(ISBLANK(A68), 0, SUMIFS(Registros!E:E, Registros!A:A, \">=\" & fecha_inicial, Registros!A:A, \"<=\" & fecha_final,  Registros!B:B, \"=\" & '5000'!A68))","v":0},{"$f":"IF(ISBLANK(A68), 0, SUMIFS(Registros!F:F, Registros!A:A, \">=\" & fecha_inicial, Registros!A:A, \"<=\" & fecha_final,  Registros!B:B, \"=\" & '5000'!A68))","v":0},0]
[5410,"Código de Cuenta Incorrecto",{"$f":"IF(ISBLANK(A69),0, SUMIFS(Registros!E:E,Registros!A:A,\"<\"&fecha_inicial,Registros!B:B,\"=\"&'5000'!A69)) - IF(ISBLANK(A69),0, SUMIFS(Registros!F:F,Registros!A:A,\"<\"&fecha_inicial,Registros!B:B,\"=\"&'5000'!A69))","v":0},{"$f":"IF(ISBLANK(A69), 0, SUMIFS(Registros!E:E, Registros!A:A, \">=\" & fecha_inicial, Registros!A:A, \"<=\" & fecha_final,  Registros!B:B, \"=\" & '5000'!A69))","v":0},{"$f":"IF(ISBLANK(A69), 0, SUMIFS(Registros!F:F, Registros!A:A, \">=\" & fecha_inicial, Registros!A:A, \"<=\" & fecha_final,  Registros!B:B, \"=\" & '5000'!A69))","v":0},0]
[5411,"Código de Cuenta Incorrecto",{"$f":"IF(ISBLANK(A70),0, SUMIFS(Registros!E:E,Registros!A:A,\"<\"&fecha_inicial,Registros!B:B,\"=\"&'5000'!A70)) - IF(ISBLANK(A70),0, SUMIFS(Registros!F:F,Registros!A:A,\"<\"&fecha_inicial,Registros!B:B,\"=\"&'5000'!A70))","v":0},{"$f":"IF(ISBLANK(A70), 0, SUMIFS(Registros!E:E, Registros!A:A, \">=\" & fecha_inicial, Registros!A:A, \"<=\" & fecha_final,  Registros!B:B, \"=\" & '5000'!A70))","v":0},{"$f":"IF(ISBLANK(A70), 0, SUMIFS(Registros!F:F, Registros!A:A, \">=\" & fecha_inicial, Registros!A:A, \"<=\" & fecha_final,  Registros!B:B, \"=\" & '5000'!A70))","v":0},0]
[5412,"Código de Cuenta Incorrecto",{"$f":"IF(ISBLANK(A71),0, SUMIFS(Registros!E:E,Registros!A:A,\"<\"&fecha_inicial,Registros!B:B,\"=\"&'5000'!A71)) - IF(ISBLANK(A71),0, SUMIFS(Registros!F:F,Registros!A:A,\"<\"&fecha_inicial,Registros!B:B,\"=\"&'5000'!A71))","v":0},{"$f":"IF(ISBLANK(A71), 0, SUMIFS(Registros!E:E, Registros!A:A, \">=\" & fecha_inicial, Registros!A:A, \"<=\" & fecha_final,  Registros!B:B, \"=\" & '5000'!A71))","v":0},{"$f":"IF(ISBLANK(A71), 0, SUMIFS(Registros!F:F, Registros!A:A, \">=\" & fecha_inicial, Registros!A:A, \"<=\" & fecha_final,  Registros!B:B, \"=\" & '5000'!A71))","v":0},0]
[5413,"Código de Cuenta Incorrecto",{"$f":"IF(ISBLANK(A72),0, SUMIFS(Registros!E:E,Registros!A:A,\"<\"&fecha_inicial,Registros!B:B,\"=\"&'5000'!A72)) - IF(ISBLANK(A72),0, SUMIFS(Registros!F:F,Registros!A:A,\"<\"&fecha_inicial,Registros!B:B,\"=\"&'5000'!A72))","v":0},{"$f":"IF(ISBLANK(A72), 0, SUMIFS(Registros!E:E, Registros!A:A, \">=\" & fecha_inicial, Registros!A:A, \"<=\" & fecha_final,  Registros!B:B, \"=\" & '5000'!A72))","v":0},{"$f":"IF(ISBLANK(A72), 0, SUMIFS(Registros!F:F, Registros!A:A, \">=\" & fecha_inicial, Registros!A:A, \"<=\" & fecha_final,  Registros!B:B, \"=\" & '5000'!A72))","v":0},0]
[5414,"Código de Cuenta Incorrecto",{"$f":"IF(ISBLANK(A73),0, SUMIFS(Registros!E:E,Registros!A:A,\"<\"&fecha_inicial,Registros!B:B,\"=\"&'5000'!A73)) - IF(ISBLANK(A73),0, SUMIFS(Registros!F:F,Registros!A:A,\"<\"&fecha_inicial,Registros!B:B,\"=\"&'5000'!A73))","v":0},{"$f":"IF(ISBLANK(A73), 0, SUMIFS(Registros!E:E, Registros!A:A, \">=\" & fecha_inicial, Registros!A:A, \"<=\" & fecha_final,  Registros!B:B, \"=\" & '5000'!A73))","v":0},{"$f":"IF(ISBLANK(A73), 0, SUMIFS(Registros!F:F, Registros!A:A, \">=\" & fecha_inicial, Registros!A:A, \"<=\" & fecha_final,  Registros!B:B, \"=\" & '5000'!A73))","v":0},0]
[5415,"Código de Cuenta Incorrecto",{"$f":"IF(ISBLANK(A74),0, SUMIFS(Registros!E:E,Registros!A:A,\"<\"&fecha_inicial,Registros!B:B,\"=\"&'5000'!A74)) - IF(ISBLANK(A74),0, SUMIFS(Registros!F:F,Registros!A:A,\"<\"&fecha_inicial,Registros!B:B,\"=\"&'5000'!A74))","v":0},{"$f":"IF(ISBLANK(A74), 0, SUMIFS(Registros!E:E, Registros!A:A, \">=\" & fecha_inicial, Registros!A:A, \"<=\" & fecha_final,  Registros!B:B, \"=\" & '5000'!A74))","v":0},{"$f":"IF(ISBLANK(A74), 0, SUMIFS(Registros!F:F, Registros!A:A, \">=\" & fecha_inicial, Registros!A:A, \"<=\" & fecha_final,  Registros!B:B, \"=\" & '5000'!A74))","v":0},0]
[{"$f":"\"SALDO FINAL DE LA CUENTA AL \" &TEXT(fecha_final, \"dd\")&\" DE \"&UPPER(TEXT(fecha_final, \"MMMM\"))&\" DEL \"& TEXT(fecha_final, \"YYYY\")","v":"SALDO FINAL DE LA CUENTA AL 00 DE ENERO DEL 1900"},null,{"$f":"C11+C27+C43+C59","v":0},{"$f":"D11+D27+D43+D59","v":0},{"$f":"E11+E27+E43+E59","v":0},{"$f":"C75+D75-E75","v":0}]
[]
[]
[]
[]
["ELABORA",null,null,null,"REVISA"]
[{"$f":"VLOOKUP(A80, Usuarios!B12:E14, 2, FALSE)","v":"Arlen de Jesús Baltodano López"},null,null,null,{"$f":"VLOOKUP(E80, Usuarios!B12:E14, 2, FALSE)","v":"Gersan Arguello Prado"}]
[{"$f":"VLOOKUP(A80, Usuarios!B12:E14, 4, FALSE)","v":"Auxiliar de Contabilidad"},null,null,null,{"$f":"VLOOKUP(E80, Usuarios!B12:E14, 4, FALSE)","v":"Contador General"}]
[]
[]
[null,null,"AUTORIZA"]
[null,null,{"$f":"VLOOKUP(C85, Usuarios!B12:E14, 2, FALSE)","v":"Matilda Padilla Mayorga"}]
[null,null,{"$f":"VLOOKUP(C85, Usuarios!B12:E14, 4, FALSE)","v":"Gerente de Finanzas"}]

{"sheet":"6000","index":19,"n_rows":87,"n_cols":6,"rows_kept":87,"cut":false,"hidden":false,"merged":[[86,2,86,3],[80,0,80,1],[80,4,80,5],[81,0,81,1],[81,4,81,5],[84,2,84,3],[85,2,85,3],[7,5,8,5],[74,0,74,1],[78,0,78,1],[78,4,78,5],[79,0,79,1],[79,4,79,5],[7,0,8,0],[7,1,8,1],[7,2,8,2],[7,3,8,3],[7,4,8,4],[1,0,1,5],[2,0,2,5],[3,0,3,5],[4,0,4,5],[6,3,6,5]]}
[null,null,null,null,"Proteger"]
[{"$f":"nombre_empresa","v":"CONSULTORES DE OMETEPE"}]
[{"$f":"\"RESUMEN CONTABLE DE \"&B7","v":"RESUMEN CONTABLE DE GASTOS"}]
[{"$f":"\"DEL \"&TEXT(fecha_inicial, \"DD\")&\" DE \"&UPPER(TEXT(fecha_inicial, \"MMMM\"))&\" AL \"&TEXT(fecha_final, \"DD\")&\" DE \"&UPPER(TEXT(fecha_final, \"MMMM\"))&\" DE \"&TEXT(fecha_final, \"YYYY\")","v":"DEL 00 DE ENERO AL 00 DE ENERO DE 1900"}]
[{"$f":"direccion & \" *** Tel/Fax:  \" & tel_fax & \" *** \" & email","v":"Barrio el Progreso, San Jorge, Rivas. *** Tel/Fax:  89040457 *** escribeme@radioometepe.com"}]
[]
[6000,{"$f":"UPPER(IF(ISBLANK(A7),\"\",IFERROR(VLOOKUP(A7,plan_cuentas,2,FALSE),\"Código de cuenta incorrecto\")))","v":"GASTOS"},null,{"$f":"\"MOVIMIENTOS DE \"&UPPER(TEXT(fecha_final, \"MMMM\"))","v":"MOVIMIENTOS DE ENERO"}]
["CODIGO","NOMBRE DE LA CUENTA","SALDO INICIAL","DEBITOS","CREDITOS","SALDO FINAL"]
[]
[]
[6100,{"$f":"IF(A11<>\"\", IF(ISERROR(VLOOKUP(A11, plan_cuentas,2, FALSE)), \"Código de Cuenta Incorrecto\", UPPER(VLOOKUP(A11, plan_cuentas, 2, FALSE))), \"\")","v":"GASTOS OPERATIVOS"},{"$f":"SUM(C12:C26)","v":0},{"$f":"SUM(D12:D26)","v":0},0,{"$f":"C11+D11-E11","v":0}]
[6101,{"$f":"IF(A12<>\"\", IF(ISERROR(VLOOKUP(A12, plan_cuentas,2, FALSE)), \"Código de Cuenta Incorrecto\", UPPER(VLOOKUP(A12, plan_cuentas, 2, FALSE))), \"\")","v":"GASTOS DE ADMINISTRACIÓN"},{"$f":"IF(ISBLANK(A12),0, SUMIFS(Registros!E:E,Registros!A:A,\"<\"&fecha_inicial,Registros!B:B,\"=\"&'6000'!A12)) - IF(ISBLANK(A12),0, SUMIFS(Registros!F:F,Registros!A:A,\"<\"&fecha_inicial,Registros!B:B,\"=\"&'6000'!A12))","v":0},{"$f":"IF(ISBLANK(A12), 0, SUMIFS(Registros!E:E, Registros!A:A, \">=\" & fecha_inicial, Registros!A:A, \"<=\" & fecha_final,  Registros!B:B, \"=\" & '6000'!A12))","v":0},{"$f":"IF(ISBLANK(A12), 0, SUMIFS(Registros!F:F, Registros!A:A, \">=\" & fecha_inicial, Registros!A:A, \"<=\" & fecha_final,  Registros!B:B, \"=\" & '6000'!A12))","v":0},{"$f":"C12+D12-E12","v":0}]
[6102,{"$f":"IF(A13<>0, IF(ISERROR(VLOOKUP(A13, plan_cuentas,2, FALSE)), \"Código de Cuenta Incorrecto\", UPPER(VLOOKUP(A13, plan_cuentas, 2, FALSE))), \"\")","v":"GASTOS DE VENTAS"},{"$f":"IF(ISBLANK(A13),0, SUMIFS(Registros!E:E,Registros!A:A,\"<\"&fecha_inicial,Registros!B:B,\"=\"&'6000'!A13)) - IF(ISBLANK(A13),0, SUMIFS(Registros!F:F,Registros!A:A,\"<\"&fecha_inicial,Registros!B:B,\"=\"&'6000'!A13))","v":0},{"$f":"IF(ISBLANK(A13), 0, SUMIFS(Registros!E:E, Registros!A:A, \">=\" & fecha_inicial, Registros!A:A, \"<=\" & fecha_final,  Registros!B:B, \"=\" & '6000'!A13))","v":0},{"$f":"IF(ISBLANK(A13), 0, SUMIFS(Registros!F:F, Registros!A:A, \">=\" & fecha_inicial, Registros!A:A, \"<=\" & fecha_final,  Registros!B:B, \"=\" & '6000'!A13))","v":0},0]
[6103,"Código de Cuenta Incorrecto",{"$f":"IF(ISBLANK(A14),0, SUMIFS(Registros!E:E,Registros!A:A,\"<\"&fecha_inicial,Registros!B:B,\"=\"&'6000'!A14)) - IF(ISBLANK(A14),0, SUMIFS(Registros!F:F,Registros!A:A,\"<\"&fecha_inicial,Registros!B:B,\"=\"&'6000'!A14))","v":0},{"$f":"IF(ISBLANK(A14), 0, SUMIFS(Registros!E:E, Registros!A:A, \">=\" & fecha_inicial, Registros!A:A, \"<=\" & fecha_final,  Registros!B:B, \"=\" & '6000'!A14))","v":0},{"$f":"IF(ISBLANK(A14), 0, SUMIFS(Registros!F:F, Registros!A:A, \">=\" & fecha_inicial, Registros!A:A, \"<=\" & fecha_final,  Registros!B:B, \"=\" & '6000'!A14))","v":0},0]
[6104,"Código de Cuenta Incorrecto",{"$f":"IF(ISBLANK(A15),0, SUMIFS(Registros!E:E,Registros!A:A,\"<\"&fecha_inicial,Registros!B:B,\"=\"&'6000'!A15)) - IF(ISBLANK(A15),0, SUMIFS(Registros!F:F,Registros!A:A,\"<\"&fecha_inicial,Registros!B:B,\"=\"&'6000'!A15))","v":0},{"$f":"IF(ISBLANK(A15), 0, SUMIFS(Registros!E:E, Registros!A:A, \">=\" & fecha_inicial, Registros!A:A, \"<=\" & fecha_final,  Registros!B:B, \"=\" & '6000'!A15))","v":0},{"$f":"IF(ISBLANK(A15), 0, SUMIFS(Registros!F:F, Registros!A:A, \">=\" & fecha_inicial, Registros!A:A, \"<=\" & fecha_final,  Registros!B:B, \"=\" & '6000'!A15))","v":0},0]
[6105,"Código de Cuenta Incorrecto",{"$f":"IF(ISBLANK(A16),0, SUMIFS(Registros!E:E,Registros!A:A,\"<\"&fecha_inicial,Registros!B:B,\"=\"&'6000'!A16)) - IF(ISBLANK(A16),0, SUMIFS(Registros!F:F,Registros!A:A,\"<\"&fecha_inicial,Registros!B:B,\"=\"&'6000'!A16))","v":0},{"$f":"IF(ISBLANK(A16), 0, SUMIFS(Registros!E:E, Registros!A:A, \">=\" & fecha_inicial, Registros!A:A, \"<=\" & fecha_final,  Registros!B:B, \"=\" & '6000'!A16))","v":0},{"$f":"IF(ISBLANK(A16), 0, SUMIFS(Registros!F:F, Registros!A:A, \">=\" & fecha_inicial, Registros!A:A, \"<=\" & fecha_final,  Registros!B:B, \"=\" & '6000'!A16))","v":0},0]
[6106,"Código de Cuenta Incorrecto",{"$f":"IF(ISBLANK(A17),0, SUMIFS(Registros!E:E,Registros!A:A,\"<\"&fecha_inicial,Registros!B:B,\"=\"&'6000'!A17)) - IF(ISBLANK(A17),0, SUMIFS(Registros!F:F,Registros!A:A,\"<\"&fecha_inicial,Registros!B:B,\"=\"&'6000'!A17))","v":0},{"$f":"IF(ISBLANK(A17), 0, SUMIFS(Registros!E:E, Registros!A:A, \">=\" & fecha_inicial, Registros!A:A, \"<=\" & fecha_final,  Registros!B:B, \"=\" & '6000'!A17))","v":0},{"$f":"IF(ISBLANK(A17), 0, SUMIFS(Registros!F:F, Registros!A:A, \">=\" & fecha_inicial, Registros!A:A, \"<=\" & fecha_final,  Registros!B:B, \"=\" & '6000'!A17))","v":0},0]
[6107,"Código de Cuenta Incorrecto",{"$f":"IF(ISBLANK(A18),0, SUMIFS(Registros!E:E,Registros!A:A,\"<\"&fecha_inicial,Registros!B:B,\"=\"&'6000'!A18)) - IF(ISBLANK(A18),0, SUMIFS(Registros!F:F,Registros!A:A,\"<\"&fecha_inicial,Registros!B:B,\"=\"&'6000'!A18))","v":0},{"$f":"IF(ISBLANK(A18), 0, SUMIFS(Registros!E:E, Registros!A:A, \">=\" & fecha_inicial, Registros!A:A, \"<=\" & fecha_final,  Registros!B:B, \"=\" & '6000'!A18))","v":0},{"$f":"IF(ISBLANK(A18), 0, SUMIFS(Registros!F:F, Registros!A:A, \">=\" & fecha_inicial, Registros!A:A, \"<=\" & fecha_final,  Registros!B:B, \"=\" & '6000'!A18))","v":0},0]
[6108,"Código de Cuenta Incorrecto",{"$f":"IF(ISBLANK(A19),0, SUMIFS(Registros!E:E,Registros!A:A,\"<\"&fecha_inicial,Registros!B:B,\"=\"&'6000'!A19)) - IF(ISBLANK(A19),0, SUMIFS(Registros!F:F,Registros!A:A,\"<\"&fecha_inicial,Registros!B:B,\"=\"&'6000'!A19))","v":0},{"$f":"IF(ISBLANK(A19), 0, SUMIFS(Registros!E:E, Registros!A:A, \">=\" & fecha_inicial, Registros!A:A, \"<=\" & fecha_final,  Registros!B:B, \"=\" & '6000'!A19))","v":0},{"$f":"IF(ISBLANK(A19), 0, SUMIFS(Registros!F:F, Registros!A:A, \">=\" & fecha_inicial, Registros!A:A, \"<=\" & fecha_final,  Registros!B:B, \"=\" & '6000'!A19))","v":0},0]
[6109,"Código de Cuenta Incorrecto",{"$f":"IF(ISBLANK(A20),0, SUMIFS(Registros!E:E,Registros!A:A,\"<\"&fecha_inicial,Registros!B:B,\"=\"&'6000'!A20)) - IF(ISBLANK(A20),0, SUMIFS(Registros!F:F,Registros!A:A,\"<\"&fecha_inicial,Registros!B:B,\"=\"&'6000'!A20))","v":0},{"$f":"IF(ISBLANK(A20), 0, SUMIFS(Registros!E:E, Registros!A:A, \">=\" & fecha_inicial, Registros!A:A, \"<=\" & fecha_final,  Registros!B:B, \"=\" & '6000'!A20))","v":0},{"$f":"IF(ISBLANK(A20), 0, SUMIFS(Registros!F:F, Registros!A:A, \">=\" & fecha_inicial, Registros!A:A, \"<=\" & fecha_final,  Registros!B:B, \"=\" & '6000'!A20))","v":0},0]
[6110,"Código de Cuenta Incorrecto",{"$f":"IF(ISBLANK(A21),0, SUMIFS(Registros!E:E,Registros!A:A,\"<\"&fecha_inicial,Registros!B:B,\"=\"&'6000'!A21)) - IF(ISBLANK(A21),0, SUMIFS(Registros!F:F,Registros!A:A,\"<\"&fecha_inicial,Registros!B:B,\"=\"&'6000'!A21))","v":0},{"$f":"IF(ISBLANK(A21), 0, SUMIFS(Registros!E:E, Registros!A:A, \">=\" & fecha_inicial, Registros!A:A, \"<=\" & fecha_final,  Registros!B:B, \"=\" & '6000'!A21))","v":0},{"$f":"IF(ISBLANK(A21), 0, SUMIFS(Registros!F:F, Registros!A:A, \">=\" & fecha_inicial, Registros!A:A, \"<=\" & fecha_final,  Registros!B:B, \"=\" & '6000'!A21))","v":0},0]
[6111,"Código de Cuenta Incorrecto",{"$f":"IF(ISBLANK(A22),0, SUMIFS(Registros!E:E,Registros!A:A,\"<\"&fecha_inicial,Registros!B:B,\"=\"&'6000'!A22)) - IF(ISBLANK(A22),0, SUMIFS(Registros!F:F,Registros!A:A,\"<\"&fecha_inicial,Registros!B:B,\"=\"&'6000'!A22))","v":0},{"$f":"IF(ISBLANK(A22), 0, SUMIFS(Registros!E:E, Registros!A:A, \">=\" & fecha_inicial, Registros!A:A, \"<=\" & fecha_final,  Registros!B:B, \"=\" & '6000'!A22))","v":0},{"$f":"IF(ISBLANK(A22), 0, SUMIFS(Registros!F:F, Registros!A:A, \">=\" & fecha_inicial, Registros!A:A, \"<=\" & fecha_final,  Registros!B:B, \"=\" & '6000'!A22))","v":0},0]
[6112,"Código de Cuenta Incorrecto",{"$f":"IF(ISBLANK(A23),0, SUMIFS(Registros!E:E,Registros!A:A,\"<\"&fecha_inicial,Registros!B:B,\"=\"&'6000'!A23)) - IF(ISBLANK(A23),0, SUMIFS(Registros!F:F,Registros!A:A,\"<\"&fecha_inicial,Registros!B:B,\"=\"&'6000'!A23))","v":0},{"$f":"IF(ISBLANK(A23), 0, SUMIFS(Registros!E:E, Registros!A:A, \">=\" & fecha_inicial, Registros!A:A, \"<=\" & fecha_final,  Registros!B:B, \"=\" & '6000'!A23))","v":0},{"$f":"IF(ISBLANK(A23), 0, SUMIFS(Registros!F:F, Registros!A:A, \">=\" & fecha_inicial, Registros!A:A, \"<=\" & fecha_final,  Registros!B:B, \"=\" & '6000'!A23))","v":0},0]
[6113,"Código de Cuenta Incorrecto",{"$f":"IF(ISBLANK(A24),0, SUMIFS(Registros!E:E,Registros!A:A,\"<\"&fecha_inicial,Registros!B:B,\"=\"&'6000'!A24)) - IF(ISBLANK(A24),0, SUMIFS(Registros!F:F,Registros!A:A,\"<\"&fecha_inicial,Registros!B:B,\"=\"&'6000'!A24))","v":0},{"$f":"IF(ISBLANK(A24), 0, SUMIFS(Registros!E:E, Registros!A:A, \">=\" & fecha_inicial, Registros!A:A, \"<=\" & fecha_final,  Registros!B:B, \"=\" & '6000'!A24))","v":0},{"$f":"IF(ISBLANK(A24), 0, SUMIFS(Registros!F:F, Registros!A:A, \">=\" & fecha_inicial, Registros!A:A, \"<=\" & fecha_final,  Registros!B:B, \"=\" & '6000'!A24))","v":0},0]
[6114,"Código de Cuenta Incorrecto",{"$f":"IF(ISBLANK(A25),0, SUMIFS(Registros!E:E,Registros!A:A,\"<\"&fecha_inicial,Registros!B:B,\"=\"&'6000'!A25)) - IF(ISBLANK(A25),0, SUMIFS(Registros!F:F,Registros!A:A,\"<\"&fecha_inicial,Registros!B:B,\"=\"&'6000'!A25))","v":0},{"$f":"IF(ISBLANK(A25), 0, SUMIFS(Registros!E:E, Registros!A:A, \">=\" & fecha_inicial, Registros!A:A, \"<=\" & fecha_final,  Registros!B:B, \"=\" & '6000'!A25))","v":0},{"$f":"IF(ISBLANK(A25), 0, SUMIFS(Registros!F:F, Registros!A:A, \">=\" & fecha_inicial, Registros!A:A, \"<=\" & fecha_final,  Registros!B:B, \"=\" & '6000'!A25))","v":0},0]
[6115,"Código de Cuenta Incorrecto",{"$f":"IF(ISBLANK(A26),0, SUMIFS(Registros!E:E,Registros!A:A,\"<\"&fecha_inicial,Registros!B:B,\"=\"&'6000'!A26)) - IF(ISBLANK(A26),0, SUMIFS(Registros!F:F,Registros!A:A,\"<\"&fecha_inicial,Registros!B:B,\"=\"&'6000'!A26))","v":0},{"$f":"IF(ISBLANK(A26), 0, SUMIFS(Registros!E:E, Registros!A:A, \">=\" & fecha_inicial, Registros!A:A, \"<=\" & fecha_final,  Registros!B:B, \"=\" & '6000'!A26))","v":0},{"$f":"IF(ISBLANK(A26), 0, SUMIFS(Registros!F:F, Registros!A:A, \">=\" & fecha_inicial, Registros!A:A, \"<=\" & fecha_final,  Registros!B:B, \"=\" & '6000'!A26))","v":0},0]
[6200,"DEPRECIACIÓN Y AMORTIZACIÓN",{"$f":"SUM(C28:C42)","v":0},{"$f":"SUM(D28:D42)","v":0},{"$f":"SUM(E28:E42)","v":0},0]
[6201,"GASTOS POR DEPRECIACIÓN",{"$f":"IF(ISBLANK(A28),0, SUMIFS(Registros!E:E,Registros!A:A,\"<\"&fecha_inicial,Registros!B:B,\"=\"&'6000'!A28)) - IF(ISBLANK(A28),0, SUMIFS(Registros!F:F,Registros!A:A,\"<\"&fecha_inicial,Registros!B:B,\"=\"&'6000'!A28))","v":0},{"$f":"IF(ISBLANK(A28), 0, SUMIFS(Registros!E:E, Registros!A:A, \">=\" & fecha_inicial, Registros!A:A, \"<=\" & fecha_final,  Registros!B:B, \"=\" & '6000'!A28))","v":0},{"$f":"IF(ISBLANK(A28), 0, SUMIFS(Registros!F:F, Registros!A:A, \">=\" & fecha_inicial, Registros!A:A, \"<=\" & fecha_final,  Registros!B:B, \"=\" & '6000'!A28))","v":0},0]
[6202,"GASTOS POR AMORTIZACIÓN",{"$f":"IF(ISBLANK(A29),0, SUMIFS(Registros!E:E,Registros!A:A,\"<\"&fecha_inicial,Registros!B:B,\"=\"&'6000'!A29)) - IF(ISBLANK(A29),0, SUMIFS(Registros!F:F,Registros!A:A,\"<\"&fecha_inicial,Registros!B:B,\"=\"&'6000'!A29))","v":0},{"$f":"IF(ISBLANK(A29), 0, SUMIFS(Registros!E:E, Registros!A:A, \">=\" & fecha_inicial, Registros!A:A, \"<=\" & fecha_final,  Registros!B:B, \"=\" & '6000'!A29))","v":0},{"$f":"IF(ISBLANK(A29), 0, SUMIFS(Registros!F:F, Registros!A:A, \">=\" & fecha_inicial, Registros!A:A, \"<=\" & fecha_final,  Registros!B:B, \"=\" & '6000'!A29))","v":0},0]
[6203,"Código de Cuenta Incorrecto",{"$f":"IF(ISBLANK(A30),0, SUMIFS(Registros!E:E,Registros!A:A,\"<\"&fecha_inicial,Registros!B:B,\"=\"&'6000'!A30)) - IF(ISBLANK(A30),0, SUMIFS(Registros!F:F,Registros!A:A,\"<\"&fecha_inicial,Registros!B:B,\"=\"&'6000'!A30))","v":0},{"$f":"IF(ISBLANK(A30), 0, SUMIFS(Registros!E:E, Registros!A:A, \">=\" & fecha_inicial, Registros!A:A, \"<=\" & fecha_final,  Registros!B:B, \"=\" & '6000'!A30))","v":0},{"$f":"IF(ISBLANK(A30), 0, SUMIFS(Registros!F:F, Registros!A:A, \">=\" & fecha_inicial, Registros!A:A, \"<=\" & fecha_final,  Registros!B:B, \"=\" & '6000'!A30))","v":0},0]
[6204,"Código de Cuenta Incorrecto",{"$f":"IF(ISBLANK(A31),0, SUMIFS(Registros!E:E,Registros!A:A,\"<\"&fecha_inicial,Registros!B:B,\"=\"&'6000'!A31)) - IF(ISBLANK(A31),0, SUMIFS(Registros!F:F,Registros!A:A,\"<\"&fecha_inicial,Registros!B:B,\"=\"&'6000'!A31))","v":0},{"$f":"IF(ISBLANK(A31), 0, SUMIFS(Registros!E:E, Registros!A:A, \">=\" & fecha_inicial, Registros!A:A, \"<=\" & fecha_final,  Registros!B:B, \"=\" & '6000'!A31))","v":0},{"$f":"IF(ISBLANK(A31), 0, SUMIFS(Registros!F:F, Registros!A:A, \">=\" & fecha_inicial, Registros!A:A, \"<=\" & fecha_final,  Registros!B:B, \"=\" & '6000'!A31))","v":0},0]
[6205,"Código de Cuenta Incorrecto",{"$f":"IF(ISBLANK(A32),0, SUMIFS(Registros!E:E,Registros!A:A,\"<\"&fecha_inicial,Registros!B:B,\"=\"&'6000'!A32)) - IF(ISBLANK(A32),0, SUMIFS(Registros!F:F,Registros!A:A,\"<\"&fecha_inicial,Registros!B:B,\"=\"&'6000'!A32))","v":0},{"$f":"IF(ISBLANK(A32), 0, SUMIFS(Registros!E:E, Registros!A:A, \">=\" & fecha_inicial, Registros!A:A, \"<=\" & fecha_final,  Registros!B:B, \"=\" & '6000'!A32))","v":0},{"$f":"IF(ISBLANK(A32), 0, SUMIFS(Registros!F:F, Registros!A:A, \">=\" & fecha_inicial, Registros!A:A, \"<=\" & fecha_final,  Registros!B:B, \"=\" & '6000'!A32))","v":0},0]
[6206,"Código de Cuenta Incorrecto",{"$f":"IF(ISBLANK(A33),0, SUMIFS(Registros!E:E,Registros!A:A,\"<\"&fecha_inicial,Registros!B:B,\"=\"&'6000'!A33)) - IF(ISBLANK(A33),0, SUMIFS(Registros!F:F,Registros!A:A,\"<\"&fecha_inicial,Registros!B:B,\"=\"&'6000'!A33))","v":0},{"$f":"IF(ISBLANK(A33), 0, SUMIFS(Registros!E:E, Registros!A:A, \">=\" & fecha_inicial, Registros!A:A, \"<=\" & fecha_final,  Registros!B:B, \"=\" & '6000'!A33))","v":0},{"$f":"IF(ISBLANK(A33), 0, SUMIFS(Registros!F:F, Registros!A:A, \">=\" & fecha_inicial, Registros!A:A, \"<=\" & fecha_final,  Registros!B:B, \"=\" & '6000'!A33))","v":0},0]
[6207,"Código de Cuenta Incorrecto",{"$f":"IF(ISBLANK(A34),0, SUMIFS(Registros!E:E,Registros!A:A,\"<\"&fecha_inicial,Registros!B:B,\"=\"&'6000'!A34)) - IF(ISBLANK(A34),0, SUMIFS(Registros!F:F,Registros!A:A,\"<\"&fecha_inicial,Registros!B:B,\"=\"&'6000'!A34))","v":0},{"$f":"IF(ISBLANK(A34), 0, SUMIFS(Registros!E:E, Registros!A:A, \">=\" & fecha_inicial, Registros!A:A, \"<=\" & fecha_final,  Registros!B:B, \"=\" & '6000'!A34))","v":0},{"$f":"IF(ISBLANK(A34), 0, SUMIFS(Registros!F:F, Registros!A:A, \">=\" & fecha_inicial, Registros!A:A, \"<=\" & fecha_final,  Registros!B:B, \"=\" & '6000'!A34))","v":0},0]
[6208,"Código de Cuenta Incorrecto",{"$f":"IF(ISBLANK(A35),0, SUMIFS(Registros!E:E,Registros!A:A,\"<\"&fecha_inicial,Registros!B:B,\"=\"&'6000'!A35)) - IF(ISBLANK(A35),0, SUMIFS(Registros!F:F,Registros!A:A,\"<\"&fecha_inicial,Registros!B:B,\"=\"&'6000'!A35))","v":0},{"$f":"IF(ISBLANK(A35), 0, SUMIFS(Registros!E:E, Registros!A:A, \">=\" & fecha_inicial, Registros!A:A, \"<=\" & fecha_final,  Registros!B:B, \"=\" & '6000'!A35))","v":0},{"$f":"IF(ISBLANK(A35), 0, SUMIFS(Registros!F:F, Registros!A:A, \">=\" & fecha_inicial, Registros!A:A, \"<=\" & fecha_final,  Registros!B:B, \"=\" & '6000'!A35))","v":0},0]
[6209,"Código de Cuenta Incorrecto",{"$f":"IF(ISBLANK(A36),0, SUMIFS(Registros!E:E,Registros!A:A,\"<\"&fecha_inicial,Registros!B:B,\"=\"&'6000'!A36)) - IF(ISBLANK(A36),0, SUMIFS(Registros!F:F,Registros!A:A,\"<\"&fecha_inicial,Registros!B:B,\"=\"&'6000'!A36))","v":0},{"$f":"IF(ISBLANK(A36), 0, SUMIFS(Registros!E:E, Registros!A:A, \">=\" & fecha_inicial, Registros!A:A, \"<=\" & fecha_final,  Registros!B:B, \"=\" & '6000'!A36))","v":0},{"$f":"IF(ISBLANK(A36), 0, SUMIFS(Registros!F:F, Registros!A:A, \">=\" & fecha_inicial, Registros!A:A, \"<=\" & fecha_final,  Registros!B:B, \"=\" & '6000'!A36))","v":0},0]
[6210,"Código de Cuenta Incorrecto",{"$f":"IF(ISBLANK(A37),0, SUMIFS(Registros!E:E,Registros!A:A,\"<\"&fecha_inicial,Registros!B:B,\"=\"&'6000'!A37)) - IF(ISBLANK(A37),0, SUMIFS(Registros!F:F,Registros!A:A,\"<\"&fecha_inicial,Registros!B:B,\"=\"&'6000'!A37))","v":0},{"$f":"IF(ISBLANK(A37), 0, SUMIFS(Registros!E:E, Registros!A:A, \">=\" & fecha_inicial, Registros!A:A, \"<=\" & fecha_final,  Registros!B:B, \"=\" & '6000'!A37))","v":0},{"$f":"IF(ISBLANK(A37), 0, SUMIFS(Registros!F:F, Registros!A:A, \">=\" & fecha_inicial, Registros!A:A, \"<=\" & fecha_final,  Registros!B:B, \"=\" & '6000'!A37))","v":0},0]
[6211,"Código de Cuenta Incorrecto",{"$f":"IF(ISBLANK(A38),0, SUMIFS(Registros!E:E,Registros!A:A,\"<\"&fecha_inicial,Registros!B:B,\"=\"&'6000'!A38)) - IF(ISBLANK(A38),0, SUMIFS(Registros!F:F,Registros!A:A,\"<\"&fecha_inicial,Registros!B:B,\"=\"&'6000'!A38))","v":0},{"$f":"IF(ISBLANK(A38), 0, SUMIFS(Registros!E:E, Registros!A:A, \">=\" & fecha_inicial, Registros!A:A, \"<=\" & fecha_final,  Registros!B:B, \"=\" & '6000'!A38))","v":0},{"$f":"IF(ISBLANK(A38), 0, SUMIFS(Registros!F:F, Registros!A:A, \">=\" & fecha_inicial, Registros!A:A, \"<=\" & fecha_final,  Registros!B:B, \"=\" & '6000'!A38))","v":0},0]
[6212,"Código de Cuenta Incorrecto",{"$f":"IF(ISBLANK(A39),0, SUMIFS(Registros!E:E,Registros!A:A,\"<\"&fecha_inicial,Registros!B:B,\"=\"&'6000'!A39)) - IF(ISBLANK(A39),0, SUMIFS(Registros!F:F,Registros!A:A,\"<\"&fecha_inicial,Registros!B:B,\"=\"&'6000'!A39))","v":0},{"$f":"IF(ISBLANK(A39), 0, SUMIFS(Registros!E:E, Registros!A:A, \">=\" & fecha_inicial, Registros!A:A, \"<=\" & fecha_final,  Registros!B:B, \"=\" & '6000'!A39))","v":0},{"$f":"IF(ISBLANK(A39), 0, SUMIFS(Registros!F:F, Registros!A:A, \">=\" & fecha_inicial, Registros!A:A, \"<=\" & fecha_final,  Registros!B:B, \"=\" & '6000'!A39))","v":0},0]
[6213,"Código de Cuenta Incorrecto",{"$f":"IF(ISBLANK(A40),0, SUMIFS(Registros!E:E,Registros!A:A,\"<\"&fecha_inicial,Registros!B:B,\"=\"&'6000'!A40)) - IF(ISBLANK(A40),0, SUMIFS(Registros!F:F,Registros!A:A,\"<\"&fecha_inicial,Registros!B:B,\"=\"&'6000'!A40))","v":0},{"$f":"IF(ISBLANK(A40), 0, SUMIFS(Registros!E:E, Registros!A:A, \">=\" & fecha_inicial, Registros!A:A, \"<=\" & fecha_final,  Registros!B:B, \"=\" & '6000'!A40))","v":0},{"$f":"IF(ISBLANK(A40), 0, SUMIFS(Registros!F:F, Registros!A:A, \">=\" & fecha_inicial, Registros!A:A, \"<=\" & fecha_final,  Registros!B:B, \"=\" & '6000'!A40))","v":0},0]
[6214,"Código de Cuenta Incorrecto",{"$f":"IF(ISBLANK(A41),0, SUMIFS(Registros!E:E,Registros!A:A,\"<\"&fecha_inicial,Registros!B:B,\"=\"&'6000'!A41)) - IF(ISBLANK(A41),0, SUMIFS(Registros!F:F,Registros!A:A,\"<\"&fecha_inicial,Registros!B:B,\"=\"&'6000'!A41))","v":0},{"$f":"IF(ISBLANK(A41), 0, SUMIFS(Registros!E:E, Registros!A:A, \">=\" & fecha_inicial, Registros!A:A, \"<=\" & fecha_final,  Registros!B:B, \"=\" & '6000'!A41))","v":0},{"$f":"IF(ISBLANK(A41), 0, SUMIFS(Registros!F:F, Registros!A:A, \">=\" & fecha_inicial, Registros!A:A, \"<=\" & fecha_final,  Registros!B:B, \"=\" & '6000'!A41))","v":0},0]
[6215,"Código de Cuenta Incorrecto",{"$f":"IF(ISBLANK(A42),0, SUMIFS(Registros!E:E,Registros!A:A,\"<\"&fecha_inicial,Registros!B:B,\"=\"&'6000'!A42)) - IF(ISBLANK(A42),0, SUMIFS(Registros!F:F,Registros!A:A,\"<\"&fecha_inicial,Registros!B:B,\"=\"&'6000'!A42))","v":0},{"$f":"IF(ISBLANK(A42), 0, SUMIFS(Registros!E:E, Registros!A:A, \">=\" & fecha_inicial, Registros!A:A, \"<=\" & fecha_final,  Registros!B:B, \"=\" & '6000'!A42))","v":0},{"$f":"IF(ISBLANK(A42), 0, SUMIFS(Registros!F:F, Registros!A:A, \">=\" & fecha_inicial, Registros!A:A, \"<=\" & fecha_final,  Registros!B:B, \"=\" & '6000'!A42))","v":0},0]
[6300,"GASTOS FINANCIEROS",{"$f":"SUM(C44:C58)","v":0},{"$f":"SUM(D44:D58)","v":0},0,0]
[6301,"GASTO POR INTERESES",{"$f":"IF(ISBLANK(A44),0, SUMIFS(Registros!E:E,Registros!A:A,\"<\"&fecha_inicial,Registros!B:B,\"=\"&'6000'!A44)) - IF(ISBLANK(A44),0, SUMIFS(Registros!F:F,Registros!A:A,\"<\"&fecha_inicial,Registros!B:B,\"=\"&'6000'!A44))","v":0},{"$f":"IF(ISBLANK(A44), 0, SUMIFS(Registros!E:E, Registros!A:A, \">=\" & fecha_inicial, Registros!A:A, \"<=\" & fecha_final,  Registros!B:B, \"=\" & '6000'!A44))","v":0},{"$f":"IF(ISBLANK(A44), 0, SUMIFS(Registros!F:F, Registros!A:A, \">=\" & fecha_inicial, Registros!A:A, \"<=\" & fecha_final,  Registros!B:B, \"=\" & '6000'!A44))","v":0},0]
[6302,"Código de Cuenta Incorrecto",{"$f":"IF(ISBLANK(A45),0, SUMIFS(Registros!E:E,Registros!A:A,\"<\"&fecha_inicial,Registros!B:B,\"=\"&'6000'!A45)) - IF(ISBLANK(A45),0, SUMIFS(Registros!F:F,Registros!A:A,\"<\"&fecha_inicial,Registros!B:B,\"=\"&'6000'!A45))","v":0},{"$f":"IF(ISBLANK(A45), 0, SUMIFS(Registros!E:E, Registros!A:A, \">=\" & fecha_inicial, Registros!A:A, \"<=\" & fecha_final,  Registros!B:B, \"=\" & '6000'!A45))","v":0},{"$f":"IF(ISBLANK(A45), 0, SUMIFS(Registros!F:F, Registros!A:A, \">=\" & fecha_inicial, Registros!A:A, \"<=\" & fecha_final,  Registros!B:B, \"=\" & '6000'!A45))","v":0},0]
[6303,"Código de Cuenta Incorrecto",{"$f":"IF(ISBLANK(A46),0, SUMIFS(Registros!E:E,Registros!A:A,\"<\"&fecha_inicial,Registros!B:B,\"=\"&'6000'!A46)) - IF(ISBLANK(A46),0, SUMIFS(Registros!F:F,Registros!A:A,\"<\"&fecha_inicial,Registros!B:B,\"=\"&'6000'!A46))","v":0},{"$f":"IF(ISBLANK(A46), 0, SUMIFS(Registros!E:E, Registros!A:A, \">=\" & fecha_inicial, Registros!A:A, \"<=\" & fecha_final,  Registros!B:B, \"=\" & '6000'!A46))","v":0},{"$f":"IF(ISBLANK(A46), 0, SUMIFS(Registros!F:F, Registros!A:A, \">=\" & fecha_inicial, Registros!A:A, \"<=\" & fecha_final,  Registros!B:B, \"=\" & '6000'!A46))","v":0},0]
[6304,"Código de Cuenta Incorrecto",{"$f":"IF(ISBLANK(A47),0, SUMIFS(Registros!E:E,Registros!A:A,\"<\"&fecha_inicial,Registros!B:B,\"=\"&'6000'!A47)) - IF(ISBLANK(A47),0, SUMIFS(Registros!F:F,Registros!A:A,\"<\"&fecha_inicial,Registros!B:B,\"=\"&'6000'!A47))","v":0},{"$f":"IF(ISBLANK(A47), 0, SUMIFS(Registros!E:E, Registros!A:A, \">=\" & fecha_inicial, Registros!A:A, \"<=\" & fecha_final,  Registros!B:B, \"=\" & '6000'!A47))","v":0},{"$f":"IF(ISBLANK(A47), 0, SUMIFS(Registros!F:F, Registros!A:A, \">=\" & fecha_inicial, Registros!A:A, \"<=\" & fecha_final,  Registros!B:B, \"=\" & '6000'!A47))","v":0},0]
[6305,"Código de Cuenta Incorrecto",{"$f":"IF(ISBLANK(A48),0, SUMIFS(Registros!E:E,Registros!A:A,\"<\"&fecha_inicial,Registros!B:B,\"=\"&'6000'!A48)) - IF(ISBLANK(A48),0, SUMIFS(Registros!F:F,Registros!A:A,\"<\"&fecha_inicial,Registros!B:B,\"=\"&'6000'!A48))","v":0},{"$f":"IF(ISBLANK(A48), 0, SUMIFS(Registros!E:E, Registros!A:A, \">=\" & fecha_inicial, Registros!A:A, \"<=\" & fecha_final,  Registros!B:B, \"=\" & '6000'!A48))","v":0},{"$f":"IF(ISBLANK(A48), 0, SUMIFS(Registros!F:F, Registros!A:A, \">=\" & fecha_inicial, Registros!A:A, \"<=\" & fecha_final,  Registros!B:B, \"=\" & '6000'!A48))","v":0},0]
[6306,"Código de Cuenta Incorrecto",{"$f":"IF(ISBLANK(A49),0, SUMIFS(Registros!E:E,Registros!A:A,\"<\"&fecha_inicial,Registros!B:B,\"=\"&'6000'!A49)) - IF(ISBLANK(A49),0, SUMIFS(Registros!F:F,Registros!A:A,\"<\"&fecha_inicial,Registros!B:B,\"=\"&'6000'!A49))","v":0},{"$f":"IF(ISBLANK(A49), 0, SUMIFS(Registros!E:E, Registros!A:A, \">=\" & fecha_inicial, Registros!A:A, \"<=\" & fecha_final,  Registros!B:B, \"=\" & '6000'!A49))","v":0},{"$f":"IF(ISBLANK(A49), 0, SUMIFS(Registros!F:F, Registros!A:A, \">=\" & fecha_inicial, Registros!A:A, \"<=\" & fecha_final,  Registros!B:B, \"=\" & '6000'!A49))","v":0},0]
[6307,"Código de Cuenta Incorrecto",{"$f":"IF(ISBLANK(A50),0, SUMIFS(Registros!E:E,Registros!A:A,\"<\"&fecha_inicial,Registros!B:B,\"=\"&'6000'!A50)) - IF(ISBLANK(A50),0, SUMIFS(Registros!F:F,Registros!A:A,\"<\"&fecha_inicial,Registros!B:B,\"=\"&'6000'!A50))","v":0},{"$f":"IF(ISBLANK(A50), 0, SUMIFS(Registros!E:E, Registros!A:A, \">=\" & fecha_inicial, Registros!A:A, \"<=\" & fecha_final,  Registros!B:B, \"=\" & '6000'!A50))","v":0},{"$f":"IF(ISBLANK(A50), 0, SUMIFS(Registros!F:F, Registros!A:A, \">=\" & fecha_inicial, Registros!A:A, \"<=\" & fecha_final,  Registros!B:B, \"=\" & '6000'!A50))","v":0},0]
[6308,"Código de Cuenta Incorrecto",{"$f":"IF(ISBLANK(A51),0, SUMIFS(Registros!E:E,Registros!A:A,\"<\"&fecha_inicial,Registros!B:B,\"=\"&'6000'!A51)) - IF(ISBLANK(A51),0, SUMIFS(Registros!F:F,Registros!A:A,\"<\"&fecha_inicial,Registros!B:B,\"=\"&'6000'!A51))","v":0},{"$f":"IF(ISBLANK(A51), 0, SUMIFS(Registros!E:E, Registros!A:A, \">=\" & fecha_inicial, Registros!A:A, \"<=\" & fecha_final,  Registros!B:B, \"=\" & '6000'!A51))","v":0},{"$f":"IF(ISBLANK(A51), 0, SUMIFS(Registros!F:F, Registros!A:A, \">=\" & fecha_inicial, Registros!A:A, \"<=\" & fecha_final,  Registros!B:B, \"=\" & '6000'!A51))","v":0},0]
[6309,"Código de Cuenta Incorrecto",{"$f":"IF(ISBLANK(A52),0, SUMIFS(Registros!E:E,Registros!A:A,\"<\"&fecha_inicial,Registros!B:B,\"=\"&'6000'!A52)) - IF(ISBLANK(A52),0, SUMIFS(Registros!F:F,Registros!A:A,\"<\"&fecha_inicial,Registros!B:B,\"=\"&'6000'!A52))","v":0},{"$f":"IF(ISBLANK(A52), 0, SUMIFS(Registros!E:E, Registros!A:A, \">=\" & fecha_inicial, Registros!A:A, \"<=\" & fecha_final,  Registros!B:B, \"=\" & '6000'!A52))","v":0},{"$f":"IF(ISBLANK(A52), 0, SUMIFS(Registros!F:F, Registros!A:A, \">=\" & fecha_inicial, Registros!A:A, \"<=\" & fecha_final,  Registros!B:B, \"=\" & '6000'!A52))","v":0},0]
[6310,"Código de Cuenta Incorrecto",{"$f":"IF(ISBLANK(A53),0, SUMIFS(Registros!E:E,Registros!A:A,\"<\"&fecha_inicial,Registros!B:B,\"=\"&'6000'!A53)) - IF(ISBLANK(A53),0, SUMIFS(Registros!F:F,Registros!A:A,\"<\"&fecha_inicial,Registros!B:B,\"=\"&'6000'!A53))","v":0},{"$f":"IF(ISBLANK(A53), 0, SUMIFS(Registros!E:E, Registros!A:A, \">=\" & fecha_inicial, Registros!A:A, \"<=\" & fecha_final,  Registros!B:B, \"=\" & '6000'!A53))","v":0},{"$f":"IF(ISBLANK(A53), 0, SUMIFS(Registros!F:F, Registros!A:A, \">=\" & fecha_inicial, Registros!A:A, \"<=\" & fecha_final,  Registros!B:B, \"=\" & '6000'!A53))","v":0},0]
[6311,"Código de Cuenta Incorrecto",{"$f":"IF(ISBLANK(A54),0, SUMIFS(Registros!E:E,Registros!A:A,\"<\"&fecha_inicial,Registros!B:B,\"=\"&'6000'!A54)) - IF(ISBLANK(A54),0, SUMIFS(Registros!F:F,Registros!A:A,\"<\"&fecha_inicial,Registros!B:B,\"=\"&'6000'!A54))","v":0},{"$f":"IF(ISBLANK(A54), 0, SUMIFS(Registros!E:E, Registros!A:A, \">=\" & fecha_inicial, Registros!A:A, \"<=\" & fecha_final,  Registros!B:B, \"=\" & '6000'!A54))","v":0},{"$f":"IF(ISBLANK(A54), 0, SUMIFS(Registros!F:F, Registros!A:A, \">=\" & fecha_inicial, Registros!A:A, \"<=\" & fecha_final,  Registros!B:B, \"=\" & '6000'!A54))","v":0},0]
[6312,"Código de Cuenta Incorrecto",{"$f":"IF(ISBLANK(A55),0, SUMIFS(Registros!E:E,Registros!A:A,\"<\"&fecha_inicial,Registros!B:B,\"=\"&'6000'!A55)) - IF(ISBLANK(A55),0, SUMIFS(Registros!F:F,Registros!A:A,\"<\"&fecha_inicial,Registros!B:B,\"=\"&'6000'!A55))","v":0},{"$f":"IF(ISBLANK(A55), 0, SUMIFS(Registros!E:E, Registros!A:A, \">=\" & fecha_inicial, Registros!A:A, \"<=\" & fecha_final,  Registros!B:B, \"=\" & '6000'!A55))","v":0},{"$f":"IF(ISBLANK(A55), 0, SUMIFS(Registros!F:F, Registros!A:A, \">=\" & fecha_inicial, Registros!A:A, \"<=\" & fecha_final,  Registros!B:B, \"=\" & '6000'!A55))","v":0},0]
[6313,"Código de Cuenta Incorrecto",{"$f":"IF(ISBLANK(A56),0, SUMIFS(Registros!E:E,Registros!A:A,\"<\"&fecha_inicial,Registros!B:B,\"=\"&'6000'!A56)) - IF(ISBLANK(A56),0, SUMIFS(Registros!F:F,Registros!A:A,\"<\"&fecha_inicial,Registros!B:B,\"=\"&'6000'!A56))","v":0},{"$f":"IF(ISBLANK(A56), 0, SUMIFS(Registros!E:E, Registros!A:A, \">=\" & fecha_inicial, Registros!A:A, \"<=\" & fecha_final,  Registros!B:B, \"=\" & '6000'!A56))","v":0},{"$f":"IF(ISBLANK(A56), 0, SUMIFS(Registros!F:F, Registros!A:A, \">=\" & fecha_inicial, Registros!A:A, \"<=\" & fecha_final,  Registros!B:B, \"=\" & '6000'!A56))","v":0},0]
[6314,"Código de Cuenta Incorrecto",{"$f":"IF(ISBLANK(A57),0, SUMIFS(Registros!E:E,Registros!A:A,\"<\"&fecha_inicial,Registros!B:B,\"=\"&'6000'!A57)) - IF(ISBLANK(A57),0, SUMIFS(Registros!F:F,Registros!A:A,\"<\"&fecha_inicial,Registros!B:B,\"=\"&'6000'!A57))","v":0},{"$f":"IF(ISBLANK(A57), 0, SUMIFS(Registros!E:E, Registros!A:A, \">=\" & fecha_inicial, Registros!A:A, \"<=\" & fecha_final,  Registros!B:B, \"=\" & '6000'!A57))","v":0},{"$f":"IF(ISBLANK(A57), 0, SUMIFS(Registros!F:F, Registros!A:A, \">=\" & fecha_inicial, Registros!A:A, \"<=\" & fecha_final,  Registros!B:B, \"=\" & '6000'!A57))","v":0},0]
[6315,"Código de Cuenta Incorrecto",{"$f":"IF(ISBLANK(A58),0, SUMIFS(Registros!E:E,Registros!A:A,\"<\"&fecha_inicial,Registros!B:B,\"=\"&'6000'!A58)) - IF(ISBLANK(A58),0, SUMIFS(Registros!F:F,Registros!A:A,\"<\"&fecha_inicial,Registros!B:B,\"=\"&'6000'!A58))","v":0},{"$f":"IF(ISBLANK(A58), 0, SUMIFS(Registros!E:E, Registros!A:A, \">=\" & fecha_inicial, Registros!A:A, \"<=\" & fecha_final,  Registros!B:B, \"=\" & '6000'!A58))","v":0},{"$f":"IF(ISBLANK(A58), 0, SUMIFS(Registros!F:F, Registros!A:A, \">=\" & fecha_inicial, Registros!A:A, \"<=\" & fecha_final,  Registros!B:B, \"=\" & '6000'!A58))","v":0},0]
[6400,"IMPUESTOS",{"$f":"SUM(C60:C74)","v":0},{"$f":"SUM(D60:D74)","v":0},0,0]
[6401,"IMPUESTOS SOBRE LA RENTA",{"$f":"IF(ISBLANK(A60),0, SUMIFS(Registros!E:E,Registros!A:A,\"<\"&fecha_inicial,Registros!B:B,\"=\"&'6000'!A60)) - IF(ISBLANK(A60),0, SUMIFS(Registros!F:F,Registros!A:A,\"<\"&fecha_inicial,Registros!B:B,\"=\"&'6000'!A60))","v":0},{"$f":"IF(ISBLANK(A60), 0, SUMIFS(Registros!E:E, Registros!A:A, \">=\" & fecha_inicial, Registros!A:A, \"<=\" & fecha_final,  Registros!B:B, \"=\" & '6000'!A60))","v":0},{"$f":"IF(ISBLANK(A60), 0, SUMIFS(Registros!F:F, Registros!A:A, \">=\" & fecha_inicial, Registros!A:A, \"<=\" & fecha_final,  Registros!B:B, \"=\" & '6000'!A60))","v":0},0]
[6402,"Código de Cuenta Incorrecto",{"$f":"IF(ISBLANK(A61),0, SUMIFS(Registros!E:E,Registros!A:A,\"<\"&fecha_inicial,Registros!B:B,\"=\"&'6000'!A61)) - IF(ISBLANK(A61),0, SUMIFS(Registros!F:F,Registros!A:A,\"<\"&fecha_inicial,Registros!B:B,\"=\"&'6000'!A61))","v":0},{"$f":"IF(ISBLANK(A61), 0, SUMIFS(Registros!E:E, Registros!A:A, \">=\" & fecha_inicial, Registros!A:A, \"<=\" & fecha_final,  Registros!B:B, \"=\" & '6000'!A61))","v":0},{"$f":"IF(ISBLANK(A61), 0, SUMIFS(Registros!F:F, Registros!A:A, \">=\" & fecha_inicial, Registros!A:A, \"<=\" & fecha_final,  Registros!B:B, \"=\" & '6000'!A61))","v":0},0]
[6403,"Código de Cuenta Incorrecto",{"$f":"IF(ISBLANK(A62),0, SUMIFS(Registros!E:E,Registros!A:A,\"<\"&fecha_inicial,Registros!B:B,\"=\"&'6000'!A62)) - IF(ISBLANK(A62),0, SUMIFS(Registros!F:F,Registros!A:A,\"<\"&fecha_inicial,Registros!B:B,\"=\"&'6000'!A62))","v":0},{"$f":"IF(ISBLANK(A62), 0, SUMIFS(Registros!E:E, Registros!A:A, \">=\" & fecha_inicial, Registros!A:A, \"<=\" & fecha_final,  Registros!B:B, \"=\" & '6000'!A62))","v":0},{"$f":"IF(ISBLANK(A62), 0, SUMIFS(Registros!F:F, Registros!A:A, \">=\" & fecha_inicial, Registros!A:A, \"<=\" & fecha_final,  Registros!B:B, \"=\" & '6000'!A62))","v":0},0]
[6404,"Código de Cuenta Incorrecto",{"$f":"IF(ISBLANK(A63),0, SUMIFS(Registros!E:E,Registros!A:A,\"<\"&fecha_inicial,Registros!B:B,\"=\"&'6000'!A63)) - IF(ISBLANK(A63),0, SUMIFS(Registros!F:F,Registros!A:A,\"<\"&fecha_inicial,Registros!B:B,\"=\"&'6000'!A63))","v":0},{"$f":"IF(ISBLANK(A63), 0, SUMIFS(Registros!E:E, Registros!A:A, \">=\" & fecha_inicial, Registros!A:A, \"<=\" & fecha_final,  Registros!B:B, \"=\" & '6000'!A63))","v":0},{"$f":"IF(ISBLANK(A63), 0, SUMIFS(Registros!F:F, Registros!A:A, \">=\" & fecha_inicial, Registros!A:A, \"<=\" & fecha_final,  Registros!B:B, \"=\" & '6000'!A63))","v":0},0]
[6405,"Código de Cuenta Incorrecto",{"$f":"IF(ISBLANK(A64),0, SUMIFS(Registros!E:E,Registros!A:A,\"<\"&fecha_inicial,Registros!B:B,\"=\"&'6000'!A64)) - IF(ISBLANK(A64),0, SUMIFS(Registros!F:F,Registros!A:A,\"<\"&fecha_inicial,Registros!B:B,\"=\"&'6000'!A64))","v":0},{"$f":"IF(ISBLANK(A64), 0, SUMIFS(Registros!E:E, Registros!A:A, \">=\" & fecha_inicial, Registros!A:A, \"<=\" & fecha_final,  Registros!B:B, \"=\" & '6000'!A64))","v":0},{"$f":"IF(ISBLANK(A64), 0, SUMIFS(Registros!F:F, Registros!A:A, \">=\" & fecha_inicial, Registros!A:A, \"<=\" & fecha_final,  Registros!B:B, \"=\" & '6000'!A64))","v":0},0]
[6406,"Código de Cuenta Incorrecto",{"$f":"IF(ISBLANK(A65),0, SUMIFS(Registros!E:E,Registros!A:A,\"<\"&fecha_inicial,Registros!B:B,\"=\"&'6000'!A65)) - IF(ISBLANK(A65),0, SUMIFS(Registros!F:F,Registros!A:A,\"<\"&fecha_inicial,Registros!B:B,\"=\"&'6000'!A65))","v":0},{"$f":"IF(ISBLANK(A65), 0, SUMIFS(Registros!E:E, Registros!A:A, \">=\" & fecha_inicial, Registros!A:A, \"<=\" & fecha_final,  Registros!B:B, \"=\" & '6000'!A65))","v":0},{"$f":"IF(ISBLANK(A65), 0, SUMIFS(Registros!F:F, Registros!A:A, \">=\" & fecha_inicial, Registros!A:A, \"<=\" & fecha_final,  Registros!B:B, \"=\" & '6000'!A65))","v":0},0]
[6407,"Código de Cuenta Incorrecto",{"$f":"IF(ISBLANK(A66),0, SUMIFS(Registros!E:E,Registros!A:A,\"<\"&fecha_inicial,Registros!B:B,\"=\"&'6000'!A66)) - IF(ISBLANK(A66),0, SUMIFS(Registros!F:F,Registros!A:A,\"<\"&fecha_inicial,Registros!B:B,\"=\"&'6000'!A66))","v":0},{"$f":"IF(ISBLANK(A66), 0, SUMIFS(Registros!E:E, Registros!A:A, \">=\" & fecha_inicial, Registros!A:A, \"<=\" & fecha_final,  Registros!B:B, \"=\" & '6000'!A66))","v":0},{"$f":"IF(ISBLANK(A66), 0, SUMIFS(Registros!F:F, Registros!A:A, \">=\" & fecha_inicial, Registros!A:A, \"<=\" & fecha_final,  Registros!B:B, \"=\" & '6000'!A66))","v":0},0]
[6408,"Código de Cuenta Incorrecto",{"$f":"IF(ISBLANK(A67),0, SUMIFS(Registros!E:E,Registros!A:A,\"<\"&fecha_inicial,Registros!B:B,\"=\"&'6000'!A67)) - IF(ISBLANK(A67),0, SUMIFS(Registros!F:F,Registros!A:A,\"<\"&fecha_inicial,Registros!B:B,\"=\"&'6000'!A67))","v":0},{"$f":"IF(ISBLANK(A67), 0, SUMIFS(Registros!E:E, Registros!A:A, \">=\" & fecha_inicial, Registros!A:A, \"<=\" & fecha_final,  Registros!B:B, \"=\" & '6000'!A67))","v":0},{"$f":"IF(ISBLANK(A67), 0, SUMIFS(Registros!F:F, Registros!A:A, \">=\" & fecha_inicial, Registros!A:A, \"<=\" & fecha_final,  Registros!B:B, \"=\" & '6000'!A67))","v":0},0]
[6409,"Código de Cuenta Incorrecto",{"$f":"IF(ISBLANK(A68),0, SUMIFS(Registros!E:E,Registros!A:A,\"<\"&fecha_inicial,Registros!B:B,\"=\"&'6000'!A68)) - IF(ISBLANK(A68),0, SUMIFS(Registros!F:F,Registros!A:A,\"<\"&fecha_inicial,Registros!B:B,\"=\"&'6000'!A68))","v":0},{"$f":"IF(ISBLANK(A68), 0, SUMIFS(Registros!E:E, Registros!A:A, \">=\" & fecha_inicial, Registros!A:A, \"<=\" & fecha_final,  Registros!B:B, \"=\" & '6000'!A68))","v":0},{"$f":"IF(ISBLANK(A68), 0, SUMIFS(Registros!F:F, Registros!A:A, \">=\" & fecha_inicial, Registros!A:A, \"<=\" & fecha_final,  Registros!B:B, \"=\" & '6000'!A68))","v":0},0]
[6410,"Código de Cuenta Incorrecto",{"$f":"IF(ISBLANK(A69),0, SUMIFS(Registros!E:E,Registros!A:A,\"<\"&fecha_inicial,Registros!B:B,\"=\"&'6000'!A69)) - IF(ISBLANK(A69),0, SUMIFS(Registros!F:F,Registros!A:A,\"<\"&fecha_inicial,Registros!B:B,\"=\"&'6000'!A69))","v":0},{"$f":"IF(ISBLANK(A69), 0, SUMIFS(Registros!E:E, Registros!A:A, \">=\" & fecha_inicial, Registros!A:A, \"<=\" & fecha_final,  Registros!B:B, \"=\" & '6000'!A69))","v":0},{"$f":"IF(ISBLANK(A69), 0, SUMIFS(Registros!F:F, Registros!A:A, \">=\" & fecha_inicial, Registros!A:A, \"<=\" & fecha_final,  Registros!B:B, \"=\" & '6000'!A69))","v":0},0]
[6411,"Código de Cuenta Incorrecto",{"$f":"IF(ISBLANK(A70),0, SUMIFS(Registros!E:E,Registros!A:A,\"<\"&fecha_inicial,Registros!B:B,\"=\"&'6000'!A70)) - IF(ISBLANK(A70),0, SUMIFS(Registros!F:F,Registros!A:A,\"<\"&fecha_inicial,Registros!B:B,\"=\"&'6000'!A70))","v":0},{"$f":"IF(ISBLANK(A70), 0, SUMIFS(Registros!E:E, Registros!A:A, \">=\" & fecha_inicial, Registros!A:A, \"<=\" & fecha_final,  Registros!B:B, \"=\" & '6000'!A70))","v":0},{"$f":"IF(ISBLANK(A70), 0, SUMIFS(Registros!F:F, Registros!A:A, \">=\" & fecha_inicial, Registros!A:A, \"<=\" & fecha_final,  Registros!B:B, \"=\" & '6000'!A70))","v":0},0]
[6412,"Código de Cuenta Incorrecto",{"$f":"IF(ISBLANK(A71),0, SUMIFS(Registros!E:E,Registros!A:A,\"<\"&fecha_inicial,Registros!B:B,\"=\"&'6000'!A71)) - IF(ISBLANK(A71),0, SUMIFS(Registros!F:F,Registros!A:A,\"<\"&fecha_inicial,Registros!B:B,\"=\"&'6000'!A71))","v":0},{"$f":"IF(ISBLANK(A71), 0, SUMIFS(Registros!E:E, Registros!A:A, \">=\" & fecha_inicial, Registros!A:A, \"<=\" & fecha_final,  Registros!B:B, \"=\" & '6000'!A71))","v":0},{"$f":"IF(ISBLANK(A71), 0, SUMIFS(Registros!F:F, Registros!A:A, \">=\" & fecha_inicial, Registros!A:A, \"<=\" & fecha_final,  Registros!B:B, \"=\" & '6000'!A71))","v":0},0]
[6413,"Código de Cuenta Incorrecto",{"$f":"IF(ISBLANK(A72),0, SUMIFS(Registros!E:E,Registros!A:A,\"<\"&fecha_inicial,Registros!B:B,\"=\"&'6000'!A72)) - IF(ISBLANK(A72),0, SUMIFS(Registros!F:F,Registros!A:A,\"<\"&fecha_inicial,Registros!B:B,\"=\"&'6000'!A72))","v":0},{"$f":"IF(ISBLANK(A72), 0, SUMIFS(Registros!E:E, Registros!A:A, \">=\" & fecha_inicial, Registros!A:A, \"<=\" & fecha_final,  Registros!B:B, \"=\" & '6000'!A72))","v":0},{"$f":"IF(ISBLANK(A72), 0, SUMIFS(Registros!F:F, Registros!A:A, \">=\" & fecha_inicial, Registros!A:A, \"<=\" & fecha_final,  Registros!B:B, \"=\" & '6000'!A72))","v":0},0]
[6414,"Código de Cuenta Incorrecto",{"$f":"IF(ISBLANK(A73),0, SUMIFS(Registros!E:E,Registros!A:A,\"<\"&fecha_inicial,Registros!B:B,\"=\"&'6000'!A73)) - IF(ISBLANK(A73),0, SUMIFS(Registros!F:F,Registros!A:A,\"<\"&fecha_inicial,Registros!B:B,\"=\"&'6000'!A73))","v":0},{"$f":"IF(ISBLANK(A73), 0, SUMIFS(Registros!E:E, Registros!A:A, \">=\" & fecha_inicial, Registros!A:A, \"<=\" & fecha_final,  Registros!B:B, \"=\" & '6000'!A73))","v":0},{"$f":"IF(ISBLANK(A73), 0, SUMIFS(Registros!F:F, Registros!A:A, \">=\" & fecha_inicial, Registros!A:A, \"<=\" & fecha_final,  Registros!B:B, \"=\" & '6000'!A73))","v":0},0]
[6415,"Código de Cuenta Incorrecto",{"$f":"IF(ISBLANK(A74),0, SUMIFS(Registros!E:E,Registros!A:A,\"<\"&fecha_inicial,Registros!B:B,\"=\"&'6000'!A74)) - IF(ISBLANK(A74),0, SUMIFS(Registros!F:F,Registros!A:A,\"<\"&fecha_inicial,Registros!B:B,\"=\"&'6000'!A74))","v":0},{"$f":"IF(ISBLANK(A74), 0, SUMIFS(Registros!E:E, Registros!A:A, \">=\" & fecha_inicial, Registros!A:A, \"<=\" & fecha_final,  Registros!B:B, \"=\" & '6000'!A74))","v":0},{"$f":"IF(ISBLANK(A74), 0, SUMIFS(Registros!F:F, Registros!A:A, \">=\" & fecha_inicial, Registros!A:A, \"<=\" & fecha_final,  Registros!B:B, \"=\" & '6000'!A74))","v":0},0]
[{"$f":"\"SALDO FINAL DE LA CUENTA AL \" &TEXT(fecha_final, \"dd\")&\" DE \"&UPPER(TEXT(fecha_final, \"MMMM\"))&\" DEL \"& TEXT(fecha_final, \"YYYY\")","v":"SALDO FINAL DE LA CUENTA AL 00 DE ENERO DEL 1900"},null,{"$f":"C11+C27+C43+C59","v":0},{"$f":"D11+D27+D43+D59","v":0},{"$f":"E11+E27+E43+E59","v":0},{"$f":"C75+D75-E75","v":0}]
[]
[]
[]
[]
["ELABORA",null,null,null,"REVISA"]
[{"$f":"VLOOKUP(A80, Usuarios!B12:E14, 2, FALSE)","v":"Arlen de Jesús Baltodano López"},null,null,null,{"$f":"VLOOKUP(E80, Usuarios!B12:E14, 2, FALSE)","v":"Gersan Arguello Prado"}]
[{"$f":"VLOOKUP(A80, Usuarios!B12:E14, 4, FALSE)","v":"Auxiliar de Contabilidad"},null,null,null,{"$f":"VLOOKUP(E80, Usuarios!B12:E14, 4, FALSE)","v":"Contador General"}]
[]
[]
[null,null,"AUTORIZA"]
[null,null,{"$f":"VLOOKUP(C85, Usuarios!B12:E14, 2, FALSE)","v":"Matilda Padilla Mayorga"}]
[null,null,{"$f":"VLOOKUP(C85, Usuarios!B12:E14, 4, FALSE)","v":"Gerente de Finanzas"}]