{"text_format":"1","workbook":"xlsx","n_sheets":19,"sheets":["Link","MEN","IDT","ABS","DES","KOG","PSI","AFE","OBS","DIR","TEM","JUR","PRA","PRO","POR","REK","PET","FormNDS","FormNAT"],"not_rendered":{"charts":0,"images":33,"macros":1,"external_links":0,"defined_names":50,"comments":0,"pivot_tables":0},"unopened":[],"bounds":{"document_bytes":16777216,"sheet_cells":100000,"rows_first":2000,"rows_last":500,"rows_between":2000,"halvings":0,"cell_chars":16384,"cell_head_chars":4096},"cells_cut":0,"cells_raw":0,"read":"whole","date_system":"1900"}

{"sheet":"Link","index":0,"n_rows":40,"n_cols":13,"rows_kept":40,"cut":false,"hidden":false,"merged":[[0,11,1,11],[0,12,1,12],[0,3,0,5],[0,0,1,0],[0,1,1,1],[0,2,1,2],[0,6,0,8],[0,9,0,10]]}
["No","NIS",{"$f":"CONCATENATE(\"Nama Siswa :  \",ABS!AC6)","v":"Nama Siswa :  001"},"Pengetahuan (KI-3)",null,null,"Ketrampilan (KI-4)",null,null,"Sikap Spiritual dan Sosial (KI-1 dan KI-2)",null,"Nama Guru","Kelas"]
[null,null,null,"Angka","Predikat","Deskripsi","Angka","Predikat","Deskripsi","Predikat","Deskripsi"]
[{"$f":"REK!B11","v":1},{"$f":"REK!C11","v":12419},{"$f":"REK!D11","v":"Adhitya Ferdi Kristianto"},{"$f":"REK!E11","v":""},{"$f":"REK!F11","v":""},{"$f":"REK!G11","v":""},{"$f":"REK!H11","v":""},{"$f":"REK!I11","v":""},{"$f":"REK!J11","v":""},{"$f":"REK!K11","v":""},{"$f":"REK!L11","v":""},{"$f":"REK!E4","v":""},{"$f":"REK!J3","v":""}]
[{"$f":"REK!B12","v":2},{"$f":"REK!C12","v":12428},{"$f":"REK!D12","v":"Agung Dwi Saputro"},{"$f":"REK!E12","v":""},{"$f":"REK!F12","v":""},{"$f":"REK!G12","v":""},{"$f":"REK!H12","v":""},{"$f":"REK!I12","v":""},{"$f":"REK!J12","v":""},{"$f":"REK!K12","v":""},{"$f":"REK!L12","v":""},{"$f":"L3","v":""},{"$f":"M3","v":""}]
[{"$f":"REK!B13","v":3},{"$f":"REK!C13","v":12453},{"$f":"REK!D13","v":"Anissa Dhea Paramitha"},{"$f":"REK!E13","v":""},{"$f":"REK!F13","v":""},{"$f":"REK!G13","v":""},{"$f":"REK!H13","v":""},{"$f":"REK!I13","v":""},{"$f":"REK!J13","v":""},{"$f":"REK!K13","v":""},{"$f":"REK!L13","v":""},{"$f":"L4","v":""},{"$f":"M4","v":""}]
[{"$f":"REK!B14","v":4},{"$f":"REK!C14","v":12455},{"$f":"REK!D14","v":"Aprilia Desi Laraswati"},{"$f":"REK!E14","v":""},{"$f":"REK!F14","v":""},{"$f":"REK!G14","v":""},{"$f":"REK!H14","v":""},{"$f":"REK!I14","v":""},{"$f":"REK!J14","v":""},{"$f":"REK!K14","v":""},{"$f":"REK!L14","v":""},"",""]
[{"$f":"REK!B15","v":5},{"$f":"REK!C15","v":12479},{"$f":"REK!D15","v":"Bagas Adifirmansyah"},{"$f":"REK!E15","v":""},{"$f":"REK!F15","v":""},{"$f":"REK!G15","v":""},{"$f":"REK!H15","v":""},{"$f":"REK!I15","v":""},{"$f":"REK!J15","v":""},{"$f":"REK!K15","v":""},{"$f":"REK!L15","v":""},"",""]
[{"$f":"REK!B16","v":6},{"$f":"REK!C16","v":12498},{"$f":"REK!D16","v":"Dela Shabrina"},{"$f":"REK!E16","v":""},{"$f":"REK!F16","v":""},{"$f":"REK!G16","v":""},{"$f":"REK!H16","v":""},{"$f":"REK!I16","v":""},{"$f":"REK!J16","v":""},{"$f":"REK!K16","v":""},{"$f":"REK!L16","v":""},"",""]
[{"$f":"REK!B17","v":7},{"$f":"REK!C17","v":12501},{"$f":"REK!D17","v":"Desti Rani Indriyani"},{"$f":"REK!E17","v":""},{"$f":"REK!F17","v":""},{"$f":"REK!G17","v":""},{"$f":"REK!H17","v":""},{"$f":"REK!I17","v":""},{"$f":"REK!J17","v":""},{"$f":"REK!K17","v":""},{"$f":"REK!L17","v":""},"",""]
[{"$f":"REK!B18","v":8},{"$f":"REK!C18","v":12508},{"$f":"REK!D18","v":"Dewi Suciati Fauzun"},{"$f":"REK!E18","v":""},{"$f":"REK!F18","v":""},{"$f":"REK!G18","v":""},{"$f":"REK!H18","v":""},{"$f":"REK!I18","v":""},{"$f":"REK!J18","v":""},{"$f":"REK!K18","v":""},{"$f":"REK!L18","v":""},"",""]
[{"$f":"REK!B19","v":9},{"$f":"REK!C19","v":12516},{"$f":"REK!D19","v":"Dimas Nusantara Adi"},{"$f":"REK!E19","v":""},{"$f":"REK!F19","v":""},{"$f":"REK!G19","v":""},{"$f":"REK!H19","v":""},{"$f":"REK!I19","v":""},{"$f":"REK!J19","v":""},{"$f":"REK!K19","v":""},{"$f":"REK!L19","v":""},"",""]
[{"$f":"REK!B20","v":10},{"$f":"REK!C20","v":12529},{"$f":"REK!D20","v":"Edo Wanda Prastyo"},{"$f":"REK!E20","v":""},{"$f":"REK!F20","v":""},{"$f":"REK!G20","v":""},{"$f":"REK!H20","v":""},{"$f":"REK!I20","v":""},{"$f":"REK!J20","v":""},{"$f":"REK!K20","v":""},{"$f":"REK!L20","v":""},"",""]
[{"$f":"REK!B21","v":11},{"$f":"REK!C21","v":12537},{"$f":"REK!D21","v":"Entin Taat Arumningtias"},{"$f":"REK!E21","v":""},{"$f":"REK!F21","v":""},{"$f":"REK!G21","v":""},{"$f":"REK!H21","v":""},{"$f":"REK!I21","v":""},{"$f":"REK!J21","v":""},{"$f":"REK!K21","v":""},{"$f":"REK!L21","v":""},"",""]
[{"$f":"REK!B22","v":12},{"$f":"REK!C22","v":12544},{"$f":"REK!D22","v":"Fajar Adi Pamungkas"},{"$f":"REK!E22","v":""},{"$f":"REK!F22","v":""},{"$f":"REK!G22","v":""},{"$f":"REK!H22","v":""},{"$f":"REK!I22","v":""},{"$f":"REK!J22","v":""},{"$f":"REK!K22","v":""},{"$f":"REK!L22","v":""},"",""]
[{"$f":"REK!B23","v":13},{"$f":"REK!C23","v":12796},{"$f":"REK!D23","v":"Frendy Lasmana Putra"},{"$f":"REK!E23","v":""},{"$f":"REK!F23","v":""},{"$f":"REK!G23","v":""},{"$f":"REK!H23","v":""},{"$f":"REK!I23","v":""},{"$f":"REK!J23","v":""},{"$f":"REK!K23","v":""},{"$f":"REK!L23","v":""},"",""]
[{"$f":"REK!B24","v":14},{"$f":"REK!C24","v":12204},{"$f":"REK!D24","v":"Gana Ridho Akbar"},{"$f":"REK!E24","v":""},{"$f":"REK!F24","v":""},{"$f":"REK!G24","v":""},{"$f":"REK!H24","v":""},{"$f":"REK!I24","v":""},{"$f":"REK!J24","v":""},{"$f":"REK!K24","v":""},{"$f":"REK!L24","v":""},"",""]
[{"$f":"REK!B25","v":15},{"$f":"REK!C25","v":12588},{"$f":"REK!D25","v":"Indra Cahya Permana"},{"$f":"REK!E25","v":""},{"$f":"REK!F25","v":""},{"$f":"REK!G25","v":""},{"$f":"REK!H25","v":""},{"$f":"REK!I25","v":""},{"$f":"REK!J25","v":""},{"$f":"REK!K25","v":""},{"$f":"REK!L25","v":""},"",""]
[{"$f":"REK!B26","v":16},{"$f":"REK!C26","v":12598},{"$f":"REK!D26","v":"Ismia Nivrendita"},{"$f":"REK!E26","v":""},{"$f":"REK!F26","v":""},{"$f":"REK!G26","v":""},{"$f":"REK!H26","v":""},{"$f":"REK!I26","v":""},{"$f":"REK!J26","v":""},{"$f":"REK!K26","v":""},{"$f":"REK!L26","v":""},"",""]
[{"$f":"REK!B27","v":17},{"$f":"REK!C27","v":12606},{"$f":"REK!D27","v":"Krista Ikawan"},{"$f":"REK!E27","v":""},{"$f":"REK!F27","v":""},{"$f":"REK!G27","v":""},{"$f":"REK!H27","v":""},{"$f":"REK!I27","v":""},{"$f":"REK!J27","v":""},{"$f":"REK!K27","v":""},{"$f":"REK!L27","v":""},"",""]
[{"$f":"REK!B28","v":18},{"$f":"REK!C28","v":12612},{"$f":"REK!D28","v":"Lestari"},{"$f":"REK!E28","v":""},{"$f":"REK!F28","v":""},{"$f":"REK!G28","v":""},{"$f":"REK!H28","v":""},{"$f":"REK!I28","v":""},{"$f":"REK!J28","v":""},{"$f":"REK!K28","v":""},{"$f":"REK!L28","v":""},"",""]
[{"$f":"REK!B29","v":19},{"$f":"REK!C29","v":12628},{"$f":"REK!D29","v":"Miasari Sholaiha"},{"$f":"REK!E29","v":""},{"$f":"REK!F29","v":""},{"$f":"REK!G29","v":""},{"$f":"REK!H29","v":""},{"$f":"REK!I29","v":""},{"$f":"REK!J29","v":""},{"$f":"REK!K29","v":""},{"$f":"REK!L29","v":""},"",""]
[{"$f":"REK!B30","v":20},{"$f":"REK!C30","v":12629},{"$f":"REK!D30","v":"Modis Iyonda"},{"$f":"REK!E30","v":""},{"$f":"REK!F30","v":""},{"$f":"REK!G30","v":""},{"$f":"REK!H30","v":""},{"$f":"REK!I30","v":""},{"$f":"REK!J30","v":""},{"$f":"REK!K30","v":""},{"$f":"REK!L30","v":""},"",""]
[{"$f":"REK!B31","v":21},{"$f":"REK!C31","v":12639},{"$f":"REK!D31","v":"Muhammad Agni Farras"},{"$f":"REK!E31","v":""},{"$f":"REK!F31","v":""},{"$f":"REK!G31","v":""},{"$f":"REK!H31","v":""},{"$f":"REK!I31","v":""},{"$f":"REK!J31","v":""},{"$f":"REK!K31","v":""},{"$f":"REK!L31","v":""},"",""]
[{"$f":"REK!B32","v":22},{"$f":"REK!C32","v":12673},{"$f":"REK!D32","v":"Pratomo Setyo Aji"},{"$f":"REK!E32","v":""},{"$f":"REK!F32","v":""},{"$f":"REK!G32","v":""},{"$f":"REK!H32","v":""},{"$f":"REK!I32","v":""},{"$f":"REK!J32","v":""},{"$f":"REK!K32","v":""},{"$f":"REK!L32","v":""},"",""]
[{"$f":"REK!B33","v":23},{"$f":"REK!C33","v":12674},{"$f":"REK!D33","v":"Puji Lestari"},{"$f":"REK!E33","v":""},{"$f":"REK!F33","v":""},{"$f":"REK!G33","v":""},{"$f":"REK!H33","v":""},{"$f":"REK!I33","v":""},{"$f":"REK!J33","v":""},{"$f":"REK!K33","v":""},{"$f":"REK!L33","v":""},"",""]
[{"$f":"REK!B34","v":24},{"$f":"REK!C34","v":12701},{"$f":"REK!D34","v":"Rindra Alriyan"},{"$f":"REK!E34","v":""},{"$f":"REK!F34","v":""},{"$f":"REK!G34","v":""},{"$f":"REK!H34","v":""},{"$f":"REK!I34","v":""},{"$f":"REK!J34","v":""},{"$f":"REK!K34","v":""},{"$f":"REK!L34","v":""},"",""]
[{"$f":"REK!B35","v":25},{"$f":"REK!C35","v":12729},{"$f":"REK!D35","v":"Sinta Anggraeni"},{"$f":"REK!E35","v":""},{"$f":"REK!F35","v":""},{"$f":"REK!G35","v":""},{"$f":"REK!H35","v":""},{"$f":"REK!I35","v":""},{"$f":"REK!J35","v":""},{"$f":"REK!K35","v":""},{"$f":"REK!L35","v":""},"",""]
[{"$f":"REK!B36","v":26},{"$f":"REK!C36","v":12734},{"$f":"REK!D36","v":"Sofi"},{"$f":"REK!E36","v":""},{"$f":"REK!F36","v":""},{"$f":"REK!G36","v":""},{"$f":"REK!H36","v":""},{"$f":"REK!I36","v":""},{"$f":"REK!J36","v":""},{"$f":"REK!K36","v":""},{"$f":"REK!L36","v":""},"",""]
[{"$f":"REK!B37","v":27},{"$f":"REK!C37","v":12745},{"$f":"REK!D37","v":"Tika Wulandari"},{"$f":"REK!E37","v":""},{"$f":"REK!F37","v":""},{"$f":"REK!G37","v":""},{"$f":"REK!H37","v":""},{"$f":"REK!I37","v":""},{"$f":"REK!J37","v":""},{"$f":"REK!K37","v":""},{"$f":"REK!L37","v":""},"",""]
[{"$f":"REK!B38","v":28},{"$f":"REK!C38","v":12747},{"$f":"REK!D38","v":"Tomy Faizal Manaf"},{"$f":"REK!E38","v":""},{"$f":"REK!F38","v":""},{"$f":"REK!G38","v":""},{"$f":"REK!H38","v":""},{"$f":"REK!I38","v":""},{"$f":"REK!J38","v":""},{"$f":"REK!K38","v":""},{"$f":"REK!L38","v":""},"",""]
[{"$f":"REK!B39","v":29},{"$f":"REK!C39","v":12748},{"$f":"REK!D39","v":"Toni Gunawan"},{"$f":"REK!E39","v":""},{"$f":"REK!F39","v":""},{"$f":"REK!G39","v":""},{"$f":"REK!H39","v":""},{"$f":"REK!I39","v":""},{"$f":"REK!J39","v":""},{"$f":"REK!K39","v":""},{"$f":"REK!L39","v":""},"",""]
[{"$f":"REK!B40","v":30},{"$f":"REK!C40","v":12757},{"$f":"REK!D40","v":"Vevy Dyas Lestari"},{"$f":"REK!E40","v":""},{"$f":"REK!F40","v":""},{"$f":"REK!G40","v":""},{"$f":"REK!H40","v":""},{"$f":"REK!I40","v":""},{"$f":"REK!J40","v":""},{"$f":"REK!K40","v":""},{"$f":"REK!L40","v":""},"",""]
[{"$f":"REK!B41","v":31},{"$f":"REK!C41","v":12765},{"$f":"REK!D41","v":"Wahyu Ardhi Gunawan"},{"$f":"REK!E41","v":""},{"$f":"REK!F41","v":""},{"$f":"REK!G41","v":""},{"$f":"REK!H41","v":""},{"$f":"REK!I41","v":""},{"$f":"REK!J41","v":""},{"$f":"REK!K41","v":""},{"$f":"REK!L41","v":""},"",""]
[{"$f":"REK!B42","v":32},{"$f":"REK!C42","v":12767},{"$f":"REK!D42","v":"Widi Pangestu"},{"$f":"REK!E42","v":""},{"$f":"REK!F42","v":""},{"$f":"REK!G42","v":""},{"$f":"REK!H42","v":""},{"$f":"REK!I42","v":""},{"$f":"REK!J42","v":""},{"$f":"REK!K42","v":""},{"$f":"REK!L42","v":""},"",""]
[{"$f":"REK!B43","v":33},{"$f":"REK!C43","v":12784},{"$f":"REK!D43","v":"Yuli Atifah"},{"$f":"REK!E43","v":""},{"$f":"REK!F43","v":""},{"$f":"REK!G43","v":""},{"$f":"REK!H43","v":""},{"$f":"REK!I43","v":""},{"$f":"REK!J43","v":""},{"$f":"REK!K43","v":""},{"$f":"REK!L43","v":""},"",""]
[{"$f":"REK!B44","v":34},{"$f":"REK!C44","v":12788},{"$f":"REK!D44","v":"Yusuf Dwi Prasetya"},{"$f":"REK!E44","v":""},{"$f":"REK!F44","v":""},{"$f":"REK!G44","v":""},{"$f":"REK!H44","v":""},{"$f":"REK!I44","v":""},{"$f":"REK!J44","v":""},{"$f":"REK!K44","v":""},{"$f":"REK!L44","v":""},"",""]
[{"$f":"REK!B45","v":""},{"$f":"REK!C45","v":""},{"$f":"REK!D45","v":""},{"$f":"REK!E45","v":""},{"$f":"REK!F45","v":""},{"$f":"REK!G45","v":""},{"$f":"REK!H45","v":""},{"$f":"REK!I45","v":""},{"$f":"REK!J45","v":""},{"$f":"REK!K45","v":""},{"$f":"REK!L45","v":""},"",""]
[{"$f":"REK!B46","v":""},{"$f":"REK!C46","v":""},{"$f":"REK!D46","v":""},{"$f":"REK!E46","v":""},{"$f":"REK!F46","v":""},{"$f":"REK!G46","v":""},{"$f":"REK!H46","v":""},{"$f":"REK!I46","v":""},{"$f":"REK!J46","v":""},{"$f":"REK!K46","v":""},{"$f":"REK!L46","v":""},"",""]
[{"$f":"REK!B47","v":""},{"$f":"REK!C47","v":""},{"$f":"REK!D47","v":""},{"$f":"REK!E47","v":""},{"$f":"REK!F47","v":""},{"$f":"REK!G47","v":""},{"$f":"REK!H47","v":""},{"$f":"REK!I47","v":""},{"$f":"REK!J47","v":""},{"$f":"REK!K47","v":""},{"$f":"REK!L47","v":""},"",""]
[{"$f":"REK!B48","v":""},{"$f":"REK!C48","v":""},{"$f":"REK!D48","v":""},{"$f":"REK!E48","v":""},{"$f":"REK!F48","v":""},{"$f":"REK!G48","v":""},{"$f":"REK!H48","v":""},{"$f":"REK!I48","v":""},{"$f":"REK!J48","v":""},{"$f":"REK!K48","v":""},{"$f":"REK!L48","v":""},"",""]

{"sheet":"MEN","index":1,"n_rows":14,"n_cols":7,"rows_kept":14,"cut":false,"hidden":false,"merged":[[13,1,15,18],[9,6,10,9],[5,6,8,9],[11,6,11,9],[5,10,11,13],[2,15,11,17]]}
[]
[]
[null,null,null,null,null,"PROGRAM PENILAIAN UNTUK KURIKULUM 2013"]
[null,null,null,null,null,{"$f":"IDT!V4","v":"SMP NEGERI 1 KALIWIRO"}]
[]
[]
[]
[]
[]
[null,null,null,null,null,null,{"$f":"IDT!V5","v":"Jln. Selomanik Km. 76 Kaliwiro, Wonosobo"}]
[]
[]
[null,null,"Versi 2013-003"]
[null,"Aplikasi ini gratis untuk siapa saja yang berminat, khususnya sekolah-sekolah SMP, SMA, dan SMK yang karena keterbatasan waktu dan kesempatan\nsehingga pihak sekolah belum sempat membuatnya. Silahkan dipakai, dimodifikasi dulu sesuai kebutuhan sekolah anda, atau di klaim buatan sekolah anda. \nJika Ada Kesulitan bisa menghubungi Bp. Drs. Supriyanto (Guru Kimia di SMA Muhammadiyah Wonosobo) di No. HP. 0888 0669 4521. Trims"]

{"sheet":"IDT","index":2,"n_rows":72,"n_cols":22,"rows_kept":72,"cut":false,"hidden":false,"merged":[]}
[]
["Skor","Nilai",null,"Urut","Kode\nGuru","Nama Lengkap Guru","Jenis ID","NIP/NBM/NUPTK","Mengajar Mapel",null,"No. Urut","Kode Tingkat","Kode Paralel","Paralel","Kelas","Kode Kelas","Wali kelas","Nama Wali",null,"Identitas Sekolah"]
[1,59,null,1,"A","Hidayat, SPd, MM","NIP","123456788","IPA",".",1,7,"01","A",{"$f":"IF(K3=\"\",\"\",CONCATENATE(L3,\".\",N3))","v":"7.A"},{"$f":"IF(K3=\"\",\"\",CONCATENATE(L3,M3))","v":"701"},"C",{"$f":"IFERROR(VLOOKUP(Q3,DATAGURU,2,FALSE),\"\")","v":"Supriyandono, SPd"},null,"NPSN",":",20306793]
[43,60,null,2,"B","Siswoyo","NIP","123456789","Bahasa Jawa",".",{"$f":"IF(L4=\"\",\"\",K3+1)","v":2},7,"02","B",{"$f":"IF(K4=\"\",\"\",CONCATENATE(L4,\".\",N4))","v":"7.B"},{"$f":"IF(K4=\"\",\"\",CONCATENATE(L4,M4))","v":"702"},"D","Bagyo Setyo Yuwono, SPd",null,"Nama Sekolah",":","SMP NEGERI 1 KALIWIRO"]
[45,61,null,3,"C","Supriyandono, SPd","NIP","123456790","Penjasorkes",".",{"$f":"IF(L5=\"\",\"\",K4+1)","v":3},7,"03","C","7.C","703","K","R. Kisworo J Maryono, SPd",null,"Alamat Sekolah",":","Jln. Selomanik Km. 76 Kaliwiro, Wonosobo"]
[48,62,null,4,"D","Bagyo Setyo Yuwono, SPd","NIP","123456791","Bahasa Indonesia",".",4,7,"04","D","7.D","704","L","Ruwiyatun, SPd",null,"Tahun Pelajaran",":","2013/2014"]
[51,63,null,5,"E","Nurtitik","NIP","123456792","Seni Budaya & Ketrampilan",".",5,7,"05","E","7.E","705","V","Madiem, SPd",null,"Semester",":","Genap"]
[54,64,null,6,"F","Drs. Hermawan BS","NIP","123456793","IPS",".",6,8,"01","A","8.A","801",null,"",null,"KKM Skala 100",":",65]
[57,65,null,7,"G","Cukup Edi, SPd","NIP","123456794","IPS",".",7,8,"02","B","8.B","802",null,"",null,"KKM Skala 4",":",2.66]
[60,66,null,8,"H","Sunardi, SPd","NIP","123456795","BK",".",8,8,"03","C","8.C","803",null,""]
[63,67,null,9,"I","Uji Watiyah","NIP","123456796","Matematika",".",9,8,"04","D","8.D","804",null,""]
[65,68,null,10,"J","John Anwar","NIP","123456797","IPA",".",10,8,"05","E","8.E","805",null,""]
[68,69,null,11,"K","R. Kisworo J Maryono, SPd","NIP","123456798","IPS",".",11,9,"01","A","9.A","901",null,""]
[71,70,null,12,"L","Ruwiyatun, SPd","NIP","123456799","IPA",".",12,9,"02","B","9.B","902",null,""]
[74,71,null,13,"M","Siti Nurchasanah, SPd","NIP","123456800","PKn",".",13,9,"03","C","9.C","903",null,""]
[77,72,null,14,"N","Sumiyati, SPd","NIP","123456801","Matematika",".",14,9,"04","D","9.D","904",null,""]
[80,73,null,15,"O","Anom Hermianto P, SPd","NIP","123456802","Matematika",".",15,9,"05","E","9.E","905",null,""]
[83,74,null,16,"P","Esti Sukartini, SS","NIP","123456803","Bahasa Inggris",".","",null,null,null,"","",null,""]
[85,75,null,17,"Q","Ina Wijayanti, SPd","NIP","123456804","Bahasa Jawa",".","",null,null,null,"","",null,""]
[87,76,null,18,"R","Hestiningdyah K, SPd","NIP","123456805","PKn",".","",null,null,null,"","",null,""]
[90,77,null,19,"S","Pipit Purwaningrum, SPd","NIP","123456806","Bahasa Indonesia",".","",null,null,null,"","",null,""]
[92,78,null,20,"T","Dyah Nuraeni, SPd","NIP","123456807","Bahasa Inggris",".","",null,null,null,"","",null,""]
[95,79,null,21,"U","Iwan Kurnianto, SPd","NIP","123456808","Bahasa Inggris",".","",null,null,null,"","",null,""]
[98,80,null,22,"V","Madiem, SPd","NIP","123456809","Penjasorkes",".","",null,null,null,"","",null,""]
[101,81,null,23,"W","Nugroho R, Ssos","NIP","123456810","Seni Budaya & Ketrampilan",".","",null,null,null,"","",null,""]
[103,82,null,24,"X","Hernis Mundari, SPd","NIP","123456811","Bahasa Inggris",".","",null,null,null,"","",null,""]
[106,83,null,25,"Y","Adam Ismail, SPd","NIP","123456812","PAI",".","",null,null,null,"","",null,""]
[109,84,null,26,"Z","Siti Alfiyah, SPd","NIP","123456813","IPA",".","",null,null,null,"","",null,""]
[111,85,null,27,"A1","Eni Ismawati, SPd","NIP","123456814","PAI",".","",null,null,null,"","",null,""]
[114,86,null,28,"A2",null,null,null,null,".","",null,null,null,"","",null,""]
[117,87,null,29,"A3",null,null,null,null,".","",null,null,null,"","",null,""]
[120,88,null,30,"A4",null,null,null,null,".","",null,null,null,"",""]
[122,89,null,31,"A5",null,null,null,null,"."]
[125,90,null,32,"A6",null,null,null,null,".","Kode","Nama Mapel"]
[127,91,null,33,"A7",null,null,null,null,".","001","Pendidikan Agama dan Budi Pekerti"]
[130,92,null,34,"A8",null,null,null,null,".","002","Pendidikan Pancasila dan Kewarganegaraan"]
[134,93,null,35,"A9",null,null,null,null,".","003","Bahasa Indonesia"]
[139,94,null,36,"A10",null,null,null,null,".","004","Matematika"]
[143,95,null,37,"A11",null,null,null,null,".","005","Ilmu Pengetahuan Alam"]
[148,96,null,38,"A12",null,null,null,null,".","006","Ilmu Pengetahuan Sosial"]
[153,97,null,39,"A13",null,null,null,null,".","007","Bahasa Inggris"]
[157,98,null,40,"A14",null,null,null,null,".","008","Seni Budaya"]
[162,99,null,41,"A15",null,null,null,null,".","009","Pendidikan Jasmani, Olah Raga dan Kesehatan"]
[166,100,null,42,"A16",null,null,null,null,".","010","Prakarya"]
[null,null,null,43,"A17",null,null,null,null,".","011","Bahasa Jawa"]
[null,null,null,44,"A18",null,null,null,null,".","012"]
[null,null,null,45,"A19",null,null,null,null,".","013"]
[null,null,null,46,"A20",null,null,null,null,".","014"]
[null,null,null,47,"A21",null,null,null,null,".","015"]
[null,null,null,48,"A22",null,null,null,null,".","016"]
[null,null,null,49,"A23",null,null,null,null,".","017"]
[null,null,null,50,"A24",null,null,null,null,".","018"]
[null,null,null,51,"A25",null,null,null,null,".","019"]
[null,null,null,52,"A26",null,null,null,null,".","020"]
[null,null,null,53,"A27",null,null,null,null,".","021"]
[null,null,null,54,"A28",null,null,null,null,".","022"]
[null,null,null,55,"A29",null,null,null,null,".","023"]
[null,null,null,56,"A30",null,null,null,null,".","024"]
[null,null,null,57,"A31",null,null,null,null,".","025"]
[null,null,null,58,"A32",null,null,null,null,null,"026"]
[null,null,null,59,"A33",null,null,null,null,null,"027"]
[null,null,null,60,"A34",null,null,null,null,null,"028"]
[null,null,null,61,"A35",null,null,null,null,null,"029"]
[null,null,null,62,"A36"]
[null,null,null,63,"A37"]
[null,null,null,64,"A38"]
[null,null,null,65,"A39"]
[null,null,null,66,"A40"]
[null,null,null,67,"A41"]
[null,null,null,68,"A42"]
[null,null,null,69,"A43"]
[null,null,null,70,"A44"]

{"sheet":"ABS","index":3,"n_rows":84,"n_cols":68,"rows_kept":84,"cut":false,"hidden":false,"merged":[[12,63,13,63],[12,64,13,64],[56,5,56,22],[57,5,57,22],[58,5,58,22],[12,61,13,61],[12,62,13,62],[12,50,13,50],[12,39,13,39],[12,40,13,40],[12,41,13,41],[12,42,13,42],[12,43,13,43],[12,44,13,44],[12,33,13,33],[12,34,13,34],[12,47,13,47],[12,48,13,48],[12,49,13,49],[12,60,13,60],[12,51,13,51],[12,52,13,52],[12,53,13,53],[12,54,13,54],[12,55,13,55],[12,56,13,56],[12,59,13,59],[59,5,59,22],[12,57,13,57],[12,58,13,58],[12,37,13,37],[12,38,13,38],[12,27,13,27],[12,28,13,28],[12,29,13,29],[12,30,13,30],[12,31,13,31],[12,25,13,25],[12,35,13,35],[12,22,13,22],[12,23,13,23],[12,45,13,45],[12,46,13,46],[12,11,13,11],[12,12,13,12],[12,13,13,13],[12,14,13,14],[12,26,13,26],[12,15,13,15],[12,16,13,16],[12,17,13,17],[12,20,13,20],[12,21,13,21],[12,18,13,18],[12,19,13,19],[12,24,13,24],[12,6,13,6],[12,7,13,7],[12,8,13,8],[12,9,13,9],[12,10,13,10],[12,36,13,36],[6,1,6,3],[4,1,4,3],[4,5,4,7],[4,8,4,9],[4,10,4,12],[6,5,6,11],[12,32,13,32],[7,1,7,3],[7,5,7,11],[9,1,13,1],[9,2,13,2],[9,3,13,3],[9,4,13,4],[9,5,13,5],[9,6,9,59],[9,60,11,64],[4,50,6,63],[6,14,6,18],[3,1,3,3],[3,25,3,27],[3,28,3,31],[4,28,4,29],[5,1,5,3],[5,17,5,21],[5,22,5,23],[5,28,5,29],[5,5,5,13],[3,5,3,13],[3,15,3,18],[4,15,4,18]]}
[]
[null,"PRESENSI SISWA MENGIKUTI PELAJARAN",null,null,null,null,null,null,null,null,null,null,null,null,null,null,null,null,null,null,null,null,null,null,null,null,null,null,null,null,null,null,"PETUNJUK PENGGUNAAN :",null,null,null,null,null,null,null,null,null,null,null,null,null,null,{"$f":"SUM(G56:BH56)","v":1}]
[]
[null,"Mata Pelajaran",null,null,"=",{"$f":"IFERROR(VLOOKUP(AC6,KODEMAPEL,2,FALSE),\"Kode Mapel Belum Diisi\")","v":"Pendidikan Agama dan Budi Pekerti"},null,null,null,null,null,null,null,null,null,"Jumlah KD",null,null,null,null,null,null,null,null,null,"Kelas =",null,null,{"$f":"IF(F15=\"\",\"\",F15)","v":"7.A"},null,null,null,null,"1. Isikan Kode Mapel dan Kode Guru",null,null,null,null,null,null,null,null,null,null,null,null,null,null,null,null,null,null,null,null,null,null,null,null,null,null,null,null,null,null,"."]
[2,"Tahun Pelajaran dan Semester",null,null,"=",{"$f":"TAHUNPELAJARAN","v":"2013/2014"},null,null,"dan",null,{"$f":"SEMESTER","v":"Genap"},null,null,null,null,3,null,null,null,null,null,null,null,null,null,null,null,"Jumlah Hari Efektif di Semester Ini =",null,null,"Hari",null,null,"2. Isikan Jumlah Hari Efektif di Semester ini",null,null,null,null,null,null,null,null,null,null,null,null,null,null,null,null,"S = Sakit  I = Ijin T = Terlambat A = Alpha     .  = Masuk",null,null,null,null,null,null,null,null,null,null,null,null,null,"S"]
[3,"Nama Guru Mata Pelajaran",null,null,"=",{"$f":"IFERROR(VLOOKUP(KODEGURU,DATAGURU,2,FALSE),\"Kode Guru Belum Diisi\")","v":"Siswoyo"},null,null,null,null,null,null,null,null,null,null,null,"Kode Guru =",null,null,null,null,"B",null,null,null,null,"Kode Mapel =","001",null,null,null,null,"3. Isikan Alokasi Jam Mengajar per minggunya",null,null,null,null,null,null,null,null,null,null,null,null,null,null,null,null,null,null,null,null,null,null,null,null,null,null,null,null,null,null,"I"]
[4,"Nama File Seharusnya",null,null,"=",{"$f":"IF(OR(W6=\"\",AC6=\"\"),\"\",CONCATENATE(MID(F5,3,2),RIGHT(F5,2),\"-\",VLOOKUP(AC4,KODEKELAS,2,FALSE),\"-\",IF(K5=\"Ganjil\",\"01\",\"02\"),\"-\",AC6,KODEGURU))","v":"1314-701-02-001B"},null,null,null,null,null,null,null,null,{"$f":"IF(F7=F8,\"Sudah Sama\",\"Nama File Belum Sama\")","v":"Nama File Belum Sama"},null,null,null,null,null,null,null,null,null,null,null,null,"Alokasi Jam Mengajar per Minggunya =",null,"Jam",null,null,null,"4. Rubahlah Nama File sesuai dengan Nama File Seharusnya",null,null,null,null,null,null,null,null,null,null,null,null,null,null,null,null,null,null,null,null,null,null,null,null,null,null,null,null,null,null,"T"]
[5,"Nama File Sebelum Dirubah",null,null,"=",{"$f":"WkbName()","v":"1314-701-02-001ProgranNilai_SMP"},null,null,null,null,null,null,null,null,null,null,null,null,null,null,null,null,null,null,null,null,null,"Jumlah Pertemuan Seharusnya dlm semester ini =",null,"Kali",null,null,null,"5. Isikan Tanggal Tatap Muka sesuai Jumlah pertemuannya",null,null,null,null,null,null,null,null,null,null,null,null,null,null,null,null,null,null,null,null,null,null,null,null,null,null,null,null,null,null,"A"]
[]
[null,"No.","NIS","Nama Lengkap Siswa","JK","Kelas","Pertemuan ke               Dan Tanggal Pertemuan",null,null,null,null,null,null,null,null,null,null,null,null,null,null,null,null,null,null,null,null,null,null,null,null,null,null,null,null,null,null,null,null,null,null,null,null,null,null,null,null,null,null,null,null,null,null,null,null,null,null,null,null,null,"JUMLAH"]
[null,null,null,null,null,null,1,{"$f":"IF($AC$7=\"\",\"\",IF(G11<$AC$8,G11+1,\"\"))","v":""},{"$f":"IF($AC$7=\"\",\"\",IF(H11<$AC$8,H11+1,\"\"))","v":""},"","","","","","","","","","","","","","","","","","","","","","","","","","","","","","","","","","","","","","","","","","","","","","","","","","",""]
[null,null,null,null,null,null,{"$f":"IF(G13=\"\",\"\",TEXT(WEEKDAY(G13),\"ddd\"))","v":"Wed"},{"$f":"IF(H13=\"\",\"\",TEXT(WEEKDAY(H13),\"ddd\"))","v":""},"","","","","","","","","","","","","","","","","","","","","","","","","","","","","","","","","","","","","","","","","","","","","","","","","","","",""]
[null,null,null,null,null,null,"2014-01-01",null,null,null,null,null,null,null,null,null,null,null,null,null,null,null,null,null,null,null,null,null,null,null,null,null,null,null,null,null,null,null,null,null,null,null,null,null,null,null,null,null,null,null,null,null,null,null,null,null,null,null,null,null,"S","I","T","A","Hadir"]
[]
[null,1,12419,"ADHITYA FERDI KRISTIANTO","L","7.A",null,null,null,null,null,null,null,null,null,null,null,null,null,null,null,null,null,null,null,null,null,null,null,null,null,null,null,null,null,null,null,null,null,null,null,null,null,null,null,null,null,null,null,null,null,null,null,null,null,null,null,null,null,null,{"$f":"IF(COUNTIF($H15:$BH15,\"S\")=0,\"\",COUNTIF($H15:$BH15,\"S\"))","v":""},{"$f":"IF(COUNTIF($H15:$BH15,\"I\")=0,\"\",COUNTIF($H15:$BH15,\"I\"))","v":""},{"$f":"IF(COUNTIF($H15:$BH15,\"T\")=0,\"\",COUNTIF($H15:$BH15,\"T\"))","v":""},{"$f":"IF(COUNTIF($H15:$BH15,\"A\")=0,\"\",COUNTIF($H15:$BH15,\"A\"))","v":""},{"$f":"IF(COUNTIF($G15:$BH15,\".\")=0,\"\",COUNTIF($G15:$BH15,\".\"))","v":""},null,{"$f":"IDT!K35","v":"001"},{"$f":"IDT!E3","v":"A"}]
[null,{"$f":"IF(D16=\"\",\"\",B15+1)","v":2},12428,"AGUNG DWI SAPUTRO","L",{"$f":"IF(D16=\"\",\"\",F15)","v":"7.A"},null,".",null,null,".",null,null,null,null,null,null,null,null,null,null,null,null,null,null,null,null,null,null,null,null,null,null,null,null,null,null,null,null,null,null,null,null,null,null,null,null,null,null,null,null,null,null,null,null,null,null,null,null,null,{"$f":"IF(COUNTIF($H16:$BH16,\"S\")=0,\"\",COUNTIF($H16:$BH16,\"S\"))","v":""},{"$f":"IF(COUNTIF($H16:$BH16,\"I\")=0,\"\",COUNTIF($H16:$BH16,\"I\"))","v":""},{"$f":"IF(COUNTIF($H16:$BH16,\"T\")=0,\"\",COUNTIF($H16:$BH16,\"T\"))","v":""},{"$f":"IF(COUNTIF($H16:$BH16,\"A\")=0,\"\",COUNTIF($H16:$BH16,\"A\"))","v":""},{"$f":"IF(COUNTIF($G16:$BH16,\".\")=0,\"\",COUNTIF($G16:$BH16,\".\"))","v":2},null,{"$f":"IDT!K36","v":"002"},{"$f":"IDT!E4","v":"B"}]
[null,{"$f":"IF(D17=\"\",\"\",B16+1)","v":3},12453,"ANISSA DHEA PARAMITHA","P",{"$f":"IF(D17=\"\",\"\",F16)","v":"7.A"},null,null,null,null,null,null,null,null,null,null,null,null,null,null,null,null,null,null,null,null,null,null,null,null,null,null,null,null,null,null,null,null,null,null,null,null,null,null,null,null,null,null,null,null,null,null,null,null,null,null,null,null,null,null,"","","","","",null,{"$f":"IDT!K37","v":"003"},{"$f":"IDT!E5","v":"C"}]
[null,4,12455,"APRILIA DESI LARASWATI","P","7.A",null,null,null,".",null,null,null,null,null,null,null,null,null,null,null,null,null,null,null,null,null,null,null,null,null,null,null,null,null,null,null,null,null,null,null,null,null,null,null,null,null,null,null,null,null,null,null,null,null,null,null,null,null,null,"","","","",1,null,{"$f":"IDT!K38","v":"004"},{"$f":"IDT!E6","v":"D"}]
[null,5,12479,"BAGAS ADIFIRMANSYAH","L","7.A",null,null,null,null,null,null,null,null,null,null,null,null,null,null,null,null,null,null,null,null,null,null,null,null,null,null,null,null,null,null,null,null,null,null,null,null,null,null,null,null,null,null,null,null,null,null,null,null,null,null,null,null,null,null,"","","","","",null,{"$f":"IDT!K39","v":"005"},{"$f":"IDT!E7","v":"E"}]
[null,6,12498,"DELA SHABRINA","P","7.A",null,null,null,null,null,null,null,null,null,null,null,null,null,null,null,null,null,null,null,null,null,null,null,null,null,null,null,null,null,null,null,null,null,null,null,null,null,null,null,null,null,null,null,null,null,null,null,null,null,null,null,null,null,null,"","","","","",null,{"$f":"IDT!K40","v":"006"},{"$f":"IDT!E8","v":"F"}]
[null,7,12501,"DESTI RANI INDRIYANI","P","7.A",null,null,null,null,null,null,null,null,null,null,null,null,null,null,null,null,null,null,null,null,null,null,null,null,null,null,null,null,null,null,null,null,null,null,null,null,null,null,null,null,null,null,null,null,null,null,null,null,null,null,null,null,null,null,"","","","","",null,{"$f":"IDT!K41","v":"007"},{"$f":"IDT!E9","v":"G"}]
[null,8,12508,"DEWI SUCIATI FAUZUN","P","7.A",null,null,null,null,null,null,null,null,null,null,null,null,null,null,null,null,null,null,null,null,null,null,null,null,null,null,null,null,null,null,null,null,null,null,null,null,null,null,null,null,null,null,null,null,null,null,null,null,null,null,null,null,null,null,"","","","","",null,{"$f":"IDT!K42","v":"008"},{"$f":"IDT!E10","v":"H"}]
[null,9,12516,"DIMAS NUSANTARA ADI","L","7.A",null,null,null,null,null,null,null,null,null,null,null,null,null,null,null,null,null,null,null,null,null,null,null,null,null,null,null,null,null,null,null,null,null,null,null,null,null,null,null,null,null,null,null,null,null,null,null,null,null,null,null,null,null,null,"","","","","",null,{"$f":"IDT!K43","v":"009"},{"$f":"IDT!E11","v":"I"}]
[null,10,12529,"EDO WANDA PRASTYO","L","7.A",null,null,null,null,null,null,null,null,null,null,null,null,null,null,null,null,null,null,null,null,null,null,null,null,null,null,null,null,null,null,null,null,null,null,null,null,null,null,null,null,null,null,null,null,null,null,null,null,null,null,null,null,null,null,"","","","","",null,{"$f":"IDT!K44","v":"010"},{"$f":"IDT!E12","v":"J"}]
[null,11,12537,"ENTIN TAAT ARUMNINGTIAS","P","7.A",null,null,null,null,null,null,null,null,null,null,null,null,null,null,null,null,null,null,null,null,null,null,null,null,null,null,null,null,null,null,null,null,null,null,null,null,null,null,null,null,null,null,null,null,null,null,null,null,null,null,null,null,null,null,"","","","","",null,{"$f":"IDT!K45","v":"011"},{"$f":"IDT!E13","v":"K"}]
[null,12,12544,"FAJAR ADI PAMUNGKAS","L","7.A",null,null,null,null,null,null,null,null,null,null,null,null,null,null,null,null,null,null,null,null,null,null,null,null,null,null,null,null,null,null,null,null,null,null,null,null,null,null,null,null,null,null,null,null,null,null,null,null,null,null,null,null,null,null,"","","","","",null,{"$f":"IDT!K46","v":"012"},{"$f":"IDT!E14","v":"L"}]
[null,13,12796,"FRENDY LASMANA PUTRA","L","7.A",null,null,null,null,null,null,null,null,null,null,null,null,null,null,null,null,null,null,null,null,null,null,null,null,null,null,null,null,null,null,null,null,null,null,null,null,null,null,null,null,null,null,null,null,null,null,null,null,null,null,null,null,null,null,"","","","","",null,{"$f":"IDT!K47","v":"013"},{"$f":"IDT!E15","v":"M"}]
[null,14,12204,"GANA RIDHO AKBAR","L","7.A",null,null,null,null,null,null,null,null,null,null,null,null,null,null,null,null,null,null,null,null,null,null,null,null,null,null,null,null,null,null,null,null,null,null,null,null,null,null,null,null,null,null,null,null,null,null,null,null,null,null,null,null,null,null,"","","","","",null,{"$f":"IDT!K48","v":"014"},{"$f":"IDT!E16","v":"N"}]
[null,15,12588,"INDRA CAHYA PERMANA","L","7.A",null,null,null,null,null,null,null,null,null,null,null,null,null,null,null,null,null,null,null,null,null,null,null,null,null,null,null,null,null,null,null,null,null,null,null,null,null,null,null,null,null,null,null,null,null,null,null,null,null,null,null,null,null,null,"","","","","",null,{"$f":"IDT!K49","v":"015"},{"$f":"IDT!E17","v":"O"}]
[null,16,12598,"ISMIA NIVRENDITA","P","7.A",null,null,null,null,null,null,null,null,null,null,null,null,null,null,null,null,null,null,null,null,null,null,null,null,null,null,null,null,null,null,null,null,null,null,null,null,null,null,null,null,null,null,null,null,null,null,null,null,null,null,null,null,null,null,"","","","","",null,{"$f":"IDT!K50","v":"016"},{"$f":"IDT!E18","v":"P"}]
[null,17,12606,"KRISTA IKAWAN","L","7.A",null,null,null,null,null,null,null,null,null,null,null,null,null,null,null,null,null,null,null,null,null,null,null,null,null,null,null,null,null,null,null,null,null,null,null,null,null,null,null,null,null,null,null,null,null,null,null,null,null,null,null,null,null,null,"","","","","",null,{"$f":"IDT!K51","v":"017"},{"$f":"IDT!E19","v":"Q"}]
[null,18,12612,"LESTARI","P","7.A",null,null,null,null,null,null,null,null,null,null,null,null,null,null,null,null,null,null,null,null,null,null,null,null,null,null,null,null,null,null,null,null,null,null,null,null,null,null,null,null,null,null,null,null,null,null,null,null,null,null,null,null,null,null,"","","","","",null,{"$f":"IDT!K52","v":"018"},{"$f":"IDT!E20","v":"R"}]
[null,19,12628,"MIASARI SHOLAIHA","P","7.A",null,null,null,null,null,null,null,null,null,null,null,null,null,null,null,null,null,null,null,null,null,null,null,null,null,null,null,null,null,null,null,null,null,null,null,null,null,null,null,null,null,null,null,null,null,null,null,null,null,null,null,null,null,null,"","","","","",null,{"$f":"IDT!K53","v":"019"},{"$f":"IDT!E21","v":"S"}]
[null,20,12629,"MODIS IYONDA","P","7.A",null,null,null,null,null,null,null,null,null,null,null,null,null,null,null,null,null,null,null,null,null,null,null,null,null,null,null,null,null,null,null,null,null,null,null,null,null,null,null,null,null,null,null,null,null,null,null,null,null,null,null,null,null,null,"","","","","",null,{"$f":"IDT!K54","v":"020"},{"$f":"IDT!E22","v":"T"}]
[null,21,12639,"MUHAMMAD AGNI FARRAS","L","7.A",null,null,null,null,null,null,null,null,null,null,null,null,null,null,null,null,null,null,null,null,null,null,null,null,null,null,null,null,null,null,null,null,null,null,null,null,null,null,null,null,null,null,null,null,null,null,null,null,null,null,null,null,null,null,"","","","","",null,{"$f":"IDT!K55","v":"021"},{"$f":"IDT!E23","v":"U"}]
[null,22,12673,"PRATOMO SETYO AJI","L","7.A",null,null,null,null,null,null,null,null,null,null,null,null,null,null,null,null,null,null,null,null,null,null,null,null,null,null,null,null,null,null,null,null,null,null,null,null,null,null,null,null,null,null,null,null,null,null,null,null,null,null,null,null,null,null,"","","","","",null,{"$f":"IDT!K56","v":"022"},{"$f":"IDT!E24","v":"V"}]
[null,23,12674,"PUJI LESTARI","P","7.A",null,null,null,null,null,null,null,null,null,null,null,null,null,null,null,null,null,null,null,null,null,null,null,null,null,null,null,null,null,null,null,null,null,null,null,null,null,null,null,null,null,null,null,null,null,null,null,null,null,null,null,null,null,null,"","","","","",null,{"$f":"IDT!K57","v":"023"},{"$f":"IDT!E25","v":"W"}]
[null,24,12701,"RINDRA ALRIYAN","L","7.A",null,null,null,null,null,null,null,null,null,null,null,null,null,null,null,null,null,null,null,null,null,null,null,null,null,null,null,null,null,null,null,null,null,null,null,null,null,null,null,null,null,null,null,null,null,null,null,null,null,null,null,null,null,null,"","","","","",null,{"$f":"IDT!K58","v":"024"},{"$f":"IDT!E26","v":"X"}]
[null,25,12729,"SINTA ANGGRAENI","P","7.A",null,null,null,null,null,null,null,null,null,null,null,null,null,null,null,null,null,null,null,null,null,null,null,null,null,null,null,null,null,null,null,null,null,null,null,null,null,null,null,null,null,null,null,null,null,null,null,null,null,null,null,null,null,null,"","","","","",null,{"$f":"IDT!K59","v":"025"},{"$f":"IDT!E27","v":"Y"}]
[null,26,12734,"SOFI","P","7.A",null,null,null,null,null,null,null,null,null,null,null,null,null,null,null,null,null,null,null,null,null,null,null,null,null,null,null,null,null,null,null,null,null,null,null,null,null,null,null,null,null,null,null,null,null,null,null,null,null,null,null,null,null,null,"","","","","",null,{"$f":"IDT!K60","v":"026"},{"$f":"IDT!E28","v":"Z"}]
[null,27,12745,"TIKA WULANDARI","P","7.A",null,null,null,null,null,null,null,null,null,null,null,null,null,null,null,null,null,null,null,null,null,null,null,null,null,null,null,null,null,null,null,null,null,null,null,null,null,null,null,null,null,null,null,null,null,null,null,null,null,null,null,null,null,null,"","","","","",null,{"$f":"IDT!K61","v":"027"},{"$f":"IDT!E29","v":"A1"}]
[null,28,12747,"TOMY FAIZAL MANAF","L","7.A",null,null,null,null,null,null,null,null,null,null,null,null,null,null,null,null,null,null,null,null,null,null,null,null,null,null,null,null,null,null,null,null,null,null,null,null,null,null,null,null,null,null,null,null,null,null,null,null,null,null,null,null,null,null,"","","","","",null,{"$f":"IDT!K62","v":"028"},{"$f":"IDT!E30","v":"A2"}]
[null,29,12748,"TONI GUNAWAN","L","7.A",null,null,null,null,null,null,null,null,null,null,null,null,null,null,null,null,null,null,null,null,null,null,null,null,null,null,null,null,null,null,null,null,null,null,null,null,null,null,null,null,null,null,null,null,null,null,null,null,null,null,null,null,null,null,"","","","","",null,{"$f":"IDT!K63","v":"029"},{"$f":"IDT!E31","v":"A3"}]
[null,30,12757,"VEVY DYAS LESTARI","P","7.A",null,null,null,null,null,null,null,null,null,null,null,null,null,null,null,null,null,null,null,null,null,null,null,null,null,null,null,null,null,null,null,null,null,null,null,null,null,null,null,null,null,null,null,null,null,null,null,null,null,null,null,null,null,null,"","","","","",null,null,{"$f":"IDT!E32","v":"A4"}]
[null,31,12765,"WAHYU ARDHI GUNAWAN","L","7.A",null,null,null,null,null,null,null,null,null,null,null,null,null,null,null,null,null,null,null,null,null,null,null,null,null,null,null,null,null,null,null,null,null,null,null,null,null,null,null,null,null,null,null,null,null,null,null,null,null,null,null,null,null,null,"","","","","",null,null,{"$f":"IDT!E33","v":"A5"}]
[null,32,12767,"WIDI PANGESTU","L","7.A",null,null,null,null,null,null,null,null,null,null,null,null,null,null,null,null,null,null,null,null,null,null,null,null,null,null,null,null,null,null,null,null,null,null,null,null,null,null,null,null,null,null,null,null,null,null,null,null,null,null,null,null,null,null,"","","","","",null,null,{"$f":"IDT!E34","v":"A6"}]
[null,33,12784,"YULI ATIFAH","P","7.A",null,null,null,null,null,null,null,null,null,null,null,null,null,null,null,null,null,null,null,null,null,null,null,null,null,null,null,null,null,null,null,null,null,null,null,null,null,null,null,null,null,null,null,null,null,null,null,null,null,null,null,null,null,null,"","","","","",null,null,{"$f":"IDT!E35","v":"A7"}]
[null,34,12788,"YUSUF DWI PRASETYA","L","7.A",null,null,null,null,null,null,null,null,null,null,null,null,null,null,null,null,null,null,null,null,null,null,null,null,null,null,null,null,null,null,null,null,null,null,null,null,null,null,null,null,null,null,null,null,null,null,null,null,null,null,null,null,null,null,"","","","","",null,null,{"$f":"IDT!E36","v":"A8"}]
[null,"",null,null,null,"",null,null,null,null,null,null,null,null,null,null,null,null,null,null,null,null,null,null,null,null,null,null,null,null,null,null,null,null,null,null,null,null,null,null,null,null,null,null,null,null,null,null,null,null,null,null,null,null,null,null,null,null,null,null,"","","","","",null,null,{"$f":"IDT!E37","v":"A9"}]
[null,"",null,null,null,"",null,null,null,null,null,null,null,null,null,null,null,null,null,null,null,null,null,null,null,null,null,null,null,null,null,null,null,null,null,null,null,null,null,null,null,null,null,null,null,null,null,null,null,null,null,null,null,null,null,null,null,null,null,null,"","","","","",null,null,{"$f":"IDT!E38","v":"A10"}]
[null,"",null,null,null,"",null,null,null,null,null,null,null,null,null,null,null,null,null,null,null,null,null,null,null,null,null,null,null,null,null,null,null,null,null,null,null,null,null,null,null,null,null,null,null,null,null,null,null,null,null,null,null,null,null,null,null,null,null,null,"","","","","",null,null,{"$f":"IDT!E39","v":"A11"}]
[null,"",null,null,null,"",null,null,null,null,null,null,null,null,null,null,null,null,null,null,null,null,null,null,null,null,null,null,null,null,null,null,null,null,null,null,null,null,null,null,null,null,null,null,null,null,null,null,null,null,null,null,null,null,null,null,null,null,null,null,"","","","","",null,null,{"$f":"IDT!E40","v":"A12"}]
[null,"",null,null,null,"",null,null,null,null,null,null,null,null,null,null,null,null,null,null,null,null,null,null,null,null,null,null,null,null,null,null,null,null,null,null,null,null,null,null,null,null,null,null,null,null,null,null,null,null,null,null,null,null,null,null,null,null,null,null,"","","","","",null,null,{"$f":"IDT!E41","v":"A13"}]
[null,"",null,null,null,"",null,null,null,null,null,null,null,null,null,null,null,null,null,null,null,null,null,null,null,null,null,null,null,null,null,null,null,null,null,null,null,null,null,null,null,null,null,null,null,null,null,null,null,null,null,null,null,null,null,null,null,null,null,null,"","","","","",null,null,{"$f":"IDT!E42","v":"A14"}]
[null,null,null,"2013-07-01",null,null,null,null,null,null,null,null,null,null,null,null,null,null,null,null,null,null,null,null,null,null,null,null,null,null,null,null,null,null,null,null,null,null,null,null,null,null,null,null,null,null,null,null,null,null,null,null,null,null,null,null,null,null,null,null,null,null,null,null,null,null,null,{"$f":"IDT!E43","v":"A15"}]
[null,"CATATAN :",null,null,null,null,{"$f":"IF(G11<>\"\",IF(G13>$D$55,1,0),\"\")","v":1},{"$f":"IF(H11<>\"\",IF(H13>$D$55,1,0),\"\")","v":""},"","","","","","","","","","","","","","","","","","","","","","","","","","","","","","","","","","","","","","","","","","","","","","","","","","","","",null,null,null,null,null,null,null,{"$f":"IDT!E44","v":"A16"}]
[null,null,1,"Sabtu, 16 Nopemberl 2013 (Pertemuan ke-….)","=","KBM pulang lebih awal karena ada pelantikan Kepala Sekolah Baru",null,null,null,null,null,null,null,null,null,null,null,null,null,null,null,null,null,null,null,null,null,null,null,null,null,null,null,null,null,null,null,null,null,null,null,null,null,null,null,null,null,null,null,null,null,null,null,null,null,null,null,null,null,null,null,null,null,null,null,null,null,{"$f":"IDT!E45","v":"A17"}]
[null,null,2,null,"=",null,null,null,null,null,null,null,null,null,null,null,null,null,null,null,null,null,null,null,null,null,null,null,null,null,null,null,null,null,null,null,null,null,null,null,null,null,null,null,null,null,null,null,null,null,null,null,null,null,null,null,null,null,null,null,null,null,null,null,null,null,null,{"$f":"IDT!E46","v":"A18"}]
[null,null,3,null,"=",null,null,null,null,null,null,null,null,null,null,null,null,null,null,null,null,null,null,null,null,null,null,null,null,null,null,null,null,null,null,null,null,null,null,null,null,null,null,null,null,null,null,null,null,null,null,null,null,null,null,null,null,null,null,null,null,null,null,null,null,null,null,{"$f":"IDT!E47","v":"A19"}]
[null,null,4,null,"=",null,null,null,null,null,null,null,null,null,null,null,null,null,null,null,null,null,null,null,null,null,null,null,null,null,null,null,null,null,null,null,null,null,null,null,null,null,null,null,null,null,null,null,null,null,null,null,null,null,null,null,null,null,null,null,null,null,null,null,null,null,null,{"$f":"IDT!E48","v":"A20"}]
[null,null,null,null,null,null,null,null,null,null,null,null,null,null,null,null,null,null,null,null,null,null,null,null,null,null,null,null,null,null,null,null,null,null,null,null,null,null,null,null,null,null,null,null,null,null,null,null,null,null,null,null,null,null,null,null,null,null,null,null,null,null,null,null,null,null,null,"BU"]
[null,null,null,null,null,null,null,null,null,null,null,null,null,null,null,null,null,null,null,null,null,null,null,null,null,null,null,null,null,null,null,null,null,null,null,null,null,null,null,null,null,null,null,null,null,null,null,null,null,null,null,null,null,null,null,null,null,null,null,null,null,null,null,null,null,null,null,"BV"]
[null,null,null,null,null,null,null,null,null,null,null,null,null,null,null,null,null,null,null,null,null,null,null,null,null,null,null,null,null,null,null,null,null,null,null,null,null,null,null,null,null,null,null,null,null,null,null,null,null,null,null,null,null,null,null,null,null,null,null,null,null,null,null,null,null,null,null,"BW"]
[null,null,null,null,null,null,null,null,null,null,null,null,null,null,null,null,null,null,null,null,null,null,null,null,null,null,null,null,null,null,null,null,null,null,null,null,null,null,null,null,null,null,null,null,null,null,null,null,null,null,null,null,null,null,null,null,null,null,null,null,null,null,null,null,null,null,null,"BX"]
[null,null,null,null,null,null,null,null,null,null,null,null,null,null,null,null,null,null,null,null,null,null,null,null,null,null,null,null,null,null,null,null,null,null,null,null,null,null,null,null,null,null,null,null,null,null,null,null,null,null,null,null,null,null,null,null,null,null,null,null,null,null,null,null,null,null,null,"BY"]
[null,null,null,null,null,null,null,null,null,null,null,null,null,null,null,null,null,null,null,null,null,null,null,null,null,null,null,null,null,null,null,null,null,null,null,null,null,null,null,null,null,null,null,null,null,null,null,null,null,null,null,null,null,null,null,null,null,null,null,null,null,null,null,null,null,null,null,"BZ"]
[null,null,null,null,null,null,null,null,null,null,null,null,null,null,null,null,null,null,null,null,null,null,null,null,null,null,null,null,null,null,null,null,null,null,null,null,null,null,null,null,null,null,null,null,null,null,null,null,null,null,null,null,null,null,null,null,null,null,null,null,null,null,null,null,null,null,null,"CA"]
[null,null,null,null,null,null,null,null,null,null,null,null,null,null,null,null,null,null,null,null,null,null,null,null,null,null,null,null,null,null,null,null,null,null,null,null,null,null,null,null,null,null,null,null,null,null,null,null,null,null,null,null,null,null,null,null,null,null,null,null,null,null,null,null,null,null,null,"CB"]
[null,null,null,null,null,null,null,null,null,null,null,null,null,null,null,null,null,null,null,null,null,null,null,null,null,null,null,null,null,null,null,null,null,null,null,null,null,null,null,null,null,null,null,null,null,null,null,null,null,null,null,null,null,null,null,null,null,null,null,null,null,null,null,null,null,null,null,"CC"]
[null,null,null,null,null,null,null,null,null,null,null,null,null,null,null,null,null,null,null,null,null,null,null,null,null,null,null,null,null,null,null,null,null,null,null,null,null,null,null,null,null,null,null,null,null,null,null,null,null,null,null,null,null,null,null,null,null,null,null,null,null,null,null,null,null,null,null,"CD"]
[null,null,null,null,null,null,null,null,null,null,null,null,null,null,null,null,null,null,null,null,null,null,null,null,null,null,null,null,null,null,null,null,null,null,null,null,null,null,null,null,null,null,null,null,null,null,null,null,null,null,null,null,null,null,null,null,null,null,null,null,null,null,null,null,null,null,null,"CE"]
[null,null,null,null,null,null,null,null,null,null,null,null,null,null,null,null,null,null,null,null,null,null,null,null,null,null,null,null,null,null,null,null,null,null,null,null,null,null,null,null,null,null,null,null,null,null,null,null,null,null,null,null,null,null,null,null,null,null,null,null,null,null,null,null,null,null,null,"CF"]
[null,null,null,null,null,null,null,null,null,null,null,null,null,null,null,null,null,null,null,null,null,null,null,null,null,null,null,null,null,null,null,null,null,null,null,null,null,null,null,null,null,null,null,null,null,null,null,null,null,null,null,null,null,null,null,null,null,null,null,null,null,null,null,null,null,null,null,"CG"]
[null,null,null,null,null,null,null,null,null,null,null,null,null,null,null,null,null,null,null,null,null,null,null,null,null,null,null,null,null,null,null,null,null,null,null,null,null,null,null,null,null,null,null,null,null,null,null,null,null,null,null,null,null,null,null,null,null,null,null,null,null,null,null,null,null,null,null,"CH"]
[null,null,null,null,null,null,null,null,null,null,null,null,null,null,null,null,null,null,null,null,null,null,null,null,null,null,null,null,null,null,null,null,null,null,null,null,null,null,null,null,null,null,null,null,null,null,null,null,null,null,null,null,null,null,null,null,null,null,null,null,null,null,null,null,null,null,null,"CI"]
[null,null,null,null,null,null,null,null,null,null,null,null,null,null,null,null,null,null,null,null,null,null,null,null,null,null,null,null,null,null,null,null,null,null,null,null,null,null,null,null,null,null,null,null,null,null,null,null,null,null,null,null,null,null,null,null,null,null,null,null,null,null,null,null,null,null,null,"CJ"]
[null,null,null,null,null,null,null,null,null,null,null,null,null,null,null,null,null,null,null,null,null,null,null,null,null,null,null,null,null,null,null,null,null,null,null,null,null,null,null,null,null,null,null,null,null,null,null,null,null,null,null,null,null,null,null,null,null,null,null,null,null,null,null,null,null,null,null,"CK"]
[null,null,null,null,null,null,null,null,null,null,null,null,null,null,null,null,null,null,null,null,null,null,null,null,null,null,null,null,null,null,null,null,null,null,null,null,null,null,null,null,null,null,null,null,null,null,null,null,null,null,null,null,null,null,null,null,null,null,null,null,null,null,null,null,null,null,null,"CL"]
[null,null,null,null,null,null,null,null,null,null,null,null,null,null,null,null,null,null,null,null,null,null,null,null,null,null,null,null,null,null,null,null,null,null,null,null,null,null,null,null,null,null,null,null,null,null,null,null,null,null,null,null,null,null,null,null,null,null,null,null,null,null,null,null,null,null,null,"CM"]
[null,null,null,null,null,null,null,null,null,null,null,null,null,null,null,null,null,null,null,null,null,null,null,null,null,null,null,null,null,null,null,null,null,null,null,null,null,null,null,null,null,null,null,null,null,null,null,null,null,null,null,null,null,null,null,null,null,null,null,null,null,null,null,null,null,null,null,"CN"]
[null,null,null,null,null,null,null,null,null,null,null,null,null,null,null,null,null,null,null,null,null,null,null,null,null,null,null,null,null,null,null,null,null,null,null,null,null,null,null,null,null,null,null,null,null,null,null,null,null,null,null,null,null,null,null,null,null,null,null,null,null,null,null,null,null,null,null,"CO"]
[null,null,null,null,null,null,null,null,null,null,null,null,null,null,null,null,null,null,null,null,null,null,null,null,null,null,null,null,null,null,null,null,null,null,null,null,null,null,null,null,null,null,null,null,null,null,null,null,null,null,null,null,null,null,null,null,null,null,null,null,null,null,null,null,null,null,null,"CP"]
[null,null,null,null,null,null,null,null,null,null,null,null,null,null,null,null,null,null,null,null,null,null,null,null,null,null,null,null,null,null,null,null,null,null,null,null,null,null,null,null,null,null,null,null,null,null,null,null,null,null,null,null,null,null,null,null,null,null,null,null,null,null,null,null,null,null,null,"CQ"]
[null,null,null,null,null,null,null,null,null,null,null,null,null,null,null,null,null,null,null,null,null,null,null,null,null,null,null,null,null,null,null,null,null,null,null,null,null,null,null,null,null,null,null,null,null,null,null,null,null,null,null,null,null,null,null,null,null,null,null,null,null,null,null,null,null,null,null,"CR"]

{"sheet":"DES","index":4,"n_rows":69,"n_cols":25,"rows_kept":69,"cut":false,"hidden":false,"merged":[[4,15,4,16],[11,15,11,16],[18,15,18,16],[26,15,26,16]]}
[]
[null,null,null,"KD.1","KD.2",null,"Kode",{"$f":"PROPER(Deskripsi_201)","v":"Des-201"},{"$f":"PROPER(Deskripsi_202)","v":"Des-202"},null,null,"Baca","Alternatif","Tampilan Deskripsi Pengetahuan",null,"KI.3","Deskripsi Untuk Pengetahuan",null,"Predikat","Deskripsi Untuk Ketrampilan",null,null,null,"Predikat","Tampilan Deskripsi Ketrampilan"]
[null,null,null,{"$f":"Rerata_KKM-1","v":64},{"$f":"Rerata_KKM-1","v":64},null,1,null,null,null,null,{"$f":"VALUE(CONCATENATE(IF(D3>=Rerata_KKM,1,0),IF(E3>=Rerata_KKM,1,0)))","v":0},1,{"$f":"CONCATENATE(\"Tidak kompeten sama sekali baik pada \",PROPER(Deskripsi_201),\" maupun pada \",PROPER(Deskripsi_202))","v":"Tidak kompeten sama sekali baik pada Des-201 maupun pada Des-202"},null,"KI.3.1","DES-201",null,"Sangat Baik","Menguasai seluruh ketrampilan","Menganalisis model atom, struktur atom, dan tabel periodik","serta sudah bertindak jujur, disiplin, percaya diri",null,"Sangat Baik",{"$f":"PROPER(CONCATENATE(T3,\" \",U3,\" \",V3))","v":"Menguasai Seluruh Ketrampilan Menganalisis Model Atom, Struktur Atom, Dan Tabel Periodik Serta Sudah Bertindak Jujur, Disiplin, Percaya Diri"}]
[null,null,null,{"$f":"Rerata_KKM-1","v":64},{"$f":"Rerata_KKM","v":65},null,2,null,"TTS",null,null,{"$f":"VALUE(CONCATENATE(IF(D4>=Rerata_KKM,1,0),IF(E4>=Rerata_KKM,1,0)))","v":1},2,{"$f":"CONCATENATE(\"Menguasai kompetensi \",PROPER(Deskripsi_202),\" tetapi pada \",PROPER(Deskripsi_201),\" belum dikuasai.\")","v":"Menguasai kompetensi Des-202 tetapi pada Des-201 belum dikuasai."},null,"KI.3.2","DES-202",null,"Baik","Menguasai ketrampilan minimum","Menganalisis model atom, struktur atom, dan tabel periodik","namun dalam kejujuran dan percaya diri dalam mengikuti ujian masih perlu ditingkatkan",null,"Baik",{"$f":"PROPER(CONCATENATE(T4,\" \",U4,\" \",V4))","v":"Menguasai Ketrampilan Minimum Menganalisis Model Atom, Struktur Atom, Dan Tabel Periodik Namun Dalam Kejujuran Dan Percaya Diri Dalam Mengikuti Ujian Masih Perlu Ditingkatkan"}]
[null,null,null,{"$f":"Rerata_KKM","v":65},{"$f":"Rerata_KKM-1","v":64},null,3,"TTS",null,null,null,{"$f":"VALUE(CONCATENATE(IF(D5>=Rerata_KKM,1,0),IF(E5>=Rerata_KKM,1,0)))","v":10},3,{"$f":"CONCATENATE(\"Menguasai kompetensi \",PROPER(Deskripsi_201),\" tetapi pada \",PROPER(Deskripsi_202),\" belum dikuasai.\")","v":"Menguasai kompetensi Des-201 tetapi pada Des-202 belum dikuasai."},null,"UNTUK 2 KD",null,null,"Cukup","Menguasai sebagian ketrampilan","Menganalisis model atom, struktur atom, dan tabel periodik","namun dalam melengkapi tugas yang diberikan guru masih perlu ditingkatkan",null,"Cukup",{"$f":"PROPER(CONCATENATE(T5,\" \",U5,\" \",V5))","v":"Menguasai Sebagian Ketrampilan Menganalisis Model Atom, Struktur Atom, Dan Tabel Periodik Namun Dalam Melengkapi Tugas Yang Diberikan Guru Masih Perlu Ditingkatkan"}]
[null,null,null,{"$f":"Rerata_KKM","v":65},{"$f":"Rerata_KKM","v":65},null,4,"TTS","TTS",null,null,{"$f":"VALUE(CONCATENATE(IF(D6>=Rerata_KKM,1,0),IF(E6>=Rerata_KKM,1,0)))","v":11},4,{"$f":"CONCATENATE(\"Menguasai seluruh kompetensi baik pada \",PROPER(Deskripsi_201),\" maupun pada \",PROPER(Deskripsi_202))","v":"Menguasai seluruh kompetensi baik pada Des-201 maupun pada Des-202"},null,null,null,null,"Kurang","Tidak menguasai ketrampilan","Menganalisis model atom, struktur atom, dan tabel periodik",null,null,"Kurang",{"$f":"PROPER(CONCATENATE(T6,\" \",U6,\" \",V6))","v":"Tidak Menguasai Ketrampilan Menganalisis Model Atom, Struktur Atom, Dan Tabel Periodik "}]
[]
[null,null,"KD.1","KD.2","KD.3",null,"Kode",{"$f":"Deskripsi_301","v":"DES-301"},{"$f":"Deskripsi_302","v":"DES-302"},{"$f":"Deskripsi_303","v":"DES-303"},null,"Baca","Alternatif","Tampilan Deskripsi Pengetahuan",null,"KI.3","Deskripsi Untuk Pengetahuan",null,"Predikat","Deskripsi Untuk Sikap Spiritual dan Sosial",null,null,null,"Predikat","Tampilan Deskripsi Sikap Spiritual dan Sosial"]
[null,null,{"$f":"Rerata_KKM-1","v":64},{"$f":"Rerata_KKM-1","v":64},{"$f":"Rerata_KKM-1","v":64},null,1,null,null,null,null,{"$f":"VALUE(CONCATENATE(IF(C9>=Rerata_KKM,1,0),IF(D9>=Rerata_KKM,1,0),IF(E9>=Rerata_KKM,1,0)))","v":0},1,{"$f":"CONCATENATE(\"Tidak kompeten sama sekali baik pada \",PROPER(Deskripsi_301),\" ; \",PROPER(Deskripsi_302),\" maupun pada \",PROPER(Deskripsi_303),\".\")","v":"Tidak kompeten sama sekali baik pada Des-301 ; Des-302 maupun pada Des-303."},null,"KI.3.1","DES-301",null,"Sangat Baik","Selalu menunjukan","ibadah tepat waktu","jujur, disiplin, percaya diri",null,"SB",{"$f":"PROPER(CONCATENATE(T9,\" \",U9,\" \",V9,\" - Sudah Konsisten\"))","v":"Selalu Menunjukan Ibadah Tepat Waktu Jujur, Disiplin, Percaya Diri - Sudah Konsisten"}]
[null,null,{"$f":"Rerata_KKM-1","v":64},{"$f":"Rerata_KKM-1","v":64},{"$f":"Rerata_KKM","v":65},null,2,null,null,"TTS",null,1,2,{"$f":"CONCATENATE(\"Menguasai kompetensi \",PROPER(Deskripsi_303),\", sedangkan pada \",PROPER(Deskripsi_301),\" maupun \",PROPER(Deskripsi_302),\" belum dikuasai.\")","v":"Menguasai kompetensi Des-303, sedangkan pada Des-301 maupun Des-302 belum dikuasai."},null,"KI.3.2","DES-302",null,"Baik","Sering menunjukan","rasa syukur kepada Allah","tetapi kedisiplinan masih perlu ditingkatkan",null,"B",{"$f":"PROPER(CONCATENATE(T10,\" \",U10,\" \",V10,\" - mulai konsisten\"))","v":"Sering Menunjukan Rasa Syukur Kepada Allah Tetapi Kedisiplinan Masih Perlu Ditingkatkan - Mulai Konsisten"}]
[null,null,{"$f":"Rerata_KKM-1","v":64},{"$f":"Rerata_KKM","v":65},{"$f":"Rerata_KKM-1","v":64},null,3,null,"TTS",null,null,10,3,{"$f":"CONCATENATE(\"Menguasai kompetensi \",PROPER(Deskripsi_302),\", sedangkan pada \",PROPER(Deskripsi_301),\" maupun \",PROPER(Deskripsi_303),\" belum dikuasai.\")","v":"Menguasai kompetensi Des-302, sedangkan pada Des-301 maupun Des-303 belum dikuasai."},null,"KI.3.3","DES-303",null,"Cukup","Kadang-kadang menunjukan","rasa syukur kepada Allah","bahkan masih sering terlambat hadir",null,"C",{"$f":"PROPER(CONCATENATE(T11,\" \",U11,\" \",V11,\" - kurang konsisten\"))","v":"Kadang-Kadang Menunjukan Rasa Syukur Kepada Allah Bahkan Masih Sering Terlambat Hadir - Kurang Konsisten"}]
[null,null,{"$f":"Rerata_KKM-1","v":64},{"$f":"Rerata_KKM","v":65},{"$f":"Rerata_KKM","v":65},null,4,null,"TTS","TTS",null,11,4,{"$f":"CONCATENATE(\"Menguasai sebagain besar kompetensi yaitu \",PROPER(Deskripsi_302),\" maupun pada \",PROPER(Deskripsi_303),\", tetapi pada \",PROPER(Deskripsi_301),\" belum dikuasai\")","v":"Menguasai sebagain besar kompetensi yaitu Des-302 maupun pada Des-303, tetapi pada Des-301 belum dikuasai"},null,"UNTUK 3 KD",null,null,"Kurang","Tidak pernah menunjukan","rasa syukur kepada Allah","dan tidak disiplin",null,"K",{"$f":"PROPER(CONCATENATE(T12,\" \",U12,\" \",V12,\" - tidak konsisten\"))","v":"Tidak Pernah Menunjukan Rasa Syukur Kepada Allah Dan Tidak Disiplin - Tidak Konsisten"}]
[null,null,{"$f":"Rerata_KKM","v":65},{"$f":"Rerata_KKM-1","v":64},{"$f":"Rerata_KKM-1","v":64},null,5,"TTS",null,null,null,100,5,{"$f":"CONCATENATE(\"Hanya pada \",PROPER(Deskripsi_301),\" yang telah mencapai kompetensi, sedangkan pada \",PROPER(Deskripsi_302),\" maupun \",PROPER(Deskripsi_303),\" belum dikuasai.\")","v":"Hanya pada Des-301 yang telah mencapai kompetensi, sedangkan pada Des-302 maupun Des-303 belum dikuasai."}]
[null,null,{"$f":"Rerata_KKM","v":65},{"$f":"Rerata_KKM-1","v":64},{"$f":"Rerata_KKM","v":65},null,6,"TTS",null,"TTS",null,101,6,{"$f":"CONCATENATE(\"Menguasai sebagian besar kompetensi yaitu \",PROPER(Deskripsi_301),\" maupun pada \",PROPER(Deskripsi_303),\", tetapi pada \",PROPER(Deskripsi_302),\" belum dikuasai.\")","v":"Menguasai sebagian besar kompetensi yaitu Des-301 maupun pada Des-303, tetapi pada Des-302 belum dikuasai."},null,"KI.3","Deskripsi Untuk Pengetahuan"]
[null,null,{"$f":"Rerata_KKM","v":65},{"$f":"Rerata_KKM","v":65},{"$f":"Rerata_KKM-1","v":64},null,7,"TTS","TTS",null,null,110,7,{"$f":"CONCATENATE(\"Menguasai sebagian besar kompetensi yaitu \",PROPER(Deskripsi_301),\" maupun pada \",PROPER(Deskripsi_302),\", tetapi pada \",PROPER(Deskripsi_303),\" belum dikuasai.\")","v":"Menguasai sebagian besar kompetensi yaitu Des-301 maupun pada Des-302, tetapi pada Des-303 belum dikuasai."},null,"KI.3.1","DES-401"]
[null,null,{"$f":"Rerata_KKM","v":65},{"$f":"Rerata_KKM","v":65},{"$f":"Rerata_KKM","v":65},null,8,"TTS","TTS","TTS",null,111,8,{"$f":"CONCATENATE(\"Menguasai seluruh kompetensi baik pada \",PROPER(Deskripsi_301),\" ; \",PROPER(Deskripsi_302),\" maupun pada \",PROPER(Deskripsi_303),\".\")","v":"Menguasai seluruh kompetensi baik pada Des-301 ; Des-302 maupun pada Des-303."},null,"KI.3.2","DES-402"]
[null,null,null,null,null,null,null,null,null,null,null,null,null,null,null,"KI.3.3","DES-403"]
[null,"KD.1","KD.2","KD.3","KD.4",null,"Kode",{"$f":"Deskripsi_401","v":"DES-401"},{"$f":"Deskripsi_402","v":"DES-402"},{"$f":"Deskripsi_403","v":"DES-403"},{"$f":"Deskripsi_404","v":"DES-404"},"Baca","Alternatif","Tampilan Deskripsi Pengetahuan",null,"KI.3.4","DES-404"]
[null,{"$f":"Rerata_KKM-1","v":64},{"$f":"Rerata_KKM-1","v":64},{"$f":"Rerata_KKM-1","v":64},{"$f":"Rerata_KKM-1","v":64},null,1,null,null,null,null,{"$f":"VALUE(CONCATENATE(IF(B19>=Rerata_KKM,1,0),IF(C19>=Rerata_KKM,1,0),IF(D19>=Rerata_KKM,1,0),IF(E19>=Rerata_KKM,1,0)))","v":0},1,{"$f":"CONCATENATE(\"Tidak kompeten sama sekali baik pada \",PROPER(Deskripsi_401),\" ; \",PROPER(Deskripsi_402),\" ; \",PROPER(Deskripsi_403),\" maupun pada \",PROPER(Deskripsi_404),\".\")","v":"Tidak kompeten sama sekali baik pada Des-401 ; Des-402 ; Des-403 maupun pada Des-404."},null,"UNTUK 4 KD"]
[null,{"$f":"Rerata_KKM-1","v":64},{"$f":"Rerata_KKM-1","v":64},{"$f":"Rerata_KKM-1","v":64},{"$f":"Rerata_KKM","v":65},null,2,null,null,null,"TTS",1,2,{"$f":"CONCATENATE(\"Menguasai kompetensi \",PROPER(Deskripsi_404),\" sedangkan pada \",PROPER(Deskripsi_401),\" ; \",PROPER(Deskripsi_402),\" maupun \",PROPER(Deskripsi_403),\" belum dikuasai.\")","v":"Menguasai kompetensi Des-404 sedangkan pada Des-401 ; Des-402 maupun Des-403 belum dikuasai."}]
[null,{"$f":"Rerata_KKM-1","v":64},{"$f":"Rerata_KKM-1","v":64},{"$f":"Rerata_KKM","v":65},{"$f":"Rerata_KKM-1","v":64},null,3,null,null,"TTS",null,10,3,{"$f":"CONCATENATE(\"Menguasai kompetensi \",PROPER(Deskripsi_403),\" sedangkan pada \",PROPER(Deskripsi_401),\" ; \",PROPER(Deskripsi_402),\" maupun \",PROPER(Deskripsi_404),\" belum dikuasai.\")","v":"Menguasai kompetensi Des-403 sedangkan pada Des-401 ; Des-402 maupun Des-404 belum dikuasai."},null,"KI.3","Deskripsi Untuk Pengetahuan"]
[null,{"$f":"Rerata_KKM-1","v":64},{"$f":"Rerata_KKM-1","v":64},{"$f":"Rerata_KKM","v":65},{"$f":"Rerata_KKM","v":65},null,4,null,null,"TTS","TTS",11,4,{"$f":"CONCATENATE(\"Menguasai kompetensi \",PROPER(Deskripsi_403),\" ; dan \",PROPER(Deskripsi_404),\" sedangkan pada \",PROPER(Deskripsi_401),\" maupun \",PROPER(Deskripsi_402),\" belum dikuasai.\")","v":"Menguasai kompetensi Des-403 ; dan Des-404 sedangkan pada Des-401 maupun Des-402 belum dikuasai."},null,"KI.3.1","DES-501"]
[null,{"$f":"Rerata_KKM-1","v":64},{"$f":"Rerata_KKM","v":65},{"$f":"Rerata_KKM-1","v":64},{"$f":"Rerata_KKM-1","v":64},null,5,null,"TTS",null,null,100,5,{"$f":"CONCATENATE(\"Menguasai kompetensi \",PROPER(Deskripsi_402),\" sedangkan pada \",PROPER(Deskripsi_401),\" ; \",PROPER(Deskripsi_403),\" maupun \",PROPER(Deskripsi_404),\" belum dikuasai.\")","v":"Menguasai kompetensi Des-402 sedangkan pada Des-401 ; Des-403 maupun Des-404 belum dikuasai."},null,"KI.3.2","DES-502"]
[null,{"$f":"Rerata_KKM-1","v":64},{"$f":"Rerata_KKM","v":65},{"$f":"Rerata_KKM-1","v":64},{"$f":"Rerata_KKM","v":65},null,6,null,"TTS",null,"TTS",101,6,{"$f":"CONCATENATE(\"Menguasai kompetensi \",PROPER(Deskripsi_402),\" ; dan \",PROPER(Deskripsi_404),\" sedangkan pada \",PROPER(Deskripsi_401),\" maupun \",PROPER(Deskripsi_403),\" belum dikuasai.\")","v":"Menguasai kompetensi Des-402 ; dan Des-404 sedangkan pada Des-401 maupun Des-403 belum dikuasai."},null,"KI.3.3","DES-503"]
[null,{"$f":"Rerata_KKM-1","v":64},{"$f":"Rerata_KKM","v":65},{"$f":"Rerata_KKM","v":65},{"$f":"Rerata_KKM-1","v":64},null,7,null,"TTS","TTS",null,110,7,{"$f":"CONCATENATE(\"Menguasai kompetensi \",PROPER(Deskripsi_402),\" ; dan \",PROPER(Deskripsi_403),\" sedangkan pada \",PROPER(Deskripsi_401),\" maupun \",PROPER(Deskripsi_404),\" belum dikuasai.\")","v":"Menguasai kompetensi Des-402 ; dan Des-403 sedangkan pada Des-401 maupun Des-404 belum dikuasai."},null,"KI.3.4","DES-504"]
[null,{"$f":"Rerata_KKM-1","v":64},{"$f":"Rerata_KKM","v":65},{"$f":"Rerata_KKM","v":65},{"$f":"Rerata_KKM","v":65},null,8,null,"TTS","TTS","TTS",111,8,{"$f":"CONCATENATE(\"Menguasai kompetensi pada \",PROPER(Deskripsi_402),\" ; \",PROPER(Deskripsi_403),\" maupun pada \",PROPER(Deskripsi_404),\", tetapi pada \",PROPER(Deskripsi_401),\" belum dikuasai.\")","v":"Menguasai kompetensi pada Des-402 ; Des-403 maupun pada Des-404, tetapi pada Des-401 belum dikuasai."},null,"KI.3.5","DES-505"]
[null,{"$f":"Rerata_KKM","v":65},{"$f":"Rerata_KKM-1","v":64},{"$f":"Rerata_KKM-1","v":64},{"$f":"Rerata_KKM-1","v":64},null,9,"TTS",null,null,null,1000,9,{"$f":"CONCATENATE(\"Menguasai kompetensi \",PROPER(Deskripsi_401),\" sedangkan pada \",PROPER(Deskripsi_402),\" ; \",PROPER(Deskripsi_403),\" maupun \",PROPER(Deskripsi_404),\" belum dikuasai.\")","v":"Menguasai kompetensi Des-401 sedangkan pada Des-402 ; Des-403 maupun Des-404 belum dikuasai."},null,"UNTUK 5 KD"]
[null,65,{"$f":"Rerata_KKM-1","v":64},{"$f":"Rerata_KKM-1","v":64},{"$f":"Rerata_KKM","v":65},null,10,"TTS",null,null,"TTS",1001,10,{"$f":"CONCATENATE(\"Menguasai kompetensi \",PROPER(Deskripsi_401),\" ; dan \",PROPER(Deskripsi_404),\" sedangkan pada \",PROPER(Deskripsi_402),\" maupun \",PROPER(Deskripsi_403),\" belum dikuasai.\")","v":"Menguasai kompetensi Des-401 ; dan Des-404 sedangkan pada Des-402 maupun Des-403 belum dikuasai."}]
[null,65,{"$f":"Rerata_KKM-1","v":64},{"$f":"Rerata_KKM","v":65},{"$f":"Rerata_KKM-1","v":64},null,11,"TTS",null,"TTS",null,1010,11,{"$f":"CONCATENATE(\"Menguasai kompetensi \",PROPER(Deskripsi_401),\" ; dan \",PROPER(Deskripsi_403),\" sedangkan pada \",PROPER(Deskripsi_402),\" maupun \",PROPER(Deskripsi_404),\" belum dikuasi.\")","v":"Menguasai kompetensi Des-401 ; dan Des-403 sedangkan pada Des-402 maupun Des-404 belum dikuasi."}]
[null,65,{"$f":"Rerata_KKM-1","v":64},{"$f":"Rerata_KKM","v":65},{"$f":"Rerata_KKM","v":65},null,12,"TTS",null,"TTS","TTS",1011,12,{"$f":"CONCATENATE(\"Menguasai kompetensi pada \",PROPER(Deskripsi_401),\" ; \",PROPER(Deskripsi_403),\" maupun pada \",PROPER(Deskripsi_404),\", tetapi pada \",PROPER(Deskripsi_402),\" belum dikuasai.\")","v":"Menguasai kompetensi pada Des-401 ; Des-403 maupun pada Des-404, tetapi pada Des-402 belum dikuasai."}]
[null,65,{"$f":"Rerata_KKM","v":65},{"$f":"Rerata_KKM-1","v":64},{"$f":"Rerata_KKM-1","v":64},null,13,"TTS","TTS",null,null,1100,13,{"$f":"CONCATENATE(\"Menguasai kompetensi \",PROPER(Deskripsi_401),\" ; dan \",PROPER(Deskripsi_402),\" sedangkan pada \",PROPER(Deskripsi_403),\" maupun \",PROPER(Deskripsi_404),\" belum dikuasai.\")","v":"Menguasai kompetensi Des-401 ; dan Des-402 sedangkan pada Des-403 maupun Des-404 belum dikuasai."}]
[null,65,{"$f":"Rerata_KKM","v":65},{"$f":"Rerata_KKM-1","v":64},{"$f":"Rerata_KKM","v":65},null,14,"TTS","TTS",null,"TTS",1101,14,{"$f":"CONCATENATE(\"Menguasai kompetensi pada \",PROPER(Deskripsi_401),\" ; \",PROPER(Deskripsi_402),\" maupun pada \",PROPER(Deskripsi_404),\", tetapi pada \",PROPER(Deskripsi_403),\" belum dikuasai.\")","v":"Menguasai kompetensi pada Des-401 ; Des-402 maupun pada Des-404, tetapi pada Des-403 belum dikuasai."}]
[null,65,{"$f":"Rerata_KKM","v":65},{"$f":"Rerata_KKM","v":65},{"$f":"Rerata_KKM-1","v":64},null,15,"TTS","TTS","TTS",null,1110,15,{"$f":"CONCATENATE(\"Menguasai kompetensi pada \",PROPER(Deskripsi_401),\" ; \",PROPER(Deskripsi_402),\" maupun pada \",PROPER(Deskripsi_403),\", tetapi pada \",PROPER(Deskripsi_404),\" belum dikuasai.\")","v":"Menguasai kompetensi pada Des-401 ; Des-402 maupun pada Des-403, tetapi pada Des-404 belum dikuasai."}]
[null,65,{"$f":"Rerata_KKM","v":65},{"$f":"Rerata_KKM","v":65},{"$f":"Rerata_KKM","v":65},null,16,"TTS","TTS","TTS","TTS",1111,16,{"$f":"CONCATENATE(\"Menguasai seluruh kompetensi baik pada \",PROPER(Deskripsi_401),\" ; \",PROPER(Deskripsi_402),\" ; \",PROPER(Deskripsi_403),\" maupun pada \",PROPER(Deskripsi_404),\".\")","v":"Menguasai seluruh kompetensi baik pada Des-401 ; Des-402 ; Des-403 maupun pada Des-404."}]
[]
[]
["KD.1","KD.2","KD.3","KD.4","KD.5","Kode",{"$f":"Q22","v":"DES-501"},{"$f":"Q23","v":"DES-502"},{"$f":"Q24","v":"DES-503"},{"$f":"Q25","v":"DES-504"},{"$f":"Q26","v":"DES-505"},"Baca","Kode","Keterangan Untuk Ketuntasan"]
[{"$f":"Rerata_KKM-1","v":64},{"$f":"Rerata_KKM-1","v":64},{"$f":"Rerata_KKM-1","v":64},{"$f":"Rerata_KKM-1","v":64},{"$f":"Rerata_KKM-1","v":64},1,null,null,null,null,null,{"$f":"VALUE(CONCATENATE(IF(A38>=Rerata_KKM,1,0),IF(B38>=Rerata_KKM,1,0),IF(C38>=Rerata_KKM,1,0),IF(D38>=Rerata_KKM,1,0),IF(E38>=Rerata_KKM,1,0)))","v":0},1,{"$f":"CONCATENATE(\"Tidak Kompeten sama sekali baik pada \",PROPER(PROPER(Deskripsi_501)),\" ; \",Deskripsi_502,\" ; \",PROPER(Deskripsi_503),\" ; \",PROPER(Deskripsi_504),\" maupun pada \",PROPER(Deskripsi_505),\".\")","v":"Tidak Kompeten sama sekali baik pada Des-501 ; DES-502 ; Des-503 ; Des-504 maupun pada Des-505."}]
[{"$f":"Rerata_KKM-1","v":64},{"$f":"Rerata_KKM-1","v":64},{"$f":"Rerata_KKM-1","v":64},{"$f":"Rerata_KKM-1","v":64},{"$f":"Rerata_KKM","v":65},2,null,null,null,null,"Tuntas",1,2,{"$f":"CONCATENATE(\"Menguasai kompetensi \",PROPER(Deskripsi_505),\" sedangkan pada \",PROPER(PROPER(Deskripsi_501)),\" ; \",Deskripsi_502,\" ; \",PROPER(Deskripsi_503),\" maupun \",PROPER(Deskripsi_504),\"  belum dikuasai.\")","v":"Menguasai kompetensi Des-505 sedangkan pada Des-501 ; DES-502 ; Des-503 maupun Des-504  belum dikuasai."}]
[{"$f":"Rerata_KKM-1","v":64},64,64,{"$f":"Rerata_KKM","v":65},{"$f":"Rerata_KKM-1","v":64},3,null,null,null,"Tuntas",null,10,3,{"$f":"CONCATENATE(\"Menguasai kompetensi \",PROPER(Deskripsi_504),\" sedangkan pada \",PROPER(PROPER(Deskripsi_501)),\" ; \",Deskripsi_502,\" ; \",PROPER(Deskripsi_503),\" maupun \",PROPER(Deskripsi_505),\"  belum dikuasai.\")","v":"Menguasai kompetensi Des-504 sedangkan pada Des-501 ; DES-502 ; Des-503 maupun Des-505  belum dikuasai."}]
[64,64,64,{"$f":"Rerata_KKM","v":65},{"$f":"Rerata_KKM","v":65},4,null,null,null,"Tuntas","Tuntas",11,4,{"$f":"CONCATENATE(\"Menguasai kompetensi \",PROPER(Deskripsi_504),\" dan \",PROPER(Deskripsi_505),\" tetapi pada \",PROPER(PROPER(Deskripsi_501)),\" ; \",Deskripsi_502,\" maupun pada \",PROPER(Deskripsi_503),\"  belum dikuasai.\")","v":"Menguasai kompetensi Des-504 dan Des-505 tetapi pada Des-501 ; DES-502 maupun pada Des-503  belum dikuasai."}]
[{"$f":"Rerata_KKM-1","v":64},64,{"$f":"Rerata_KKM","v":65},{"$f":"Rerata_KKM-1","v":64},{"$f":"Rerata_KKM-1","v":64},5,null,null,"Tuntas",null,null,100,5,{"$f":"CONCATENATE(\"Menguasai  kompetensi \",PROPER(Deskripsi_503),\" sedangkan pada \",PROPER(PROPER(Deskripsi_501)),\" ; \",Deskripsi_502,\" ; \",PROPER(Deskripsi_504),\" maupun \",PROPER(Deskripsi_505),\"  belum dikuasai.\")","v":"Menguasai  kompetensi Des-503 sedangkan pada Des-501 ; DES-502 ; Des-504 maupun Des-505  belum dikuasai."}]
[64,64,{"$f":"Rerata_KKM","v":65},{"$f":"Rerata_KKM-1","v":64},{"$f":"Rerata_KKM","v":65},6,null,null,"Tuntas",null,"Tuntas",101,6,{"$f":"CONCATENATE(\"Menguasai kompetensi \",PROPER(Deskripsi_503),\" dan \",PROPER(Deskripsi_505),\", tetapi pada \",PROPER(PROPER(Deskripsi_502)),\" ; \",Deskripsi_502,\" maupun pada \",PROPER(Deskripsi_504),\"  belum dikuasai.\")","v":"Menguasai kompetensi Des-503 dan Des-505, tetapi pada Des-502 ; DES-502 maupun pada Des-504  belum dikuasai."}]
[64,64,{"$f":"Rerata_KKM","v":65},{"$f":"Rerata_KKM","v":65},{"$f":"Rerata_KKM-1","v":64},7,null,null,"Tuntas","Tuntas",null,110,7,{"$f":"CONCATENATE(\"Menguasai kompetensi \",PROPER(Deskripsi_503),\" dan \",PROPER(Deskripsi_504),\" , tetapi pada \",PROPER(PROPER(Deskripsi_501)),\" ; \",Deskripsi_502,\" dan \",PROPER(Deskripsi_505),\"  belum dikuasai.\")","v":"Menguasai kompetensi Des-503 dan Des-504 , tetapi pada Des-501 ; DES-502 dan Des-505  belum dikuasai."}]
[64,64,{"$f":"Rerata_KKM","v":65},{"$f":"Rerata_KKM","v":65},{"$f":"Rerata_KKM","v":65},8,null,null,"Tuntas","Tuntas","Tuntas",111,8,{"$f":"CONCATENATE(\"Menguasai kompetensi \",PROPER(Deskripsi_503),\" ; \",PROPER(Deskripsi_504),\" ; \",\" dan \",PROPER(Deskripsi_505),\" , tetapi pada \",PROPER(PROPER(Deskripsi_501)),\" dan \",Deskripsi_502,\"  belum dikuasai.\")","v":"Menguasai kompetensi Des-503 ; Des-504 ;  dan Des-505 , tetapi pada Des-501 dan DES-502  belum dikuasai."}]
[{"$f":"Rerata_KKM-1","v":64},{"$f":"Rerata_KKM","v":65},{"$f":"Rerata_KKM-1","v":64},{"$f":"Rerata_KKM-1","v":64},{"$f":"Rerata_KKM-1","v":64},9,null,"Tuntas",null,null,null,1000,9,{"$f":"CONCATENATE(\"Menguasai kompetensi \",Deskripsi_502,\" sedangkan pada \",PROPER(PROPER(Deskripsi_501)),\" ; \",PROPER(Deskripsi_503),\" ; \",PROPER(Deskripsi_504),\" maupun \",PROPER(Deskripsi_505),\"  belum dikuasai.\")","v":"Menguasai kompetensi DES-502 sedangkan pada Des-501 ; Des-503 ; Des-504 maupun Des-505  belum dikuasai."}]
[64,65,{"$f":"Rerata_KKM-1","v":64},{"$f":"Rerata_KKM-1","v":64},{"$f":"Rerata_KKM","v":65},10,null,"Tuntas",null,null,"Tuntas",1001,10,{"$f":"CONCATENATE(\"Menguasai kompetensi \",Deskripsi_502,\" dan \",PROPER(Deskripsi_505),\" , tetapi pada \",PROPER(PROPER(Deskripsi_501)),\" ; \",PROPER(Deskripsi_503),\" dan \",PROPER(Deskripsi_504),\"  belum dikuasai.\")","v":"Menguasai kompetensi DES-502 dan Des-505 , tetapi pada Des-501 ; Des-503 dan Des-504  belum dikuasai."}]
[64,65,{"$f":"Rerata_KKM-1","v":64},{"$f":"Rerata_KKM","v":65},{"$f":"Rerata_KKM-1","v":64},11,null,"Tuntas",null,"Tuntas",null,1010,11,{"$f":"CONCATENATE(\"Menguasai kompetensi \",Deskripsi_502,\" dan \",PROPER(Deskripsi_504),\" , tetapi pada \",PROPER(PROPER(Deskripsi_501)),\" ; \",PROPER(Deskripsi_503),\" dan \",PROPER(Deskripsi_505),\"  belum dikuasai.\")","v":"Menguasai kompetensi DES-502 dan Des-504 , tetapi pada Des-501 ; Des-503 dan Des-505  belum dikuasai."}]
[64,65,{"$f":"Rerata_KKM-1","v":64},{"$f":"Rerata_KKM","v":65},{"$f":"Rerata_KKM","v":65},12,null,"Tuntas",null,"Tuntas","Tuntas",1011,12,{"$f":"CONCATENATE(\"Menguasai kompetensi \",Deskripsi_502,\" ; \",PROPER(Deskripsi_504),\" ; \",\" dan \",PROPER(Deskripsi_505),\" , tetapi pada \",PROPER(PROPER(Deskripsi_501)),\" dan \",PROPER(Deskripsi_503),\"  belum dikuasai.\")","v":"Menguasai kompetensi DES-502 ; Des-504 ;  dan Des-505 , tetapi pada Des-501 dan Des-503  belum dikuasai."}]
[64,65,{"$f":"Rerata_KKM","v":65},{"$f":"Rerata_KKM-1","v":64},{"$f":"Rerata_KKM-1","v":64},13,null,"Tuntas","Tuntas",null,null,1100,13,{"$f":"CONCATENATE(\"Menguasai kompetensi \",Deskripsi_502,\" dan \",PROPER(Deskripsi_503),\" , tetapi pada \",PROPER(PROPER(Deskripsi_501)),\" ; \",PROPER(Deskripsi_504),\" dan \",PROPER(Deskripsi_505),\"  belum dikuasai.\")","v":"Menguasai kompetensi DES-502 dan Des-503 , tetapi pada Des-501 ; Des-504 dan Des-505  belum dikuasai."}]
[64,65,{"$f":"Rerata_KKM","v":65},{"$f":"Rerata_KKM-1","v":64},{"$f":"Rerata_KKM","v":65},14,null,"Tuntas","Tuntas",null,"Tuntas",1101,14,{"$f":"CONCATENATE(\"Menguasai kompetensi \",Deskripsi_502,\" ; \",PROPER(Deskripsi_503),\" ; \",\" dan \",PROPER(Deskripsi_505),\" , tetapi pada \",PROPER(PROPER(Deskripsi_501)),\" dan \",PROPER(Deskripsi_504),\"  belum dikuasai.\")","v":"Menguasai kompetensi DES-502 ; Des-503 ;  dan Des-505 , tetapi pada Des-501 dan Des-504  belum dikuasai."}]
[64,65,{"$f":"Rerata_KKM","v":65},{"$f":"Rerata_KKM","v":65},{"$f":"Rerata_KKM-1","v":64},15,null,"Tuntas","Tuntas","Tuntas",null,1110,15,{"$f":"CONCATENATE(\"Menguasai kompetensi \",Deskripsi_502,\" ; \",PROPER(Deskripsi_503),\" ; \",\" dan \",PROPER(Deskripsi_504),\" , tetapi pada \",PROPER(PROPER(Deskripsi_501)),\" dan \",PROPER(Deskripsi_505),\"  belum dikuasai.\")","v":"Menguasai kompetensi DES-502 ; Des-503 ;  dan Des-504 , tetapi pada Des-501 dan Des-505  belum dikuasai."}]
[64,65,{"$f":"Rerata_KKM","v":65},{"$f":"Rerata_KKM","v":65},{"$f":"Rerata_KKM","v":65},16,null,"Tuntas","Tuntas","Tuntas","Tuntas",1111,16,{"$f":"CONCATENATE(\"Menguasai kompetensi \",Deskripsi_502,\" ; \",PROPER(Deskripsi_503),\" ; \",PROPER(Deskripsi_504),\" dan \",PROPER(Deskripsi_505),\" , tetapi pada \",PROPER(PROPER(Deskripsi_501)),\"  belum dikuasai.\")","v":"Menguasai kompetensi DES-502 ; Des-503 ; Des-504 dan Des-505 , tetapi pada Des-501  belum dikuasai."}]
[{"$f":"Rerata_KKM","v":65},{"$f":"Rerata_KKM-1","v":64},{"$f":"Rerata_KKM-1","v":64},{"$f":"Rerata_KKM-1","v":64},{"$f":"Rerata_KKM-1","v":64},17,"Tuntas",null,null,null,null,10000,17,{"$f":"CONCATENATE(\"Menguasai kompetensi \",PROPER(PROPER(Deskripsi_501)),\" sedangkan pada \",Deskripsi_502,\" ; \",PROPER(Deskripsi_503),\" ; \",PROPER(Deskripsi_504),\" maupun \",PROPER(Deskripsi_505),\"  belum dikuasai.\")","v":"Menguasai kompetensi Des-501 sedangkan pada DES-502 ; Des-503 ; Des-504 maupun Des-505  belum dikuasai."}]
[65,{"$f":"Rerata_KKM-1","v":64},{"$f":"Rerata_KKM-1","v":64},{"$f":"Rerata_KKM-1","v":64},{"$f":"Rerata_KKM","v":65},18,"Tuntas",null,null,null,"Tuntas",10001,18,{"$f":"CONCATENATE(\"Menguasai kompetensi \",PROPER(PROPER(Deskripsi_501)),\" dan \",PROPER(Deskripsi_505),\" , tetapi pada \",Deskripsi_502,\" ; \",PROPER(Deskripsi_503),\" dan \",PROPER(Deskripsi_504),\"  belum dikuasai.\")","v":"Menguasai kompetensi Des-501 dan Des-505 , tetapi pada DES-502 ; Des-503 dan Des-504  belum dikuasai."}]
[65,{"$f":"Rerata_KKM-1","v":64},{"$f":"Rerata_KKM-1","v":64},{"$f":"Rerata_KKM","v":65},{"$f":"Rerata_KKM-1","v":64},19,"Tuntas",null,null,"Tuntas",null,10010,19,{"$f":"CONCATENATE(\"Menguasai kompetensi \",PROPER(PROPER(Deskripsi_501)),\" dan \",PROPER(Deskripsi_504),\" , tetapi pada \",Deskripsi_502,\" ; \",PROPER(Deskripsi_503),\" dan \",PROPER(Deskripsi_505),\"  belum dikuasai.\")","v":"Menguasai kompetensi Des-501 dan Des-504 , tetapi pada DES-502 ; Des-503 dan Des-505  belum dikuasai."}]
[65,{"$f":"Rerata_KKM-1","v":64},{"$f":"Rerata_KKM-1","v":64},{"$f":"Rerata_KKM","v":65},{"$f":"Rerata_KKM","v":65},20,"Tuntas",null,null,"Tuntas","Tuntas",10011,20,{"$f":"CONCATENATE(\"Menguasai kompetensi \",PROPER(PROPER(Deskripsi_501)),\" ; \",PROPER(Deskripsi_504),,\" dan \",PROPER(Deskripsi_505),\" , tetapi pada \",Deskripsi_502,\" dan \",PROPER(Deskripsi_503),\"  belum dikuasai.\")","v":"Menguasai kompetensi Des-501 ; Des-504 dan Des-505 , tetapi pada DES-502 dan Des-503  belum dikuasai."}]
[65,{"$f":"Rerata_KKM-1","v":64},{"$f":"Rerata_KKM","v":65},{"$f":"Rerata_KKM-1","v":64},{"$f":"Rerata_KKM-1","v":64},21,"Tuntas",null,"Tuntas",null,null,10100,21,{"$f":"CONCATENATE(\"Menguasai kompetensi \",PROPER(PROPER(Deskripsi_501)),\" dan \",PROPER(Deskripsi_503),\" , tetapi pada \",Deskripsi_502,\" ; \",PROPER(Deskripsi_504),\" dan \",PROPER(Deskripsi_505),\"  belum dikuasai.\")","v":"Menguasai kompetensi Des-501 dan Des-503 , tetapi pada DES-502 ; Des-504 dan Des-505  belum dikuasai."}]
[65,{"$f":"Rerata_KKM-1","v":64},{"$f":"Rerata_KKM","v":65},{"$f":"Rerata_KKM-1","v":64},{"$f":"Rerata_KKM","v":65},22,"Tuntas",null,"Tuntas",null,"Tuntas",10101,22,{"$f":"CONCATENATE(\"Menguasai kompetensi \",PROPER(PROPER(Deskripsi_501)),\" ; \",PROPER(Deskripsi_503),\" dan \",PROPER(Deskripsi_505),\" , tetapi pada \",Deskripsi_502,\" dan \",PROPER(Deskripsi_504),\"  belum dikuasai.\")","v":"Menguasai kompetensi Des-501 ; Des-503 dan Des-505 , tetapi pada DES-502 dan Des-504  belum dikuasai."}]
[65,{"$f":"Rerata_KKM-1","v":64},{"$f":"Rerata_KKM","v":65},{"$f":"Rerata_KKM","v":65},{"$f":"Rerata_KKM-1","v":64},23,"Tuntas",null,"Tuntas","Tuntas",null,10110,23,{"$f":"CONCATENATE(\"Menguasai kompetensi \",PROPER(PROPER(Deskripsi_501)),\" ; \",PROPER(Deskripsi_503),\" dan \",PROPER(Deskripsi_504),\" , tetapi pada \",Deskripsi_502,\" dan \",PROPER(Deskripsi_505),\"  belum dikuasai.\")","v":"Menguasai kompetensi Des-501 ; Des-503 dan Des-504 , tetapi pada DES-502 dan Des-505  belum dikuasai."}]
[65,{"$f":"Rerata_KKM-1","v":64},{"$f":"Rerata_KKM","v":65},{"$f":"Rerata_KKM","v":65},{"$f":"Rerata_KKM","v":65},24,"Tuntas",null,"Tuntas","Tuntas","Tuntas",10111,24,{"$f":"CONCATENATE(\"Menguasai kompetensi \",PROPER(PROPER(Deskripsi_501)),\" ; \",PROPER(Deskripsi_503),\" ; \",PROPER(Deskripsi_504),\" dan \",PROPER(Deskripsi_505),\" , tetapi pada \",Deskripsi_502,\"  belum dikuasai.\")","v":"Menguasai kompetensi Des-501 ; Des-503 ; Des-504 dan Des-505 , tetapi pada DES-502  belum dikuasai."}]
[65,{"$f":"Rerata_KKM","v":65},{"$f":"Rerata_KKM-1","v":64},{"$f":"Rerata_KKM-1","v":64},{"$f":"Rerata_KKM-1","v":64},25,"Tuntas","Tuntas",null,null,null,11000,25,{"$f":"CONCATENATE(\"Menguasai kompetensi \",PROPER(PROPER(Deskripsi_501)),\" dan \",Deskripsi_502,\" , tetapi pada \",PROPER(Deskripsi_503),\" ; \",PROPER(Deskripsi_504),\" dan \",PROPER(Deskripsi_505),\"  belum dikuasai.\")","v":"Menguasai kompetensi Des-501 dan DES-502 , tetapi pada Des-503 ; Des-504 dan Des-505  belum dikuasai."}]
[65,65,{"$f":"Rerata_KKM-1","v":64},{"$f":"Rerata_KKM-1","v":64},{"$f":"Rerata_KKM","v":65},26,"Tuntas","Tuntas",null,null,"Tuntas",11001,26,{"$f":"CONCATENATE(\"Menguasai kompetensi \",PROPER(PROPER(Deskripsi_501)),\" ; \",Deskripsi_502,\" ; \",\" dan \",PROPER(Deskripsi_505),\" , tetapi pada \",PROPER(Deskripsi_503),\" dan \",PROPER(Deskripsi_504),\"  belum dikuasai.\")","v":"Menguasai kompetensi Des-501 ; DES-502 ;  dan Des-505 , tetapi pada Des-503 dan Des-504  belum dikuasai."}]
[65,65,{"$f":"Rerata_KKM-1","v":64},{"$f":"Rerata_KKM","v":65},{"$f":"Rerata_KKM-1","v":64},27,"Tuntas","Tuntas",null,"Tuntas",null,11010,27,{"$f":"CONCATENATE(\"Menguasai kompetensi \",PROPER(PROPER(Deskripsi_501)),\" ; \",Deskripsi_502,\" ; \",\" dan \",PROPER(Deskripsi_504),\" , tetapi pada \",PROPER(Deskripsi_503),\" dan \",PROPER(Deskripsi_505),\"  belum dikuasai.\")","v":"Menguasai kompetensi Des-501 ; DES-502 ;  dan Des-504 , tetapi pada Des-503 dan Des-505  belum dikuasai."}]
[65,65,{"$f":"Rerata_KKM-1","v":64},{"$f":"Rerata_KKM","v":65},{"$f":"Rerata_KKM","v":65},28,"Tuntas","Tuntas",null,"Tuntas","Tuntas",11011,28,{"$f":"CONCATENATE(\"Menguasai kompetensi \",PROPER(PROPER(Deskripsi_501)),\" ; \",Deskripsi_502,\" ; \",PROPER(Deskripsi_504),\" dan \",PROPER(Deskripsi_505),\" , tetapi pada \",PROPER(Deskripsi_503),\"  belum dikuasai.\")","v":"Menguasai kompetensi Des-501 ; DES-502 ; Des-504 dan Des-505 , tetapi pada Des-503  belum dikuasai."}]
[65,65,{"$f":"Rerata_KKM","v":65},{"$f":"Rerata_KKM-1","v":64},{"$f":"Rerata_KKM-1","v":64},29,"Tuntas","Tuntas","Tuntas",null,null,11100,29,{"$f":"CONCATENATE(\"Menguasai kompetensi \",PROPER(PROPER(Deskripsi_501)),\" ; \",Deskripsi_502,\" ; \",\" dan \",PROPER(Deskripsi_503),\" , tetapi pada \",PROPER(Deskripsi_504),\" dan \",PROPER(Deskripsi_505),\"  belum dikuasai.\")","v":"Menguasai kompetensi Des-501 ; DES-502 ;  dan Des-503 , tetapi pada Des-504 dan Des-505  belum dikuasai."}]
[65,65,{"$f":"Rerata_KKM","v":65},{"$f":"Rerata_KKM-1","v":64},{"$f":"Rerata_KKM","v":65},30,"Tuntas","Tuntas","Tuntas",null,"Tuntas",11101,30,{"$f":"CONCATENATE(\"Menguasai kompetensi \",PROPER(PROPER(Deskripsi_501)),\" ; \",Deskripsi_502,\" ; \",PROPER(Deskripsi_503),\" dan \",PROPER(Deskripsi_505),\" , tetapi pada \",PROPER(Deskripsi_504),\"  belum dikuasai.\")","v":"Menguasai kompetensi Des-501 ; DES-502 ; Des-503 dan Des-505 , tetapi pada Des-504  belum dikuasai."}]
[65,65,{"$f":"Rerata_KKM","v":65},{"$f":"Rerata_KKM","v":65},{"$f":"Rerata_KKM-1","v":64},31,"Tuntas","Tuntas","Tuntas","Tuntas",null,11110,31,{"$f":"CONCATENATE(\"Menguasai kompetensi \",PROPER(PROPER(Deskripsi_501)),\" ; \",Deskripsi_502,\" ; \",PROPER(Deskripsi_503),\" dan \",PROPER(Deskripsi_504),\" , tetapi pada \",PROPER(Deskripsi_505),\"  belum dikuasai.\")","v":"Menguasai kompetensi Des-501 ; DES-502 ; Des-503 dan Des-504 , tetapi pada Des-505  belum dikuasai."}]
[65,65,{"$f":"Rerata_KKM","v":65},{"$f":"Rerata_KKM","v":65},{"$f":"Rerata_KKM","v":65},32,"Tuntas","Tuntas","Tuntas","Tuntas","Tuntas",11111,32,{"$f":"CONCATENATE(\"Menguasai kompetensi baik pada \",PROPER(PROPER(Deskripsi_501)),\" ; \",Deskripsi_502,\" ; \",PROPER(Deskripsi_503),\" ; \",PROPER(Deskripsi_504),\" maupun pada \",PROPER(Deskripsi_505),\".\")","v":"Menguasai kompetensi baik pada Des-501 ; DES-502 ; Des-503 ; Des-504 maupun pada Des-505."}]

{"sheet":"KOG","index":5,"n_rows":45,"n_cols":55,"rows_kept":45,"cut":false,"hidden":false,"merged":[[4,10,5,10],[44,0,44,2],[2,0,5,0],[2,1,5,1],[2,2,5,2],[4,3,4,5],[3,3,3,10],[4,6,4,9],[2,44,3,45],[4,18,5,18],[3,11,3,18],[3,27,3,34],[4,27,4,29],[4,30,4,33],[4,34,5,34],[3,19,3,26],[4,19,4,21],[4,22,4,25],[4,26,5,26],[4,42,5,42],[3,43,5,43],[4,11,4,13],[4,14,4,17],[4,53,5,53],[4,54,5,54],[3,35,3,42],[4,35,4,37],[4,38,4,41],[2,50,5,50],[4,52,5,52],[4,44,5,44],[4,45,5,45],[4,51,5,51],[2,51,3,54],[2,49,5,49],[4,46,5,46],[4,47,5,47],[4,48,5,48],[2,46,3,48]]}
["DAFTAR NILAI PENGETAHUAN (Kognitif)"]
[{"$f":"JUMLAHKD","v":3}]
["NO","NIS","NAMA SISWA","Nilai Harian (NH)",null,null,null,null,null,null,null,null,null,null,null,null,null,null,null,null,null,null,null,null,null,null,null,null,null,null,null,null,null,null,null,null,null,null,null,null,null,null,null,null,"Nilai",null,"NILAI RAPOR / (LHB)",null,null,"DESKRIPSI","KD\nTerpakai","BACA KD"]
[null,null,null,{"$f":"IF(OR(CEKFILE<>\"Sudah Sama\",JUMLAHKD=\"\"),10,IF(JUMLAHKD=2,Deskripsi_201,IF(JUMLAHKD=3,Deskripsi_301,IF(JUMLAHKD=4,Deskripsi_401,Deskripsi_501))))","v":10},null,null,null,null,null,null,null,{"$f":"IF(OR(CEKFILE<>\"Sudah Sama\",JUMLAHKD=\"\"),10,IF(JUMLAHKD=2,Deskripsi_202,IF(JUMLAHKD=3,Deskripsi_302,IF(JUMLAHKD=4,Deskripsi_402,Deskripsi_502))))","v":10},null,null,null,null,null,null,null,{"$f":"IF(OR(CEKFILE<>\"Sudah Sama\",JUMLAHKD=\"\"),10,IF(JUMLAHKD=2,10,IF(JUMLAHKD=3,Deskripsi_303,IF(JUMLAHKD=4,Deskripsi_403,Deskripsi_503))))","v":10},null,null,null,null,null,null,null,{"$f":"IF(OR(CEKFILE<>\"Sudah Sama\",JUMLAHKD=\"\"),10,IF(JUMLAHKD=2,10,IF(JUMLAHKD=3,10,IF(JUMLAHKD=4,Deskripsi_404,Deskripsi_504))))","v":10},null,null,null,null,null,null,null,{"$f":"IF(OR(CEKFILE<>\"Sudah Sama\",JUMLAHKD=\"\"),10,IF(JUMLAHKD=2,10,IF(JUMLAHKD=3,10,IF(JUMLAHKD=4,10,Deskripsi_505))))","v":10},null,null,null,null,null,null,null,"Rerata\nNH"]
[null,null,null,"Ulangan Harian",null,null,"Nilai Tugas (NT)",null,null,null,"Nilai Akhir KD-1","Ulangan Harian",null,null,"Nilai Tugas (NT)",null,null,null,"Nilai Akhir KD-2","Ulangan Harian",null,null,"Nilai Tugas (NT)",null,null,null,"Nilai Akhir KD-3","Ulangan Harian",null,null,"Nilai Tugas (NT)",null,null,null,"Nilai Akhir KD-4","Ulangan Harian",null,null,"Nilai Tugas (NT)",null,null,null,"Nilai Akhir KD-5",null,"Tengah Semester","Akhir Semester","Skala 100","Skala 4","Predikat",null,null,5,4,3,2]
[null,null,null,"UH","Remidi","Rata2",1,2,3,"Rata2",null,"UH","Remidi","Rata2",1,2,3,"Rata2",null,"UH","Remidi","Rata2",1,2,3,"Rata2",null,"UH","Remidi","Rata2",1,2,3,"Rata2",null,"UH","Remidi","Rata2",1,2,3,"Rata2",null,null,null,null,null,null,null,null,null,null,null,3,2]
[{"$f":"IF(ABS!B15=\"\",\"\",ABS!B15)","v":1},{"$f":"IF(ABS!C15=\"\",\"\",ABS!C15)","v":12419},{"$f":"IF(ABS!D15=\"\",\"\",PROPER(ABS!D15))","v":"Adhitya Ferdi Kristianto"},37,76,{"$f":"IF(OR($C7=\"\",CEKFILE<>\"Sudah Sama\"),\"\",IF(D7=0,\"\",IF(OR(E7=0,E7=\"\"),D7,AVERAGE(D7:E7))))","v":""},75,80,null,{"$f":"IF(OR($C7=\"\",CEKFILE<>\"Sudah Sama\"),\"\",IF(G7=0,\"\",IF(AND(I7=0,H7=0),G7,IF(I7=0,AVERAGE(G7:H7),AVERAGE(G7:I7)))))","v":""},{"$f":"IF(OR($C7=\"\",CEKFILE<>\"Sudah Sama\"),\"\",IF(OR(F7=0,J7=\"\"),\"\",ROUND(SUM((2*F7),J7)/3,0)))","v":""},75,null,{"$f":"IF(OR($C7=\"\",CEKFILE<>\"Sudah Sama\"),\"\",IF(L7=0,\"\",IF(OR(M7=0,M7=\"\"),L7,AVERAGE(L7:M7))))","v":""},80,85,null,{"$f":"IF(OR($C7=\"\",CEKFILE<>\"Sudah Sama\"),\"\",IF(O7=0,\"\",IF(AND(Q7=0,P7=0),O7,IF(Q7=0,AVERAGE(O7:P7),AVERAGE(O7:Q7)))))","v":""},{"$f":"IF(OR($C7=\"\",CEKFILE<>\"Sudah Sama\"),\"\",IF(OR(N7=0,R7=\"\"),\"\",ROUND(SUM((2*N7),R7)/3,0)))","v":""},77,null,{"$f":"IF(OR($C7=\"\",CEKFILE<>\"Sudah Sama\"),\"\",IF(T7=0,\"\",IF(OR(U7=0,U7=\"\"),T7,AVERAGE(T7:U7))))","v":""},86,93,null,{"$f":"IF(OR($C7=\"\",CEKFILE<>\"Sudah Sama\"),\"\",IF(W7=0,\"\",IF(AND(Y7=0,X7=0),W7,IF(Y7=0,AVERAGE(W7:X7),AVERAGE(W7:Y7)))))","v":""},{"$f":"IF(OR($C7=\"\",CEKFILE<>\"Sudah Sama\"),\"\",IF(OR(V7=0,Z7=\"\"),\"\",ROUND(SUM((2*V7),Z7)/3,0)))","v":""},null,null,{"$f":"IF(OR($C7=\"\",CEKFILE<>\"Sudah Sama\"),\"\",IF(AB7=0,\"\",IF(OR(AC7=0,AC7=\"\"),AB7,AVERAGE(AB7:AC7))))","v":""},null,null,null,{"$f":"IF(OR($C7=\"\",CEKFILE<>\"Sudah Sama\"),\"\",IF(AE7=0,\"\",IF(AND(AG7=0,AF7=0),AE7,IF(AG7=0,AVERAGE(AE7:AF7),AVERAGE(AE7:AG7)))))","v":""},{"$f":"IF(OR($C7=\"\",CEKFILE<>\"Sudah Sama\"),\"\",IF(OR(AD7=0,AH7=\"\"),\"\",ROUND(SUM((2*AD7),AH7)/3,0)))","v":""},null,null,{"$f":"IF(OR($C7=\"\",CEKFILE<>\"Sudah Sama\"),\"\",IF(AJ7=0,\"\",IF(OR(AK7=0,AK7=\"\"),AJ7,AVERAGE(AJ7:AK7))))","v":""},null,null,null,{"$f":"IF(OR($C7=\"\",CEKFILE<>\"Sudah Sama\"),\"\",IF(AM7=0,\"\",IF(AND(AO7=0,AN7=0),AM7,IF(AO7=0,AVERAGE(AM7:AN7),AVERAGE(AM7:AO7)))))","v":""},{"$f":"IF(OR($C7=\"\",CEKFILE<>\"Sudah Sama\"),\"\",IF(OR(AL7=0,AP7=\"\"),\"\",ROUND(SUM((2*AL7),AP7)/3,0)))","v":""},{"$f":"IFERROR(IF(OR(C7=\"\",JUMLAHKD=\"\"),\"\",IF(JUMLAHKD=2,AVERAGE(K7,S7),IF(JUMLAHKD=3,AVERAGE(K7,S7,AA7),IF(JUMLAHKD=4,AVERAGE(K7,S7,AA7,AI7),AVERAGE(K7,S7,AA7,AI7,AQ7))))),\"\")","v":""},15,80,{"$f":"IFERROR(IF(CEKFILE<>\"Sudah Sama\",\"\",IF(OR($AR7=0,$AR7=\"\"),\"\",IF(AS7=\"\",((2*AR7)+AT7)/3,ROUND(((2*AR7)+SUM(AS7:AT7))/4,2)))),\"\")","v":""},{"$f":"IF(OR(AU7=\"\",CEKFILE<>\"Sudah Sama\"),\"\",ROUND((AU7/100)*4,2))","v":""},{"$f":"IF(CEKFILE<>\"Sudah Sama\",\"\",IF(AU7=\"\",\"\",NILAI_PREDIKAT(AV7)))","v":""},{"$f":"IFERROR(IF(OR(AU7=\"\",CEKFILE<>\"Sudah Sama\"),\"\",IF(JUMLAHKD=5,VLOOKUP(AY7,DESKRIPSITUNTAS_05,3,FALSE),IF(JUMLAHKD=4,VLOOKUP(AY7,DESKRIPSITUNTAS_04,3,FALSE),IF(JUMLAHKD=3,VLOOKUP(AY7,DESKRIPSITUNTAS_03,3,FALSE),VLOOKUP(AY7,DESKRIPSITUNTAS_02,3,FALSE))))),\"\")","v":""},{"$f":"IF(C7=\"\",\"\",VALUE(IF(JUMLAHKD=5,AZ7,IF(JUMLAHKD=4,BA7,IF(JUMLAHKD=3,BB7,IF(JUMLAHKD=2,BC7,\"\"))))))","v":111},{"$f":"CONCATENATE(IF(K7>=Rerata_KKM,1,0),IF(S7>=Rerata_KKM,1,0),IF(AA7>=Rerata_KKM,1,0),IF(AI7>=Rerata_KKM,1,0),IF(AQ7>=Rerata_KKM,1,0))","v":"11111"},{"$f":"CONCATENATE(IF(K7>=Rerata_KKM,1,0),IF(S7>=Rerata_KKM,1,0),IF(AA7>=Rerata_KKM,1,0),IF(AI7>=Rerata_KKM,1,0))","v":"1111"},{"$f":"CONCATENATE(IF(K7>=Rerata_KKM,1,0),IF(S7>=Rerata_KKM,1,0),IF(AA7>=Rerata_KKM,1,0))","v":"111"},{"$f":"CONCATENATE(IF(K7>=Rerata_KKM,1,0),IF(S7>=Rerata_KKM,1,0))","v":"11"}]
[{"$f":"IF(ABS!B16=\"\",\"\",ABS!B16)","v":2},{"$f":"IF(ABS!C16=\"\",\"\",ABS!C16)","v":12428},{"$f":"IF(ABS!D16=\"\",\"\",PROPER(ABS!D16))","v":"Agung Dwi Saputro"},null,null,"",null,null,null,"","",null,null,"",null,null,null,"","",null,null,"",null,null,null,"","",null,null,"",null,null,null,"","",null,null,"",null,null,null,"","","",null,null,{"$f":"IFERROR(IF(CEKFILE<>\"Sudah Sama\",\"\",IF(OR($AR8=0,$AR8=\"\"),\"\",IF(AS8=\"\",((2*AR8)+AT8)/3,ROUND(((2*AR8)+SUM(AS8:AT8))/4,2)))),\"\")","v":""},"",{"$f":"IF(CEKFILE<>\"Sudah Sama\",\"\",IF(AU8=\"\",\"\",NILAI_PREDIKAT(AV8)))","v":""},"",111,"11111",{"$f":"CONCATENATE(IF(K8>=Rerata_KKM,1,0),IF(S8>=Rerata_KKM,1,0),IF(AA8>=Rerata_KKM,1,0),IF(AI8>=Rerata_KKM,1,0))","v":"1111"},"111","11"]
[{"$f":"IF(ABS!B17=\"\",\"\",ABS!B17)","v":3},{"$f":"IF(ABS!C17=\"\",\"\",ABS!C17)","v":12453},{"$f":"IF(ABS!D17=\"\",\"\",PROPER(ABS!D17))","v":"Anissa Dhea Paramitha"},null,null,"",null,null,null,"","",null,null,"",null,null,null,"","",null,null,"",null,null,null,"","",null,null,"",null,null,null,"","",null,null,"",null,null,null,"","","",null,null,"","",{"$f":"IF(CEKFILE<>\"Sudah Sama\",\"\",IF(AU9=\"\",\"\",NILAI_PREDIKAT(AV9)))","v":""},"",111,"11111","1111","111","11"]
[{"$f":"IF(ABS!B18=\"\",\"\",ABS!B18)","v":4},{"$f":"IF(ABS!C18=\"\",\"\",ABS!C18)","v":12455},{"$f":"IF(ABS!D18=\"\",\"\",PROPER(ABS!D18))","v":"Aprilia Desi Laraswati"},null,null,"",null,null,null,"","",null,null,"",null,null,null,"","",null,null,"",null,null,null,"","",null,null,"",null,null,null,"","",null,null,"",null,null,null,"","","",null,null,"","",{"$f":"IF(CEKFILE<>\"Sudah Sama\",\"\",IF(AU10=\"\",\"\",NILAI_PREDIKAT(AV10)))","v":""},"",111,"11111","1111","111","11"]
[{"$f":"IF(ABS!B19=\"\",\"\",ABS!B19)","v":5},{"$f":"IF(ABS!C19=\"\",\"\",ABS!C19)","v":12479},{"$f":"IF(ABS!D19=\"\",\"\",PROPER(ABS!D19))","v":"Bagas Adifirmansyah"},null,null,"",null,null,null,"","",null,null,"",null,null,null,"","",null,null,"",null,null,null,"","",null,null,"",null,null,null,"","",null,null,"",null,null,null,"","","",null,null,"","",{"$f":"IF(CEKFILE<>\"Sudah Sama\",\"\",IF(AU11=\"\",\"\",NILAI_PREDIKAT(AV11)))","v":""},"",111,"11111","1111","111","11"]
[{"$f":"IF(ABS!B20=\"\",\"\",ABS!B20)","v":6},{"$f":"IF(ABS!C20=\"\",\"\",ABS!C20)","v":12498},{"$f":"IF(ABS!D20=\"\",\"\",PROPER(ABS!D20))","v":"Dela Shabrina"},null,null,"",null,null,null,"","",null,null,"",null,null,null,"","",null,null,"",null,null,null,"","",null,null,"",null,null,null,"","",null,null,"",null,null,null,"","","",null,null,"","",{"$f":"IF(CEKFILE<>\"Sudah Sama\",\"\",IF(AU12=\"\",\"\",NILAI_PREDIKAT(AV12)))","v":""},"",111,"11111","1111","111","11"]
[{"$f":"IF(ABS!B21=\"\",\"\",ABS!B21)","v":7},{"$f":"IF(ABS!C21=\"\",\"\",ABS!C21)","v":12501},{"$f":"IF(ABS!D21=\"\",\"\",PROPER(ABS!D21))","v":"Desti Rani Indriyani"},null,null,"",null,null,null,"","",null,null,"",null,null,null,"","",null,null,"",null,null,null,"","",null,null,"",null,null,null,"","",null,null,"",null,null,null,"","","",null,null,"","",{"$f":"IF(CEKFILE<>\"Sudah Sama\",\"\",IF(AU13=\"\",\"\",NILAI_PREDIKAT(AV13)))","v":""},"",111,"11111","1111","111","11"]
[{"$f":"IF(ABS!B22=\"\",\"\",ABS!B22)","v":8},{"$f":"IF(ABS!C22=\"\",\"\",ABS!C22)","v":12508},{"$f":"IF(ABS!D22=\"\",\"\",PROPER(ABS!D22))","v":"Dewi Suciati Fauzun"},null,null,"",null,null,null,"","",null,null,"",null,null,null,"","",null,null,"",null,null,null,"","",null,null,"",null,null,null,"","",null,null,"",null,null,null,"","","",null,null,"","",{"$f":"IF(CEKFILE<>\"Sudah Sama\",\"\",IF(AU14=\"\",\"\",NILAI_PREDIKAT(AV14)))","v":""},"",111,"11111","1111","111","11"]
[{"$f":"IF(ABS!B23=\"\",\"\",ABS!B23)","v":9},{"$f":"IF(ABS!C23=\"\",\"\",ABS!C23)","v":12516},{"$f":"IF(ABS!D23=\"\",\"\",PROPER(ABS!D23))","v":"Dimas Nusantara Adi"},null,null,"",null,null,null,"","",null,null,"",null,null,null,"","",null,null,"",null,null,null,"","",null,null,"",null,null,null,"","",null,null,"",null,null,null,"","","",null,null,"","",{"$f":"IF(CEKFILE<>\"Sudah Sama\",\"\",IF(AU15=\"\",\"\",NILAI_PREDIKAT(AV15)))","v":""},"",111,"11111","1111","111","11"]
[{"$f":"IF(ABS!B24=\"\",\"\",ABS!B24)","v":10},{"$f":"IF(ABS!C24=\"\",\"\",ABS!C24)","v":12529},{"$f":"IF(ABS!D24=\"\",\"\",PROPER(ABS!D24))","v":"Edo Wanda Prastyo"},null,null,"",null,null,null,"","",null,null,"",null,null,null,"","",null,null,"",null,null,null,"","",null,null,"",null,null,null,"","",null,null,"",null,null,null,"","","",null,null,"","",{"$f":"IF(CEKFILE<>\"Sudah Sama\",\"\",IF(AU16=\"\",\"\",NILAI_PREDIKAT(AV16)))","v":""},"",111,"11111","1111","111","11"]
[{"$f":"IF(ABS!B25=\"\",\"\",ABS!B25)","v":11},{"$f":"IF(ABS!C25=\"\",\"\",ABS!C25)","v":12537},{"$f":"IF(ABS!D25=\"\",\"\",PROPER(ABS!D25))","v":"Entin Taat Arumningtias"},null,null,"",null,null,null,"","",null,null,"",null,null,null,"","",null,null,"",null,null,null,"","",null,null,"",null,null,null,"","",null,null,"",null,null,null,"","","",null,null,"","",{"$f":"IF(CEKFILE<>\"Sudah Sama\",\"\",IF(AU17=\"\",\"\",NILAI_PREDIKAT(AV17)))","v":""},"",111,"11111","1111","111","11"]
[{"$f":"IF(ABS!B26=\"\",\"\",ABS!B26)","v":12},{"$f":"IF(ABS!C26=\"\",\"\",ABS!C26)","v":12544},{"$f":"IF(ABS!D26=\"\",\"\",PROPER(ABS!D26))","v":"Fajar Adi Pamungkas"},null,null,"",null,null,null,"","",null,null,"",null,null,null,"","",null,null,"",null,null,null,"","",null,null,"",null,null,null,"","",null,null,"",null,null,null,"","","",null,null,"","",{"$f":"IF(CEKFILE<>\"Sudah Sama\",\"\",IF(AU18=\"\",\"\",NILAI_PREDIKAT(AV18)))","v":""},"",111,"11111","1111","111","11"]
[{"$f":"IF(ABS!B27=\"\",\"\",ABS!B27)","v":13},{"$f":"IF(ABS!C27=\"\",\"\",ABS!C27)","v":12796},{"$f":"IF(ABS!D27=\"\",\"\",PROPER(ABS!D27))","v":"Frendy Lasmana Putra"},null,null,"",null,null,null,"","",null,null,"",null,null,null,"","",null,null,"",null,null,null,"","",null,null,"",null,null,null,"","",null,null,"",null,null,null,"","","",null,null,"","",{"$f":"IF(CEKFILE<>\"Sudah Sama\",\"\",IF(AU19=\"\",\"\",NILAI_PREDIKAT(AV19)))","v":""},"",111,"11111","1111","111","11"]
[{"$f":"IF(ABS!B28=\"\",\"\",ABS!B28)","v":14},{"$f":"IF(ABS!C28=\"\",\"\",ABS!C28)","v":12204},{"$f":"IF(ABS!D28=\"\",\"\",PROPER(ABS!D28))","v":"Gana Ridho Akbar"},null,null,"",null,null,null,"","",null,null,"",null,null,null,"","",null,null,"",null,null,null,"","",null,null,"",null,null,null,"","",null,null,"",null,null,null,"","","",null,null,"","",{"$f":"IF(CEKFILE<>\"Sudah Sama\",\"\",IF(AU20=\"\",\"\",NILAI_PREDIKAT(AV20)))","v":""},"",111,"11111","1111","111","11"]
[{"$f":"IF(ABS!B29=\"\",\"\",ABS!B29)","v":15},{"$f":"IF(ABS!C29=\"\",\"\",ABS!C29)","v":12588},{"$f":"IF(ABS!D29=\"\",\"\",PROPER(ABS!D29))","v":"Indra Cahya Permana"},null,null,"",null,null,null,"","",null,null,"",null,null,null,"","",null,null,"",null,null,null,"","",null,null,"",null,null,null,"","",null,null,"",null,null,null,"","","",null,null,"","",{"$f":"IF(CEKFILE<>\"Sudah Sama\",\"\",IF(AU21=\"\",\"\",NILAI_PREDIKAT(AV21)))","v":""},"",111,"11111","1111","111","11"]
[{"$f":"IF(ABS!B30=\"\",\"\",ABS!B30)","v":16},{"$f":"IF(ABS!C30=\"\",\"\",ABS!C30)","v":12598},{"$f":"IF(ABS!D30=\"\",\"\",PROPER(ABS!D30))","v":"Ismia Nivrendita"},null,null,"",null,null,null,"","",null,null,"",null,null,null,"","",null,null,"",null,null,null,"","",null,null,"",null,null,null,"","",null,null,"",null,null,null,"","","",null,null,"","",{"$f":"IF(CEKFILE<>\"Sudah Sama\",\"\",IF(AU22=\"\",\"\",NILAI_PREDIKAT(AV22)))","v":""},"",111,"11111","1111","111","11"]
[{"$f":"IF(ABS!B31=\"\",\"\",ABS!B31)","v":17},{"$f":"IF(ABS!C31=\"\",\"\",ABS!C31)","v":12606},{"$f":"IF(ABS!D31=\"\",\"\",PROPER(ABS!D31))","v":"Krista Ikawan"},null,null,"",null,null,null,"","",null,null,"",null,null,null,"","",null,null,"",null,null,null,"","",null,null,"",null,null,null,"","",null,null,"",null,null,null,"","","",null,null,"","",{"$f":"IF(CEKFILE<>\"Sudah Sama\",\"\",IF(AU23=\"\",\"\",NILAI_PREDIKAT(AV23)))","v":""},"",111,"11111","1111","111","11"]
[{"$f":"IF(ABS!B32=\"\",\"\",ABS!B32)","v":18},{"$f":"IF(ABS!C32=\"\",\"\",ABS!C32)","v":12612},{"$f":"IF(ABS!D32=\"\",\"\",PROPER(ABS!D32))","v":"Lestari"},null,null,"",null,null,null,"","",null,null,"",null,null,null,"","",null,null,"",null,null,null,"","",null,null,"",null,null,null,"","",null,null,"",null,null,null,"","","",null,null,"","",{"$f":"IF(CEKFILE<>\"Sudah Sama\",\"\",IF(AU24=\"\",\"\",NILAI_PREDIKAT(AV24)))","v":""},"",111,"11111","1111","111","11"]
[{"$f":"IF(ABS!B33=\"\",\"\",ABS!B33)","v":19},{"$f":"IF(ABS!C33=\"\",\"\",ABS!C33)","v":12628},{"$f":"IF(ABS!D33=\"\",\"\",PROPER(ABS!D33))","v":"Miasari Sholaiha"},null,null,"",null,null,null,"","",null,null,"",null,null,null,"","",null,null,"",null,null,null,"","",null,null,"",null,null,null,"","",null,null,"",null,null,null,"","","",null,null,"","",{"$f":"IF(CEKFILE<>\"Sudah Sama\",\"\",IF(AU25=\"\",\"\",NILAI_PREDIKAT(AV25)))","v":""},"",111,"11111","1111","111","11"]
[{"$f":"IF(ABS!B34=\"\",\"\",ABS!B34)","v":20},{"$f":"IF(ABS!C34=\"\",\"\",ABS!C34)","v":12629},{"$f":"IF(ABS!D34=\"\",\"\",PROPER(ABS!D34))","v":"Modis Iyonda"},null,null,"",null,null,null,"","",null,null,"",null,null,null,"","",null,null,"",null,null,null,"","",null,null,"",null,null,null,"","",null,null,"",null,null,null,"","","",null,null,"","",{"$f":"IF(CEKFILE<>\"Sudah Sama\",\"\",IF(AU26=\"\",\"\",NILAI_PREDIKAT(AV26)))","v":""},"",111,"11111","1111","111","11"]
[{"$f":"IF(ABS!B35=\"\",\"\",ABS!B35)","v":21},{"$f":"IF(ABS!C35=\"\",\"\",ABS!C35)","v":12639},{"$f":"IF(ABS!D35=\"\",\"\",PROPER(ABS!D35))","v":"Muhammad Agni Farras"},null,null,"",null,null,null,"","",null,null,"",null,null,null,"","",null,null,"",null,null,null,"","",null,null,"",null,null,null,"","",null,null,"",null,null,null,"","","",null,null,"","",{"$f":"IF(CEKFILE<>\"Sudah Sama\",\"\",IF(AU27=\"\",\"\",NILAI_PREDIKAT(AV27)))","v":""},"",111,"11111","1111","111","11"]
[{"$f":"IF(ABS!B36=\"\",\"\",ABS!B36)","v":22},{"$f":"IF(ABS!C36=\"\",\"\",ABS!C36)","v":12673},{"$f":"IF(ABS!D36=\"\",\"\",PROPER(ABS!D36))","v":"Pratomo Setyo Aji"},null,null,"",null,null,null,"","",null,null,"",null,null,null,"","",null,null,"",null,null,null,"","",null,null,"",null,null,null,"","",null,null,"",null,null,null,"","","",null,null,"","",{"$f":"IF(CEKFILE<>\"Sudah Sama\",\"\",IF(AU28=\"\",\"\",NILAI_PREDIKAT(AV28)))","v":""},"",111,"11111","1111","111","11"]
[{"$f":"IF(ABS!B37=\"\",\"\",ABS!B37)","v":23},{"$f":"IF(ABS!C37=\"\",\"\",ABS!C37)","v":12674},{"$f":"IF(ABS!D37=\"\",\"\",PROPER(ABS!D37))","v":"Puji Lestari"},null,null,"",null,null,null,"","",null,null,"",null,null,null,"","",null,null,"",null,null,null,"","",null,null,"",null,null,null,"","",null,null,"",null,null,null,"","","",null,null,"","",{"$f":"IF(CEKFILE<>\"Sudah Sama\",\"\",IF(AU29=\"\",\"\",NILAI_PREDIKAT(AV29)))","v":""},"",111,"11111","1111","111","11"]
[{"$f":"IF(ABS!B38=\"\",\"\",ABS!B38)","v":24},{"$f":"IF(ABS!C38=\"\",\"\",ABS!C38)","v":12701},{"$f":"IF(ABS!D38=\"\",\"\",PROPER(ABS!D38))","v":"Rindra Alriyan"},null,null,"",null,null,null,"","",null,null,"",null,null,null,"","",null,null,"",null,null,null,"","",null,null,"",null,null,null,"","",null,null,"",null,null,null,"","","",null,null,"","",{"$f":"IF(CEKFILE<>\"Sudah Sama\",\"\",IF(AU30=\"\",\"\",NILAI_PREDIKAT(AV30)))","v":""},"",111,"11111","1111","111","11"]
[{"$f":"IF(ABS!B39=\"\",\"\",ABS!B39)","v":25},{"$f":"IF(ABS!C39=\"\",\"\",ABS!C39)","v":12729},{"$f":"IF(ABS!D39=\"\",\"\",PROPER(ABS!D39))","v":"Sinta Anggraeni"},null,null,"",null,null,null,"","",null,null,"",null,null,null,"","",null,null,"",null,null,null,"","",null,null,"",null,null,null,"","",null,null,"",null,null,null,"","","",null,null,"","",{"$f":"IF(CEKFILE<>\"Sudah Sama\",\"\",IF(AU31=\"\",\"\",NILAI_PREDIKAT(AV31)))","v":""},"",111,"11111","1111","111","11"]
[{"$f":"IF(ABS!B40=\"\",\"\",ABS!B40)","v":26},{"$f":"IF(ABS!C40=\"\",\"\",ABS!C40)","v":12734},{"$f":"IF(ABS!D40=\"\",\"\",PROPER(ABS!D40))","v":"Sofi"},null,null,"",null,null,null,"","",null,null,"",null,null,null,"","",null,null,"",null,null,null,"","",null,null,"",null,null,null,"","",null,null,"",null,null,null,"","","",null,null,"","",{"$f":"IF(CEKFILE<>\"Sudah Sama\",\"\",IF(AU32=\"\",\"\",NILAI_PREDIKAT(AV32)))","v":""},"",111,"11111","1111","111","11"]
[{"$f":"IF(ABS!B41=\"\",\"\",ABS!B41)","v":27},{"$f":"IF(ABS!C41=\"\",\"\",ABS!C41)","v":12745},{"$f":"IF(ABS!D41=\"\",\"\",PROPER(ABS!D41))","v":"Tika Wulandari"},null,null,"",null,null,null,"","",null,null,"",null,null,null,"","",null,null,"",null,null,null,"","",null,null,"",null,null,null,"","",null,null,"",null,null,null,"","","",null,null,"","",{"$f":"IF(CEKFILE<>\"Sudah Sama\",\"\",IF(AU33=\"\",\"\",NILAI_PREDIKAT(AV33)))","v":""},"",111,"11111","1111","111","11"]
[{"$f":"IF(ABS!B42=\"\",\"\",ABS!B42)","v":28},{"$f":"IF(ABS!C42=\"\",\"\",ABS!C42)","v":12747},{"$f":"IF(ABS!D42=\"\",\"\",PROPER(ABS!D42))","v":"Tomy Faizal Manaf"},null,null,"",null,null,null,"","",null,null,"",null,null,null,"","",null,null,"",null,null,null,"","",null,null,"",null,null,null,"","",null,null,"",null,null,null,"","","",null,null,"","",{"$f":"IF(CEKFILE<>\"Sudah Sama\",\"\",IF(AU34=\"\",\"\",NILAI_PREDIKAT(AV34)))","v":""},"",111,"11111","1111","111","11"]
[{"$f":"IF(ABS!B43=\"\",\"\",ABS!B43)","v":29},{"$f":"IF(ABS!C43=\"\",\"\",ABS!C43)","v":12748},{"$f":"IF(ABS!D43=\"\",\"\",PROPER(ABS!D43))","v":"Toni Gunawan"},null,null,"",null,null,null,"","",null,null,"",null,null,null,"","",null,null,"",null,null,null,"","",null,null,"",null,null,null,"","",null,null,"",null,null,null,"","","",null,null,"","",{"$f":"IF(CEKFILE<>\"Sudah Sama\",\"\",IF(AU35=\"\",\"\",NILAI_PREDIKAT(AV35)))","v":""},"",111,"11111","1111","111","11"]
[{"$f":"IF(ABS!B44=\"\",\"\",ABS!B44)","v":30},{"$f":"IF(ABS!C44=\"\",\"\",ABS!C44)","v":12757},{"$f":"IF(ABS!D44=\"\",\"\",PROPER(ABS!D44))","v":"Vevy Dyas Lestari"},null,null,"",null,null,null,"","",null,null,"",null,null,null,"","",null,null,"",null,null,null,"","",null,null,"",null,null,null,"","",null,null,"",null,null,null,"","","",null,null,"","",{"$f":"IF(CEKFILE<>\"Sudah Sama\",\"\",IF(AU36=\"\",\"\",NILAI_PREDIKAT(AV36)))","v":""},"",111,"11111","1111","111","11"]
[{"$f":"IF(ABS!B45=\"\",\"\",ABS!B45)","v":31},{"$f":"IF(ABS!C45=\"\",\"\",ABS!C45)","v":12765},{"$f":"IF(ABS!D45=\"\",\"\",PROPER(ABS!D45))","v":"Wahyu Ardhi Gunawan"},null,null,"",null,null,null,"","",null,null,"",null,null,null,"","",null,null,"",null,null,null,"","",null,null,"",null,null,null,"","",null,null,"",null,null,null,"","","",null,null,"","",{"$f":"IF(CEKFILE<>\"Sudah Sama\",\"\",IF(AU37=\"\",\"\",NILAI_PREDIKAT(AV37)))","v":""},"",111,"11111","1111","111","11"]
[{"$f":"IF(ABS!B46=\"\",\"\",ABS!B46)","v":32},{"$f":"IF(ABS!C46=\"\",\"\",ABS!C46)","v":12767},{"$f":"IF(ABS!D46=\"\",\"\",PROPER(ABS!D46))","v":"Widi Pangestu"},null,null,"",null,null,null,"","",null,null,"",null,null,null,"","",null,null,"",null,null,null,"","",null,null,"",null,null,null,"","",null,null,"",null,null,null,"","","",null,null,"","",{"$f":"IF(CEKFILE<>\"Sudah Sama\",\"\",IF(AU38=\"\",\"\",NILAI_PREDIKAT(AV38)))","v":""},"",111,"11111","1111","111","11"]
[{"$f":"IF(ABS!B47=\"\",\"\",ABS!B47)","v":33},{"$f":"IF(ABS!C47=\"\",\"\",ABS!C47)","v":12784},{"$f":"IF(ABS!D47=\"\",\"\",PROPER(ABS!D47))","v":"Yuli Atifah"},null,null,"",null,null,null,"","",null,null,"",null,null,null,"","",null,null,"",null,null,null,"","",null,null,"",null,null,null,"","",null,null,"",null,null,null,"","","",null,null,"","",{"$f":"IF(CEKFILE<>\"Sudah Sama\",\"\",IF(AU39=\"\",\"\",NILAI_PREDIKAT(AV39)))","v":""},"",111,"11111","1111","111","11"]
[{"$f":"IF(ABS!B48=\"\",\"\",ABS!B48)","v":34},{"$f":"IF(ABS!C48=\"\",\"\",ABS!C48)","v":12788},{"$f":"IF(ABS!D48=\"\",\"\",PROPER(ABS!D48))","v":"Yusuf Dwi Prasetya"},null,null,"",null,null,null,"","",null,null,"",null,null,null,"","",null,null,"",null,null,null,"","",null,null,"",null,null,null,"","",null,null,"",null,null,null,"","","",null,null,"","",{"$f":"IF(CEKFILE<>\"Sudah Sama\",\"\",IF(AU40=\"\",\"\",NILAI_PREDIKAT(AV40)))","v":""},"",111,"11111","1111","111","11"]
[{"$f":"IF(ABS!B49=\"\",\"\",ABS!B49)","v":""},{"$f":"IF(ABS!C49=\"\",\"\",ABS!C49)","v":""},{"$f":"IF(ABS!D49=\"\",\"\",PROPER(ABS!D49))","v":""},null,null,"",null,null,null,"","",null,null,"",null,null,null,"","",null,null,"",null,null,null,"","",null,null,"",null,null,null,"","",null,null,"",null,null,null,"","","",null,null,"","",{"$f":"IF(CEKFILE<>\"Sudah Sama\",\"\",IF(AU41=\"\",\"\",NILAI_PREDIKAT(AV41)))","v":""},"","","11111","1111","111","11"]
[{"$f":"IF(ABS!B50=\"\",\"\",ABS!B50)","v":""},{"$f":"IF(ABS!C50=\"\",\"\",ABS!C50)","v":""},{"$f":"IF(ABS!D50=\"\",\"\",PROPER(ABS!D50))","v":""},null,null,"",null,null,null,"","",null,null,"",null,null,null,"","",null,null,"",null,null,null,"","",null,null,"",null,null,null,"","",null,null,"",null,null,null,"","","",null,null,"","",{"$f":"IF(CEKFILE<>\"Sudah Sama\",\"\",IF(AU42=\"\",\"\",NILAI_PREDIKAT(AV42)))","v":""},"","","11111","1111","111","11"]
[{"$f":"IF(ABS!B51=\"\",\"\",ABS!B51)","v":""},{"$f":"IF(ABS!C51=\"\",\"\",ABS!C51)","v":""},{"$f":"IF(ABS!D51=\"\",\"\",PROPER(ABS!D51))","v":""},null,null,"",null,null,null,"","",null,null,"",null,null,null,"","",null,null,"",null,null,null,"","",null,null,"",null,null,null,"","",null,null,"",null,null,null,"","","",null,null,"","",{"$f":"IF(CEKFILE<>\"Sudah Sama\",\"\",IF(AU43=\"\",\"\",NILAI_PREDIKAT(AV43)))","v":""},"","","11111","1111","111","11"]
[{"$f":"IF(ABS!B52=\"\",\"\",ABS!B52)","v":""},{"$f":"IF(ABS!C52=\"\",\"\",ABS!C52)","v":""},{"$f":"IF(ABS!D52=\"\",\"\",PROPER(ABS!D52))","v":""},null,null,"",null,null,null,"","",null,null,"",null,null,null,"","",null,null,"",null,null,null,"","",null,null,"",null,null,null,"","",null,null,"",null,null,null,"","","",null,null,"","",{"$f":"IF(CEKFILE<>\"Sudah Sama\",\"\",IF(AU44=\"\",\"\",NILAI_PREDIKAT(AV44)))","v":""},"","","11111","1111","111","11"]
["RATA-RATA",null,null,{"$f":"IF(SUM(D7:D44)=0,\"\",AVERAGE(D7:D44))","v":37},76,"",75,80,"","",{"$f":"IF(SUM(K7:K44)=0,\"\",AVERAGE(K7:K44))","v":""},{"$f":"IF(SUM(L7:L44)=0,\"\",AVERAGE(L7:L44))","v":75},"","",80,85,"","",{"$f":"IF(SUM(S7:S44)=0,\"\",AVERAGE(S7:S44))","v":""},{"$f":"IF(SUM(T7:T44)=0,\"\",AVERAGE(T7:T44))","v":77},"","",86,93,"","",{"$f":"IF(SUM(AA7:AA44)=0,\"\",AVERAGE(AA7:AA44))","v":""},{"$f":"IF(SUM(AB7:AB44)=0,\"\",AVERAGE(AB7:AB44))","v":""},"","","","","","",{"$f":"IF(SUM(AI7:AI44)=0,\"\",AVERAGE(AI7:AI44))","v":""},{"$f":"IF(SUM(AJ7:AJ44)=0,\"\",AVERAGE(AJ7:AJ44))","v":""},"","","","","","",{"$f":"IF(SUM(AQ7:AQ44)=0,\"\",AVERAGE(AQ7:AQ44))","v":""},{"$f":"IF(SUM(AR7:AR44)=0,\"\",AVERAGE(AR7:AR44))","v":""},15,80,{"$f":"IF(OR($AR45=0,$AR45=\"\"),\"\",ROUND(((2*AR45)+SUM(AS45:AT45))/4,2))","v":""},""]

{"sheet":"PSI","index":6,"n_rows":43,"n_cols":19,"rows_kept":43,"cut":false,"hidden":false,"merged":[[2,15,2,17],[2,18,3,18],[2,12,2,14],[2,6,2,8],[2,9,2,11],[42,0,42,2],[2,0,3,0],[2,1,3,1],[2,2,3,2],[2,3,2,5]]}
["DAFTAR NILAI KETRAMPILAN"]
[]
["NO","NIS","NAMA","Nilai Praktik",null,null,"Nilai Projek",null,null,"Nilai Portofolio",null,null,"Rerata Nilai",null,null,"NILAI RAPOR / (LHB)",null,null,"DESKRIPSI"]
[null,null,null,"KD1","KD2","KD3","KD1","KD2","KD3","KD1","KD2","KD3","Praktik","Projek","Porto\nfolio","Skala 100","Skala 4","Predikat"]
[{"$f":"IF(ABS!B15=\"\",\"\",ABS!B15)","v":1},{"$f":"IF(ABS!C15=\"\",\"\",ABS!C15)","v":12419},{"$f":"IF(ABS!D15=\"\",\"\",PROPER(ABS!D15))","v":"Adhitya Ferdi Kristianto"},80,null,null,75,null,null,80,null,null,{"$f":"IF(OR(D5=0,D5=\"\"),\"\",IF(AND(E5=0,F5=0),D5,IF(F5=0,AVERAGE(D5:E5),AVERAGE(D5:F5))))","v":80},{"$f":"IF(OR(G5=0,G5=\"\"),\"\",IF(AND(H5=0,I5=0),G5,IF(I5=0,AVERAGE(G5:H5),AVERAGE(G5:I5))))","v":75},{"$f":"IF(OR(J5=0,J5=\"\"),\"\",IF(AND(K5=0,L5=0),J5,IF(L5=0,AVERAGE(J5:K5),AVERAGE(J5:L5))))","v":80},{"$f":"IF(OR(M5=0,M5=\"\"),\"\",IF(AND(N5=0,O5=0),(2*M5)/4,IF(O5=0,SUM(2*M5,N5)/4,SUM(2*M5,N5,O5)/4)))","v":78.75},{"$f":"IF(OR($M5=0,$M5=\"\"),\"\",ROUND((P5/100)*4,2))","v":3.15},{"$f":"IF(P5=\"\",\"\",NILAI_PREDIKAT(Q5))","v":"B+"},{"$f":"IFERROR(VLOOKUP(Nilai_Predikat2(Q5),DESKRIPSIKETRAMPILAN,2,FALSE),\"\")","v":"Menguasai Ketrampilan Minimum Menganalisis Model Atom, Struktur Atom, Dan Tabel Periodik Namun Dalam Kejujuran Dan Percaya Diri Dalam Mengikuti Ujian Masih Perlu Ditingkatkan"}]
[{"$f":"IF(ABS!B16=\"\",\"\",ABS!B16)","v":2},{"$f":"IF(ABS!C16=\"\",\"\",ABS!C16)","v":12428},{"$f":"IF(ABS!D16=\"\",\"\",PROPER(ABS!D16))","v":"Agung Dwi Saputro"},null,null,null,null,null,null,null,null,null,{"$f":"IF(OR(D6=0,D6=\"\"),\"\",IF(AND(E6=0,F6=0),D6,IF(F6=0,AVERAGE(D6:E6),AVERAGE(D6:F6))))","v":""},{"$f":"IF(OR(G6=0,G6=\"\"),\"\",IF(AND(H6=0,I6=0),G6,IF(I6=0,AVERAGE(G6:H6),AVERAGE(G6:I6))))","v":""},{"$f":"IF(OR(J6=0,J6=\"\"),\"\",IF(AND(K6=0,L6=0),J6,IF(L6=0,AVERAGE(J6:K6),AVERAGE(J6:L6))))","v":""},{"$f":"IF(OR(M6=0,M6=\"\"),\"\",IF(AND(N6=0,O6=0),(2*M6)/4,IF(O6=0,SUM(2*M6,N6)/4,SUM(2*M6,N6,O6)/4)))","v":""},{"$f":"IF(OR($M6=0,$M6=\"\"),\"\",ROUND((P6/100)*4,2))","v":""},{"$f":"IF(P6=\"\",\"\",NILAI_PREDIKAT(Q6))","v":""},{"$f":"IFERROR(VLOOKUP(Nilai_Predikat2(Q6),DESKRIPSIKETRAMPILAN,2,FALSE),\"\")","v":""}]
[{"$f":"IF(ABS!B17=\"\",\"\",ABS!B17)","v":3},{"$f":"IF(ABS!C17=\"\",\"\",ABS!C17)","v":12453},{"$f":"IF(ABS!D17=\"\",\"\",PROPER(ABS!D17))","v":"Anissa Dhea Paramitha"},null,null,null,null,null,null,null,null,null,"","","","","",{"$f":"IF(P7=\"\",\"\",NILAI_PREDIKAT(Q7))","v":""},{"$f":"IFERROR(VLOOKUP(Nilai_Predikat2(Q7),DESKRIPSIKETRAMPILAN,2,FALSE),\"\")","v":""}]
[{"$f":"IF(ABS!B18=\"\",\"\",ABS!B18)","v":4},{"$f":"IF(ABS!C18=\"\",\"\",ABS!C18)","v":12455},{"$f":"IF(ABS!D18=\"\",\"\",PROPER(ABS!D18))","v":"Aprilia Desi Laraswati"},null,null,null,null,null,null,null,null,null,"","","","","",{"$f":"IF(P8=\"\",\"\",NILAI_PREDIKAT(Q8))","v":""},{"$f":"IFERROR(VLOOKUP(Nilai_Predikat2(Q8),DESKRIPSIKETRAMPILAN,2,FALSE),\"\")","v":""}]
[{"$f":"IF(ABS!B19=\"\",\"\",ABS!B19)","v":5},{"$f":"IF(ABS!C19=\"\",\"\",ABS!C19)","v":12479},{"$f":"IF(ABS!D19=\"\",\"\",PROPER(ABS!D19))","v":"Bagas Adifirmansyah"},null,null,null,null,null,null,null,null,null,"","","","","",{"$f":"IF(P9=\"\",\"\",NILAI_PREDIKAT(Q9))","v":""},{"$f":"IFERROR(VLOOKUP(Nilai_Predikat2(Q9),DESKRIPSIKETRAMPILAN,2,FALSE),\"\")","v":""}]
[{"$f":"IF(ABS!B20=\"\",\"\",ABS!B20)","v":6},{"$f":"IF(ABS!C20=\"\",\"\",ABS!C20)","v":12498},{"$f":"IF(ABS!D20=\"\",\"\",PROPER(ABS!D20))","v":"Dela Shabrina"},null,null,null,null,null,null,null,null,null,"","","","","",{"$f":"IF(P10=\"\",\"\",NILAI_PREDIKAT(Q10))","v":""},{"$f":"IFERROR(VLOOKUP(Nilai_Predikat2(Q10),DESKRIPSIKETRAMPILAN,2,FALSE),\"\")","v":""}]
[{"$f":"IF(ABS!B21=\"\",\"\",ABS!B21)","v":7},{"$f":"IF(ABS!C21=\"\",\"\",ABS!C21)","v":12501},{"$f":"IF(ABS!D21=\"\",\"\",PROPER(ABS!D21))","v":"Desti Rani Indriyani"},null,null,null,null,null,null,null,null,null,"","","","","",{"$f":"IF(P11=\"\",\"\",NILAI_PREDIKAT(Q11))","v":""},{"$f":"IFERROR(VLOOKUP(Nilai_Predikat2(Q11),DESKRIPSIKETRAMPILAN,2,FALSE),\"\")","v":""}]
[{"$f":"IF(ABS!B22=\"\",\"\",ABS!B22)","v":8},{"$f":"IF(ABS!C22=\"\",\"\",ABS!C22)","v":12508},{"$f":"IF(ABS!D22=\"\",\"\",PROPER(ABS!D22))","v":"Dewi Suciati Fauzun"},null,null,null,null,null,null,null,null,null,"","","","","",{"$f":"IF(P12=\"\",\"\",NILAI_PREDIKAT(Q12))","v":""},{"$f":"IFERROR(VLOOKUP(Nilai_Predikat2(Q12),DESKRIPSIKETRAMPILAN,2,FALSE),\"\")","v":""}]
[{"$f":"IF(ABS!B23=\"\",\"\",ABS!B23)","v":9},{"$f":"IF(ABS!C23=\"\",\"\",ABS!C23)","v":12516},{"$f":"IF(ABS!D23=\"\",\"\",PROPER(ABS!D23))","v":"Dimas Nusantara Adi"},null,null,null,null,null,null,null,null,null,"","","","","",{"$f":"IF(P13=\"\",\"\",NILAI_PREDIKAT(Q13))","v":""},{"$f":"IFERROR(VLOOKUP(Nilai_Predikat2(Q13),DESKRIPSIKETRAMPILAN,2,FALSE),\"\")","v":""}]
[{"$f":"IF(ABS!B24=\"\",\"\",ABS!B24)","v":10},{"$f":"IF(ABS!C24=\"\",\"\",ABS!C24)","v":12529},{"$f":"IF(ABS!D24=\"\",\"\",PROPER(ABS!D24))","v":"Edo Wanda Prastyo"},null,null,null,null,null,null,null,null,null,"","","","","",{"$f":"IF(P14=\"\",\"\",NILAI_PREDIKAT(Q14))","v":""},{"$f":"IFERROR(VLOOKUP(Nilai_Predikat2(Q14),DESKRIPSIKETRAMPILAN,2,FALSE),\"\")","v":""}]
[{"$f":"IF(ABS!B25=\"\",\"\",ABS!B25)","v":11},{"$f":"IF(ABS!C25=\"\",\"\",ABS!C25)","v":12537},{"$f":"IF(ABS!D25=\"\",\"\",PROPER(ABS!D25))","v":"Entin Taat Arumningtias"},null,null,null,null,null,null,null,null,null,"","","","","",{"$f":"IF(P15=\"\",\"\",NILAI_PREDIKAT(Q15))","v":""},{"$f":"IFERROR(VLOOKUP(Nilai_Predikat2(Q15),DESKRIPSIKETRAMPILAN,2,FALSE),\"\")","v":""}]
[{"$f":"IF(ABS!B26=\"\",\"\",ABS!B26)","v":12},{"$f":"IF(ABS!C26=\"\",\"\",ABS!C26)","v":12544},{"$f":"IF(ABS!D26=\"\",\"\",PROPER(ABS!D26))","v":"Fajar Adi Pamungkas"},null,null,null,null,null,null,null,null,null,"","","","","",{"$f":"IF(P16=\"\",\"\",NILAI_PREDIKAT(Q16))","v":""},{"$f":"IFERROR(VLOOKUP(Nilai_Predikat2(Q16),DESKRIPSIKETRAMPILAN,2,FALSE),\"\")","v":""}]
[{"$f":"IF(ABS!B27=\"\",\"\",ABS!B27)","v":13},{"$f":"IF(ABS!C27=\"\",\"\",ABS!C27)","v":12796},{"$f":"IF(ABS!D27=\"\",\"\",PROPER(ABS!D27))","v":"Frendy Lasmana Putra"},null,null,null,null,null,null,null,null,null,"","","","","",{"$f":"IF(P17=\"\",\"\",NILAI_PREDIKAT(Q17))","v":""},{"$f":"IFERROR(VLOOKUP(Nilai_Predikat2(Q17),DESKRIPSIKETRAMPILAN,2,FALSE),\"\")","v":""}]
[{"$f":"IF(ABS!B28=\"\",\"\",ABS!B28)","v":14},{"$f":"IF(ABS!C28=\"\",\"\",ABS!C28)","v":12204},{"$f":"IF(ABS!D28=\"\",\"\",PROPER(ABS!D28))","v":"Gana Ridho Akbar"},null,null,null,null,null,null,null,null,null,"","","","","",{"$f":"IF(P18=\"\",\"\",NILAI_PREDIKAT(Q18))","v":""},{"$f":"IFERROR(VLOOKUP(Nilai_Predikat2(Q18),DESKRIPSIKETRAMPILAN,2,FALSE),\"\")","v":""}]
[{"$f":"IF(ABS!B29=\"\",\"\",ABS!B29)","v":15},{"$f":"IF(ABS!C29=\"\",\"\",ABS!C29)","v":12588},{"$f":"IF(ABS!D29=\"\",\"\",PROPER(ABS!D29))","v":"Indra Cahya Permana"},null,null,null,null,null,null,null,null,null,"","","","","",{"$f":"IF(P19=\"\",\"\",NILAI_PREDIKAT(Q19))","v":""},{"$f":"IFERROR(VLOOKUP(Nilai_Predikat2(Q19),DESKRIPSIKETRAMPILAN,2,FALSE),\"\")","v":""}]
[{"$f":"IF(ABS!B30=\"\",\"\",ABS!B30)","v":16},{"$f":"IF(ABS!C30=\"\",\"\",ABS!C30)","v":12598},{"$f":"IF(ABS!D30=\"\",\"\",PROPER(ABS!D30))","v":"Ismia Nivrendita"},null,null,null,null,null,null,null,null,null,"","","","","",{"$f":"IF(P20=\"\",\"\",NILAI_PREDIKAT(Q20))","v":""},{"$f":"IFERROR(VLOOKUP(Nilai_Predikat2(Q20),DESKRIPSIKETRAMPILAN,2,FALSE),\"\")","v":""}]
[{"$f":"IF(ABS!B31=\"\",\"\",ABS!B31)","v":17},{"$f":"IF(ABS!C31=\"\",\"\",ABS!C31)","v":12606},{"$f":"IF(ABS!D31=\"\",\"\",PROPER(ABS!D31))","v":"Krista Ikawan"},null,null,null,null,null,null,null,null,null,"","","","","",{"$f":"IF(P21=\"\",\"\",NILAI_PREDIKAT(Q21))","v":""},{"$f":"IFERROR(VLOOKUP(Nilai_Predikat2(Q21),DESKRIPSIKETRAMPILAN,2,FALSE),\"\")","v":""}]
[{"$f":"IF(ABS!B32=\"\",\"\",ABS!B32)","v":18},{"$f":"IF(ABS!C32=\"\",\"\",ABS!C32)","v":12612},{"$f":"IF(ABS!D32=\"\",\"\",PROPER(ABS!D32))","v":"Lestari"},null,null,null,null,null,null,null,null,null,"","","","","",{"$f":"IF(P22=\"\",\"\",NILAI_PREDIKAT(Q22))","v":""},{"$f":"IFERROR(VLOOKUP(Nilai_Predikat2(Q22),DESKRIPSIKETRAMPILAN,2,FALSE),\"\")","v":""}]
[{"$f":"IF(ABS!B33=\"\",\"\",ABS!B33)","v":19},{"$f":"IF(ABS!C33=\"\",\"\",ABS!C33)","v":12628},{"$f":"IF(ABS!D33=\"\",\"\",PROPER(ABS!D33))","v":"Miasari Sholaiha"},null,null,null,null,null,null,null,null,null,"","","","","",{"$f":"IF(P23=\"\",\"\",NILAI_PREDIKAT(Q23))","v":""},{"$f":"IFERROR(VLOOKUP(Nilai_Predikat2(Q23),DESKRIPSIKETRAMPILAN,2,FALSE),\"\")","v":""}]
[{"$f":"IF(ABS!B34=\"\",\"\",ABS!B34)","v":20},{"$f":"IF(ABS!C34=\"\",\"\",ABS!C34)","v":12629},{"$f":"IF(ABS!D34=\"\",\"\",PROPER(ABS!D34))","v":"Modis Iyonda"},null,null,null,null,null,null,null,null,null,"","","","","",{"$f":"IF(P24=\"\",\"\",NILAI_PREDIKAT(Q24))","v":""},{"$f":"IFERROR(VLOOKUP(Nilai_Predikat2(Q24),DESKRIPSIKETRAMPILAN,2,FALSE),\"\")","v":""}]
[{"$f":"IF(ABS!B35=\"\",\"\",ABS!B35)","v":21},{"$f":"IF(ABS!C35=\"\",\"\",ABS!C35)","v":12639},{"$f":"IF(ABS!D35=\"\",\"\",PROPER(ABS!D35))","v":"Muhammad Agni Farras"},null,null,null,null,null,null,null,null,null,"","","","","",{"$f":"IF(P25=\"\",\"\",NILAI_PREDIKAT(Q25))","v":""},{"$f":"IFERROR(VLOOKUP(Nilai_Predikat2(Q25),DESKRIPSIKETRAMPILAN,2,FALSE),\"\")","v":""}]
[{"$f":"IF(ABS!B36=\"\",\"\",ABS!B36)","v":22},{"$f":"IF(ABS!C36=\"\",\"\",ABS!C36)","v":12673},{"$f":"IF(ABS!D36=\"\",\"\",PROPER(ABS!D36))","v":"Pratomo Setyo Aji"},null,null,null,null,null,null,null,null,null,"","","","","",{"$f":"IF(P26=\"\",\"\",NILAI_PREDIKAT(Q26))","v":""},{"$f":"IFERROR(VLOOKUP(Nilai_Predikat2(Q26),DESKRIPSIKETRAMPILAN,2,FALSE),\"\")","v":""}]
[{"$f":"IF(ABS!B37=\"\",\"\",ABS!B37)","v":23},{"$f":"IF(ABS!C37=\"\",\"\",ABS!C37)","v":12674},{"$f":"IF(ABS!D37=\"\",\"\",PROPER(ABS!D37))","v":"Puji Lestari"},null,null,null,null,null,null,null,null,null,"","","","","",{"$f":"IF(P27=\"\",\"\",NILAI_PREDIKAT(Q27))","v":""},{"$f":"IFERROR(VLOOKUP(Nilai_Predikat2(Q27),DESKRIPSIKETRAMPILAN,2,FALSE),\"\")","v":""}]
[{"$f":"IF(ABS!B38=\"\",\"\",ABS!B38)","v":24},{"$f":"IF(ABS!C38=\"\",\"\",ABS!C38)","v":12701},{"$f":"IF(ABS!D38=\"\",\"\",PROPER(ABS!D38))","v":"Rindra Alriyan"},null,null,null,null,null,null,null,null,null,"","","","","",{"$f":"IF(P28=\"\",\"\",NILAI_PREDIKAT(Q28))","v":""},{"$f":"IFERROR(VLOOKUP(Nilai_Predikat2(Q28),DESKRIPSIKETRAMPILAN,2,FALSE),\"\")","v":""}]
[{"$f":"IF(ABS!B39=\"\",\"\",ABS!B39)","v":25},{"$f":"IF(ABS!C39=\"\",\"\",ABS!C39)","v":12729},{"$f":"IF(ABS!D39=\"\",\"\",PROPER(ABS!D39))","v":"Sinta Anggraeni"},null,null,null,null,null,null,null,null,null,"","","","","",{"$f":"IF(P29=\"\",\"\",NILAI_PREDIKAT(Q29))","v":""},{"$f":"IFERROR(VLOOKUP(Nilai_Predikat2(Q29),DESKRIPSIKETRAMPILAN,2,FALSE),\"\")","v":""}]
[{"$f":"IF(ABS!B40=\"\",\"\",ABS!B40)","v":26},{"$f":"IF(ABS!C40=\"\",\"\",ABS!C40)","v":12734},{"$f":"IF(ABS!D40=\"\",\"\",PROPER(ABS!D40))","v":"Sofi"},null,null,null,null,null,null,null,null,null,"","","","","",{"$f":"IF(P30=\"\",\"\",NILAI_PREDIKAT(Q30))","v":""},{"$f":"IFERROR(VLOOKUP(Nilai_Predikat2(Q30),DESKRIPSIKETRAMPILAN,2,FALSE),\"\")","v":""}]
[{"$f":"IF(ABS!B41=\"\",\"\",ABS!B41)","v":27},{"$f":"IF(ABS!C41=\"\",\"\",ABS!C41)","v":12745},{"$f":"IF(ABS!D41=\"\",\"\",PROPER(ABS!D41))","v":"Tika Wulandari"},null,null,null,null,null,null,null,null,null,"","","","","",{"$f":"IF(P31=\"\",\"\",NILAI_PREDIKAT(Q31))","v":""},{"$f":"IFERROR(VLOOKUP(Nilai_Predikat2(Q31),DESKRIPSIKETRAMPILAN,2,FALSE),\"\")","v":""}]
[{"$f":"IF(ABS!B42=\"\",\"\",ABS!B42)","v":28},{"$f":"IF(ABS!C42=\"\",\"\",ABS!C42)","v":12747},{"$f":"IF(ABS!D42=\"\",\"\",PROPER(ABS!D42))","v":"Tomy Faizal Manaf"},null,null,null,null,null,null,null,null,null,"","","","","",{"$f":"IF(P32=\"\",\"\",NILAI_PREDIKAT(Q32))","v":""},{"$f":"IFERROR(VLOOKUP(Nilai_Predikat2(Q32),DESKRIPSIKETRAMPILAN,2,FALSE),\"\")","v":""}]
[{"$f":"IF(ABS!B43=\"\",\"\",ABS!B43)","v":29},{"$f":"IF(ABS!C43=\"\",\"\",ABS!C43)","v":12748},{"$f":"IF(ABS!D43=\"\",\"\",PROPER(ABS!D43))","v":"Toni Gunawan"},null,null,null,null,null,null,null,null,null,"","","","","",{"$f":"IF(P33=\"\",\"\",NILAI_PREDIKAT(Q33))","v":""},{"$f":"IFERROR(VLOOKUP(Nilai_Predikat2(Q33),DESKRIPSIKETRAMPILAN,2,FALSE),\"\")","v":""}]
[{"$f":"IF(ABS!B44=\"\",\"\",ABS!B44)","v":30},{"$f":"IF(ABS!C44=\"\",\"\",ABS!C44)","v":12757},{"$f":"IF(ABS!D44=\"\",\"\",PROPER(ABS!D44))","v":"Vevy Dyas Lestari"},null,null,null,null,null,null,null,null,null,"","","","","",{"$f":"IF(P34=\"\",\"\",NILAI_PREDIKAT(Q34))","v":""},{"$f":"IFERROR(VLOOKUP(Nilai_Predikat2(Q34),DESKRIPSIKETRAMPILAN,2,FALSE),\"\")","v":""}]
[{"$f":"IF(ABS!B45=\"\",\"\",ABS!B45)","v":31},{"$f":"IF(ABS!C45=\"\",\"\",ABS!C45)","v":12765},{"$f":"IF(ABS!D45=\"\",\"\",PROPER(ABS!D45))","v":"Wahyu Ardhi Gunawan"},null,null,null,null,null,null,null,null,null,"","","","","",{"$f":"IF(P35=\"\",\"\",NILAI_PREDIKAT(Q35))","v":""},{"$f":"IFERROR(VLOOKUP(Nilai_Predikat2(Q35),DESKRIPSIKETRAMPILAN,2,FALSE),\"\")","v":""}]
[{"$f":"IF(ABS!B46=\"\",\"\",ABS!B46)","v":32},{"$f":"IF(ABS!C46=\"\",\"\",ABS!C46)","v":12767},{"$f":"IF(ABS!D46=\"\",\"\",PROPER(ABS!D46))","v":"Widi Pangestu"},null,null,null,null,null,null,null,null,null,"","","","","",{"$f":"IF(P36=\"\",\"\",NILAI_PREDIKAT(Q36))","v":""},{"$f":"IFERROR(VLOOKUP(Nilai_Predikat2(Q36),DESKRIPSIKETRAMPILAN,2,FALSE),\"\")","v":""}]
[{"$f":"IF(ABS!B47=\"\",\"\",ABS!B47)","v":33},{"$f":"IF(ABS!C47=\"\",\"\",ABS!C47)","v":12784},{"$f":"IF(ABS!D47=\"\",\"\",PROPER(ABS!D47))","v":"Yuli Atifah"},null,null,null,null,null,null,null,null,null,"","","","","",{"$f":"IF(P37=\"\",\"\",NILAI_PREDIKAT(Q37))","v":""},{"$f":"IFERROR(VLOOKUP(Nilai_Predikat2(Q37),DESKRIPSIKETRAMPILAN,2,FALSE),\"\")","v":""}]
[{"$f":"IF(ABS!B48=\"\",\"\",ABS!B48)","v":34},{"$f":"IF(ABS!C48=\"\",\"\",ABS!C48)","v":12788},{"$f":"IF(ABS!D48=\"\",\"\",PROPER(ABS!D48))","v":"Yusuf Dwi Prasetya"},null,null,null,null,null,null,null,null,null,"","","","","",{"$f":"IF(P38=\"\",\"\",NILAI_PREDIKAT(Q38))","v":""},{"$f":"IFERROR(VLOOKUP(Nilai_Predikat2(Q38),DESKRIPSIKETRAMPILAN,2,FALSE),\"\")","v":""}]
[{"$f":"IF(ABS!B49=\"\",\"\",ABS!B49)","v":""},{"$f":"IF(ABS!C49=\"\",\"\",ABS!C49)","v":""},{"$f":"IF(ABS!D49=\"\",\"\",PROPER(ABS!D49))","v":""},null,null,null,null,null,null,null,null,null,"","","","","",{"$f":"IF(P39=\"\",\"\",NILAI_PREDIKAT(Q39))","v":""},{"$f":"IFERROR(VLOOKUP(Nilai_Predikat2(Q39),DESKRIPSIKETRAMPILAN,2,FALSE),\"\")","v":""}]
[{"$f":"IF(ABS!B50=\"\",\"\",ABS!B50)","v":""},{"$f":"IF(ABS!C50=\"\",\"\",ABS!C50)","v":""},{"$f":"IF(ABS!D50=\"\",\"\",PROPER(ABS!D50))","v":""},null,null,null,null,null,null,null,null,null,"","","","","",{"$f":"IF(P40=\"\",\"\",NILAI_PREDIKAT(Q40))","v":""},{"$f":"IFERROR(VLOOKUP(Nilai_Predikat2(Q40),DESKRIPSIKETRAMPILAN,2,FALSE),\"\")","v":""}]
[{"$f":"IF(ABS!B51=\"\",\"\",ABS!B51)","v":""},{"$f":"IF(ABS!C51=\"\",\"\",ABS!C51)","v":""},{"$f":"IF(ABS!D51=\"\",\"\",PROPER(ABS!D51))","v":""},null,null,null,null,null,null,null,null,null,"","","","","",{"$f":"IF(P41=\"\",\"\",NILAI_PREDIKAT(Q41))","v":""},{"$f":"IFERROR(VLOOKUP(Nilai_Predikat2(Q41),DESKRIPSIKETRAMPILAN,2,FALSE),\"\")","v":""}]
[{"$f":"IF(ABS!B52=\"\",\"\",ABS!B52)","v":""},{"$f":"IF(ABS!C52=\"\",\"\",ABS!C52)","v":""},{"$f":"IF(ABS!D52=\"\",\"\",PROPER(ABS!D52))","v":""},null,null,null,null,null,null,null,null,null,"","","","","",{"$f":"IF(P42=\"\",\"\",NILAI_PREDIKAT(Q42))","v":""},{"$f":"IFERROR(VLOOKUP(Nilai_Predikat2(Q42),DESKRIPSIKETRAMPILAN,2,FALSE),\"\")","v":""}]
["RATA-RATA",null,null,{"$f":"IF(SUM(D5:D42)=0,\"\",AVERAGE(D5:D42))","v":80},{"$f":"IF(SUM(E5:E42)=0,\"\",AVERAGE(E5:E42))","v":""},"",75,"","",80,"","",80,75,80,78.75,3.15,""]

{"sheet":"AFE","index":7,"n_rows":50,"n_cols":22,"rows_kept":50,"cut":false,"hidden":false,"merged":[[2,21,3,21],[42,0,42,2],[2,12,2,14],[2,19,2,20],[2,0,3,0],[2,1,3,1],[2,2,3,2],[2,3,2,5],[2,6,2,8],[2,9,2,11],[2,15,2,18]]}
["DAFTAR NILAI SIKAP"]
[]
["NO","NIS","NAMA","Nilai Observasi\n(NOb)",null,null,"Nilai Diri Sendiri \n(NDS)",null,null,"Nilai Antar Teman \n(NAT)",null,null,"Nilai Jurnal (NJr)",null,null,"Rerata Nilai",null,null,null,"NILAI RAPOR / (LHB)",null,"DESKRIPSI"]
[null,null,null,"KD1","KD2","KD3","KD1","KD2","KD3","KD1","KD2","KD3","KD1","KD2","KD3","NOb","NDS","NAT","NJr","Predikat","Nilai Sikap"]
[{"$f":"IF(ABS!B15=\"\",\"\",ABS!B15)","v":1},{"$f":"IF(ABS!C15=\"\",\"\",ABS!C15)","v":12419},{"$f":"IF(ABS!D15=\"\",\"\",PROPER(ABS!D15))","v":"Adhitya Ferdi Kristianto"},{"$f":"IFERROR(VLOOKUP(OBS!D$54,NILAIOBSERVASI,2,TRUE),\"\")","v":59},null,null,60,null,null,60,null,null,60,null,null,{"$f":"IF(OR(D5=0,D5=\"\"),\"\",IF(AND(E5=0,F5=0),D5,IF(F5=0,AVERAGE(D5:E5),AVERAGE(D5:F5))))","v":59},{"$f":"IF(OR(G5=0,G5=\"\"),\"\",IF(AND(H5=0,I5=0),G5,IF(I5=0,AVERAGE(G5:H5),AVERAGE(G5:I5))))","v":60},{"$f":"IF(OR(J5=0,J5=\"\"),\"\",IF(AND(K5=0,L5=0),J5,IF(L5=0,AVERAGE(J5:K5),AVERAGE(J5:L5))))","v":60},{"$f":"IF(OR(M5=0,M5=\"\"),\"\",IF(AND(N5=0,O5=0),M5,IF(O5=0,AVERAGE(M5:N5),AVERAGE(M5:O5))))","v":60},{"$f":"IFERROR(IF(OR(D5=\"\",SUM(2*P5,Q5,R5,S5)=0),\"\",(SUM(2*P5,Q5,R5,S5)/5)/100)*4,\"\")","v":2.3839999999999999},{"$f":"IF(T5=\"\",\"\",NILAI_SIKAP(T5))","v":"B"},{"$f":"IFERROR(VLOOKUP(U5,DESKRIPSISIKAP,2,FALSE),\"\")","v":"Sering Menunjukan Rasa Syukur Kepada Allah Tetapi Kedisiplinan Masih Perlu Ditingkatkan - Mulai Konsisten"}]
[{"$f":"IF(ABS!B16=\"\",\"\",ABS!B16)","v":2},{"$f":"IF(ABS!C16=\"\",\"\",ABS!C16)","v":12428},{"$f":"IF(ABS!D16=\"\",\"\",PROPER(ABS!D16))","v":"Agung Dwi Saputro"},{"$f":"IFERROR(VLOOKUP(OBS!E$54,NILAIOBSERVASI,2,TRUE),\"\")","v":59},null,null,75,null,null,65,null,null,56,null,null,{"$f":"IF(OR(D6=0,D6=\"\"),\"\",IF(AND(E6=0,F6=0),D6,IF(F6=0,AVERAGE(D6:E6),AVERAGE(D6:F6))))","v":59},{"$f":"IF(OR(G6=0,G6=\"\"),\"\",IF(AND(H6=0,I6=0),G6,IF(I6=0,AVERAGE(G6:H6),AVERAGE(G6:I6))))","v":75},{"$f":"IF(OR(J6=0,J6=\"\"),\"\",IF(AND(K6=0,L6=0),J6,IF(L6=0,AVERAGE(J6:K6),AVERAGE(J6:L6))))","v":65},{"$f":"IF(OR(M6=0,M6=\"\"),\"\",IF(AND(N6=0,O6=0),M6,IF(O6=0,AVERAGE(M6:N6),AVERAGE(M6:O6))))","v":56},{"$f":"IFERROR(IF(OR(D6=\"\",SUM(2*P6,Q6,R6,S6)=0),\"\",(SUM(2*P6,Q6,R6,S6)/5)/100)*4,\"\")","v":2.512},{"$f":"IF(T6=\"\",\"\",NILAI_SIKAP(T6))","v":"B"},"Sering Menunjukan Rasa Syukur Kepada Allah Tetapi Kedisiplinan Masih Perlu Ditingkatkan - Mulai Konsisten"]
[{"$f":"IF(ABS!B17=\"\",\"\",ABS!B17)","v":3},{"$f":"IF(ABS!C17=\"\",\"\",ABS!C17)","v":12453},{"$f":"IF(ABS!D17=\"\",\"\",PROPER(ABS!D17))","v":"Anissa Dhea Paramitha"},{"$f":"IFERROR(VLOOKUP(OBS!F$54,NILAIOBSERVASI,2,TRUE),\"\")","v":""},null,null,null,null,null,null,null,null,null,null,null,"","","","","",{"$f":"IF(T7=\"\",\"\",NILAI_SIKAP(T7))","v":""},""]
[{"$f":"IF(ABS!B18=\"\",\"\",ABS!B18)","v":4},{"$f":"IF(ABS!C18=\"\",\"\",ABS!C18)","v":12455},{"$f":"IF(ABS!D18=\"\",\"\",PROPER(ABS!D18))","v":"Aprilia Desi Laraswati"},{"$f":"IFERROR(VLOOKUP(OBS!G$54,NILAIOBSERVASI,2,TRUE),\"\")","v":""},null,null,null,null,null,null,null,null,null,null,null,"","","","","",{"$f":"IF(T8=\"\",\"\",NILAI_SIKAP(T8))","v":""},""]
[{"$f":"IF(ABS!B19=\"\",\"\",ABS!B19)","v":5},{"$f":"IF(ABS!C19=\"\",\"\",ABS!C19)","v":12479},{"$f":"IF(ABS!D19=\"\",\"\",PROPER(ABS!D19))","v":"Bagas Adifirmansyah"},{"$f":"IFERROR(VLOOKUP(OBS!H$54,NILAIOBSERVASI,2,TRUE),\"\")","v":""},null,null,null,null,null,null,null,null,null,null,null,"","","","","",{"$f":"IF(T9=\"\",\"\",NILAI_SIKAP(T9))","v":""},""]
[{"$f":"IF(ABS!B20=\"\",\"\",ABS!B20)","v":6},{"$f":"IF(ABS!C20=\"\",\"\",ABS!C20)","v":12498},{"$f":"IF(ABS!D20=\"\",\"\",PROPER(ABS!D20))","v":"Dela Shabrina"},{"$f":"IFERROR(VLOOKUP(OBS!I$54,NILAIOBSERVASI,2,TRUE),\"\")","v":""},null,null,null,null,null,null,null,null,null,null,null,"","","","","",{"$f":"IF(T10=\"\",\"\",NILAI_SIKAP(T10))","v":""},""]
[{"$f":"IF(ABS!B21=\"\",\"\",ABS!B21)","v":7},{"$f":"IF(ABS!C21=\"\",\"\",ABS!C21)","v":12501},{"$f":"IF(ABS!D21=\"\",\"\",PROPER(ABS!D21))","v":"Desti Rani Indriyani"},{"$f":"IFERROR(VLOOKUP(OBS!J$54,NILAIOBSERVASI,2,TRUE),\"\")","v":""},null,null,null,null,null,null,null,null,null,null,null,"","","","","",{"$f":"IF(T11=\"\",\"\",NILAI_SIKAP(T11))","v":""},""]
[{"$f":"IF(ABS!B22=\"\",\"\",ABS!B22)","v":8},{"$f":"IF(ABS!C22=\"\",\"\",ABS!C22)","v":12508},{"$f":"IF(ABS!D22=\"\",\"\",PROPER(ABS!D22))","v":"Dewi Suciati Fauzun"},{"$f":"IFERROR(VLOOKUP(OBS!K$54,NILAIOBSERVASI,2,TRUE),\"\")","v":""},null,null,null,null,null,null,null,null,null,null,null,"","","","","",{"$f":"IF(T12=\"\",\"\",NILAI_SIKAP(T12))","v":""},""]
[{"$f":"IF(ABS!B23=\"\",\"\",ABS!B23)","v":9},{"$f":"IF(ABS!C23=\"\",\"\",ABS!C23)","v":12516},{"$f":"IF(ABS!D23=\"\",\"\",PROPER(ABS!D23))","v":"Dimas Nusantara Adi"},{"$f":"IFERROR(VLOOKUP(OBS!L$54,NILAIOBSERVASI,2,TRUE),\"\")","v":""},null,null,null,null,null,null,null,null,null,null,null,"","","","","",{"$f":"IF(T13=\"\",\"\",NILAI_SIKAP(T13))","v":""},""]
[{"$f":"IF(ABS!B24=\"\",\"\",ABS!B24)","v":10},{"$f":"IF(ABS!C24=\"\",\"\",ABS!C24)","v":12529},{"$f":"IF(ABS!D24=\"\",\"\",PROPER(ABS!D24))","v":"Edo Wanda Prastyo"},{"$f":"IFERROR(VLOOKUP(OBS!M$54,NILAIOBSERVASI,2,TRUE),\"\")","v":""},null,null,null,null,null,null,null,null,null,null,null,"","","","","",{"$f":"IF(T14=\"\",\"\",NILAI_SIKAP(T14))","v":""},""]
[{"$f":"IF(ABS!B25=\"\",\"\",ABS!B25)","v":11},{"$f":"IF(ABS!C25=\"\",\"\",ABS!C25)","v":12537},{"$f":"IF(ABS!D25=\"\",\"\",PROPER(ABS!D25))","v":"Entin Taat Arumningtias"},{"$f":"IFERROR(VLOOKUP(OBS!N$54,NILAIOBSERVASI,2,TRUE),\"\")","v":""},null,null,null,null,null,null,null,null,null,null,null,"","","","","",{"$f":"IF(T15=\"\",\"\",NILAI_SIKAP(T15))","v":""},""]
[{"$f":"IF(ABS!B26=\"\",\"\",ABS!B26)","v":12},{"$f":"IF(ABS!C26=\"\",\"\",ABS!C26)","v":12544},{"$f":"IF(ABS!D26=\"\",\"\",PROPER(ABS!D26))","v":"Fajar Adi Pamungkas"},{"$f":"IFERROR(VLOOKUP(OBS!O$54,NILAIOBSERVASI,2,TRUE),\"\")","v":""},null,null,null,null,null,null,null,null,null,null,null,"","","","","",{"$f":"IF(T16=\"\",\"\",NILAI_SIKAP(T16))","v":""},""]
[{"$f":"IF(ABS!B27=\"\",\"\",ABS!B27)","v":13},{"$f":"IF(ABS!C27=\"\",\"\",ABS!C27)","v":12796},{"$f":"IF(ABS!D27=\"\",\"\",PROPER(ABS!D27))","v":"Frendy Lasmana Putra"},{"$f":"IFERROR(VLOOKUP(OBS!P$54,NILAIOBSERVASI,2,TRUE),\"\")","v":""},null,null,null,null,null,null,null,null,null,null,null,"","","","","",{"$f":"IF(T17=\"\",\"\",NILAI_SIKAP(T17))","v":""},""]
[{"$f":"IF(ABS!B28=\"\",\"\",ABS!B28)","v":14},{"$f":"IF(ABS!C28=\"\",\"\",ABS!C28)","v":12204},{"$f":"IF(ABS!D28=\"\",\"\",PROPER(ABS!D28))","v":"Gana Ridho Akbar"},{"$f":"IFERROR(VLOOKUP(OBS!Q$54,NILAIOBSERVASI,2,TRUE),\"\")","v":""},null,null,null,null,null,null,null,null,null,null,null,"","","","","",{"$f":"IF(T18=\"\",\"\",NILAI_SIKAP(T18))","v":""},""]
[{"$f":"IF(ABS!B29=\"\",\"\",ABS!B29)","v":15},{"$f":"IF(ABS!C29=\"\",\"\",ABS!C29)","v":12588},{"$f":"IF(ABS!D29=\"\",\"\",PROPER(ABS!D29))","v":"Indra Cahya Permana"},{"$f":"IFERROR(VLOOKUP(OBS!R$54,NILAIOBSERVASI,2,TRUE),\"\")","v":""},null,null,null,null,null,null,null,null,null,null,null,"","","","","",{"$f":"IF(T19=\"\",\"\",NILAI_SIKAP(T19))","v":""},""]
[{"$f":"IF(ABS!B30=\"\",\"\",ABS!B30)","v":16},{"$f":"IF(ABS!C30=\"\",\"\",ABS!C30)","v":12598},{"$f":"IF(ABS!D30=\"\",\"\",PROPER(ABS!D30))","v":"Ismia Nivrendita"},{"$f":"IFERROR(VLOOKUP(OBS!S$54,NILAIOBSERVASI,2,TRUE),\"\")","v":""},null,null,null,null,null,null,null,null,null,null,null,"","","","","",{"$f":"IF(T20=\"\",\"\",NILAI_SIKAP(T20))","v":""},""]
[{"$f":"IF(ABS!B31=\"\",\"\",ABS!B31)","v":17},{"$f":"IF(ABS!C31=\"\",\"\",ABS!C31)","v":12606},{"$f":"IF(ABS!D31=\"\",\"\",PROPER(ABS!D31))","v":"Krista Ikawan"},{"$f":"IFERROR(VLOOKUP(OBS!T$54,NILAIOBSERVASI,2,TRUE),\"\")","v":""},null,null,null,null,null,null,null,null,null,null,null,"","","","","",{"$f":"IF(T21=\"\",\"\",NILAI_SIKAP(T21))","v":""},""]
[{"$f":"IF(ABS!B32=\"\",\"\",ABS!B32)","v":18},{"$f":"IF(ABS!C32=\"\",\"\",ABS!C32)","v":12612},{"$f":"IF(ABS!D32=\"\",\"\",PROPER(ABS!D32))","v":"Lestari"},{"$f":"IFERROR(VLOOKUP(OBS!U$54,NILAIOBSERVASI,2,TRUE),\"\")","v":""},null,null,null,null,null,null,null,null,null,null,null,"","","","","",{"$f":"IF(T22=\"\",\"\",NILAI_SIKAP(T22))","v":""},""]
[{"$f":"IF(ABS!B33=\"\",\"\",ABS!B33)","v":19},{"$f":"IF(ABS!C33=\"\",\"\",ABS!C33)","v":12628},{"$f":"IF(ABS!D33=\"\",\"\",PROPER(ABS!D33))","v":"Miasari Sholaiha"},{"$f":"IFERROR(VLOOKUP(OBS!V$54,NILAIOBSERVASI,2,TRUE),\"\")","v":""},null,null,null,null,null,null,null,null,null,null,null,"","","","","",{"$f":"IF(T23=\"\",\"\",NILAI_SIKAP(T23))","v":""},""]
[{"$f":"IF(ABS!B34=\"\",\"\",ABS!B34)","v":20},{"$f":"IF(ABS!C34=\"\",\"\",ABS!C34)","v":12629},{"$f":"IF(ABS!D34=\"\",\"\",PROPER(ABS!D34))","v":"Modis Iyonda"},{"$f":"IFERROR(VLOOKUP(OBS!W$54,NILAIOBSERVASI,2,TRUE),\"\")","v":""},null,null,null,null,null,null,null,null,null,null,null,"","","","","",{"$f":"IF(T24=\"\",\"\",NILAI_SIKAP(T24))","v":""},""]
[{"$f":"IF(ABS!B35=\"\",\"\",ABS!B35)","v":21},{"$f":"IF(ABS!C35=\"\",\"\",ABS!C35)","v":12639},{"$f":"IF(ABS!D35=\"\",\"\",PROPER(ABS!D35))","v":"Muhammad Agni Farras"},{"$f":"IFERROR(VLOOKUP(OBS!X$54,NILAIOBSERVASI,2,TRUE),\"\")","v":""},null,null,null,null,null,null,null,null,null,null,null,"","","","","",{"$f":"IF(T25=\"\",\"\",NILAI_SIKAP(T25))","v":""},""]
[{"$f":"IF(ABS!B36=\"\",\"\",ABS!B36)","v":22},{"$f":"IF(ABS!C36=\"\",\"\",ABS!C36)","v":12673},{"$f":"IF(ABS!D36=\"\",\"\",PROPER(ABS!D36))","v":"Pratomo Setyo Aji"},{"$f":"IFERROR(VLOOKUP(OBS!Y$54,NILAIOBSERVASI,2,TRUE),\"\")","v":""},null,null,null,null,null,null,null,null,null,null,null,"","","","","",{"$f":"IF(T26=\"\",\"\",NILAI_SIKAP(T26))","v":""},""]
[{"$f":"IF(ABS!B37=\"\",\"\",ABS!B37)","v":23},{"$f":"IF(ABS!C37=\"\",\"\",ABS!C37)","v":12674},{"$f":"IF(ABS!D37=\"\",\"\",PROPER(ABS!D37))","v":"Puji Lestari"},{"$f":"IFERROR(VLOOKUP(OBS!Z$54,NILAIOBSERVASI,2,TRUE),\"\")","v":""},null,null,null,null,null,null,null,null,null,null,null,"","","","","",{"$f":"IF(T27=\"\",\"\",NILAI_SIKAP(T27))","v":""},""]
[{"$f":"IF(ABS!B38=\"\",\"\",ABS!B38)","v":24},{"$f":"IF(ABS!C38=\"\",\"\",ABS!C38)","v":12701},{"$f":"IF(ABS!D38=\"\",\"\",PROPER(ABS!D38))","v":"Rindra Alriyan"},{"$f":"IFERROR(VLOOKUP(OBS!AA$54,NILAIOBSERVASI,2,TRUE),\"\")","v":""},null,null,null,null,null,null,null,null,null,null,null,"","","","","",{"$f":"IF(T28=\"\",\"\",NILAI_SIKAP(T28))","v":""},""]
[{"$f":"IF(ABS!B39=\"\",\"\",ABS!B39)","v":25},{"$f":"IF(ABS!C39=\"\",\"\",ABS!C39)","v":12729},{"$f":"IF(ABS!D39=\"\",\"\",PROPER(ABS!D39))","v":"Sinta Anggraeni"},{"$f":"IFERROR(VLOOKUP(OBS!AB$54,NILAIOBSERVASI,2,TRUE),\"\")","v":""},null,null,null,null,null,null,null,null,null,null,null,"","","","","",{"$f":"IF(T29=\"\",\"\",NILAI_SIKAP(T29))","v":""},""]
[{"$f":"IF(ABS!B40=\"\",\"\",ABS!B40)","v":26},{"$f":"IF(ABS!C40=\"\",\"\",ABS!C40)","v":12734},{"$f":"IF(ABS!D40=\"\",\"\",PROPER(ABS!D40))","v":"Sofi"},{"$f":"IFERROR(VLOOKUP(OBS!AC$54,NILAIOBSERVASI,2,TRUE),\"\")","v":""},null,null,null,null,null,null,null,null,null,null,null,"","","","","",{"$f":"IF(T30=\"\",\"\",NILAI_SIKAP(T30))","v":""},""]
[{"$f":"IF(ABS!B41=\"\",\"\",ABS!B41)","v":27},{"$f":"IF(ABS!C41=\"\",\"\",ABS!C41)","v":12745},{"$f":"IF(ABS!D41=\"\",\"\",PROPER(ABS!D41))","v":"Tika Wulandari"},{"$f":"IFERROR(VLOOKUP(OBS!AD$54,NILAIOBSERVASI,2,TRUE),\"\")","v":""},null,null,null,null,null,null,null,null,null,null,null,"","","","","",{"$f":"IF(T31=\"\",\"\",NILAI_SIKAP(T31))","v":""},""]
[{"$f":"IF(ABS!B42=\"\",\"\",ABS!B42)","v":28},{"$f":"IF(ABS!C42=\"\",\"\",ABS!C42)","v":12747},{"$f":"IF(ABS!D42=\"\",\"\",PROPER(ABS!D42))","v":"Tomy Faizal Manaf"},{"$f":"IFERROR(VLOOKUP(OBS!AE$54,NILAIOBSERVASI,2,TRUE),\"\")","v":""},null,null,null,null,null,null,null,null,null,null,null,"","","","","",{"$f":"IF(T32=\"\",\"\",NILAI_SIKAP(T32))","v":""},""]
[{"$f":"IF(ABS!B43=\"\",\"\",ABS!B43)","v":29},{"$f":"IF(ABS!C43=\"\",\"\",ABS!C43)","v":12748},{"$f":"IF(ABS!D43=\"\",\"\",PROPER(ABS!D43))","v":"Toni Gunawan"},{"$f":"IFERROR(VLOOKUP(OBS!AF$54,NILAIOBSERVASI,2,TRUE),\"\")","v":""},null,null,null,null,null,null,null,null,null,null,null,"","","","","",{"$f":"IF(T33=\"\",\"\",NILAI_SIKAP(T33))","v":""},""]
[{"$f":"IF(ABS!B44=\"\",\"\",ABS!B44)","v":30},{"$f":"IF(ABS!C44=\"\",\"\",ABS!C44)","v":12757},{"$f":"IF(ABS!D44=\"\",\"\",PROPER(ABS!D44))","v":"Vevy Dyas Lestari"},{"$f":"IFERROR(VLOOKUP(OBS!AG$54,NILAIOBSERVASI,2,TRUE),\"\")","v":""},null,null,null,null,null,null,null,null,null,null,null,"","","","","",{"$f":"IF(T34=\"\",\"\",NILAI_SIKAP(T34))","v":""},""]
[{"$f":"IF(ABS!B45=\"\",\"\",ABS!B45)","v":31},{"$f":"IF(ABS!C45=\"\",\"\",ABS!C45)","v":12765},{"$f":"IF(ABS!D45=\"\",\"\",PROPER(ABS!D45))","v":"Wahyu Ardhi Gunawan"},{"$f":"IFERROR(VLOOKUP(OBS!AH$54,NILAIOBSERVASI,2,TRUE),\"\")","v":""},null,null,null,null,null,null,null,null,null,null,null,"","","","","",{"$f":"IF(T35=\"\",\"\",NILAI_SIKAP(T35))","v":""},""]
[{"$f":"IF(ABS!B46=\"\",\"\",ABS!B46)","v":32},{"$f":"IF(ABS!C46=\"\",\"\",ABS!C46)","v":12767},{"$f":"IF(ABS!D46=\"\",\"\",PROPER(ABS!D46))","v":"Widi Pangestu"},{"$f":"IFERROR(VLOOKUP(OBS!AI$54,NILAIOBSERVASI,2,TRUE),\"\")","v":""},null,null,null,null,null,null,null,null,null,null,null,"","","","","",{"$f":"IF(T36=\"\",\"\",NILAI_SIKAP(T36))","v":""},""]
[{"$f":"IF(ABS!B47=\"\",\"\",ABS!B47)","v":33},{"$f":"IF(ABS!C47=\"\",\"\",ABS!C47)","v":12784},{"$f":"IF(ABS!D47=\"\",\"\",PROPER(ABS!D47))","v":"Yuli Atifah"},{"$f":"IFERROR(VLOOKUP(OBS!AJ$54,NILAIOBSERVASI,2,TRUE),\"\")","v":""},null,null,null,null,null,null,null,null,null,null,null,"","","","","",{"$f":"IF(T37=\"\",\"\",NILAI_SIKAP(T37))","v":""},""]
[{"$f":"IF(ABS!B48=\"\",\"\",ABS!B48)","v":34},{"$f":"IF(ABS!C48=\"\",\"\",ABS!C48)","v":12788},{"$f":"IF(ABS!D48=\"\",\"\",PROPER(ABS!D48))","v":"Yusuf Dwi Prasetya"},{"$f":"IFERROR(VLOOKUP(OBS!AK$54,NILAIOBSERVASI,2,TRUE),\"\")","v":""},null,null,null,null,null,null,null,null,null,null,null,"","","","","",{"$f":"IF(T38=\"\",\"\",NILAI_SIKAP(T38))","v":""},""]
[{"$f":"IF(ABS!B49=\"\",\"\",ABS!B49)","v":""},{"$f":"IF(ABS!C49=\"\",\"\",ABS!C49)","v":""},{"$f":"IF(ABS!D49=\"\",\"\",PROPER(ABS!D49))","v":""},{"$f":"IFERROR(VLOOKUP(OBS!AL$54,NILAIOBSERVASI,2,TRUE),\"\")","v":""},null,null,null,null,null,null,null,null,null,null,null,"","","","","",{"$f":"IF(T39=\"\",\"\",NILAI_SIKAP(T39))","v":""},""]
[{"$f":"IF(ABS!B50=\"\",\"\",ABS!B50)","v":""},{"$f":"IF(ABS!C50=\"\",\"\",ABS!C50)","v":""},{"$f":"IF(ABS!D50=\"\",\"\",PROPER(ABS!D50))","v":""},{"$f":"IFERROR(VLOOKUP(OBS!AM$54,NILAIOBSERVASI,2,TRUE),\"\")","v":""},null,null,null,null,null,null,null,null,null,null,null,"","","","","",{"$f":"IF(T40=\"\",\"\",NILAI_SIKAP(T40))","v":""},""]
[{"$f":"IF(ABS!B51=\"\",\"\",ABS!B51)","v":""},{"$f":"IF(ABS!C51=\"\",\"\",ABS!C51)","v":""},{"$f":"IF(ABS!D51=\"\",\"\",PROPER(ABS!D51))","v":""},{"$f":"IFERROR(VLOOKUP(OBS!AN$54,NILAIOBSERVASI,2,TRUE),\"\")","v":""},null,null,null,null,null,null,null,null,null,null,null,"","","","","",{"$f":"IF(T41=\"\",\"\",NILAI_SIKAP(T41))","v":""},""]
[{"$f":"IF(ABS!B52=\"\",\"\",ABS!B52)","v":""},{"$f":"IF(ABS!C52=\"\",\"\",ABS!C52)","v":""},{"$f":"IF(ABS!D52=\"\",\"\",PROPER(ABS!D52))","v":""},{"$f":"IFERROR(VLOOKUP(OBS!AO$54,NILAIOBSERVASI,2,TRUE),\"\")","v":""},null,null,null,null,null,null,null,null,null,null,null,"","","","","",{"$f":"IF(T42=\"\",\"\",NILAI_SIKAP(T42))","v":""},""]
["RATA-RATA",null,null,{"$f":"IF(SUM(D5:D42)=0,\"\",AVERAGE(D5:D42))","v":59},{"$f":"IF(SUM(E5:E42)=0,\"\",AVERAGE(E5:E42))","v":""},"",67.5,"","",62.5,"","",58,"","",59,67.5,62.5,58,2.448,""]
[]
["a.    Untuk penilaian Sikap Spiritual dan Sosial (KI-1 dan KI-2) menggunakan nilai Kualitatif sebagai berikut:"]
[null,null,null,"Skala 100"]
[null,null,"SB     =  Sangat Baik ","80-100"]
[null,null,"B       =  Baik","70-79"]
[null,null,"C       =  Cukup","60-69"]
[null,null,"K       =  Kurang","< 60"]

{"sheet":"OBS","index":8,"n_rows":54,"n_cols":41,"rows_kept":54,"cut":false,"hidden":false,"merged":[[35,0,39,0],[40,0,45,0],[46,0,51,0],[2,0,7,0],[8,0,13,0],[14,0,22,0],[23,0,28,0],[29,0,34,0]]}
["NILAI OBSERVASI",null,null,{"$f":"IF(ABS!$D$15=\"\",\"\",PROPER(ABS!$D$15))","v":"Adhitya Ferdi Kristianto"},{"$f":"IF(ABS!$D$16=\"\",\"\",PROPER(ABS!$D$16))","v":"Agung Dwi Saputro"},{"$f":"IF(ABS!$D$17=\"\",\"\",PROPER(ABS!$D$17))","v":"Anissa Dhea Paramitha"},{"$f":"IF(ABS!$D$18=\"\",\"\",PROPER(ABS!$D$18))","v":"Aprilia Desi Laraswati"},{"$f":"IF(ABS!$D$19=\"\",\"\",PROPER(ABS!$D$19))","v":"Bagas Adifirmansyah"},{"$f":"IF(ABS!$D$20=\"\",\"\",PROPER(ABS!$D$20))","v":"Dela Shabrina"},{"$f":"IF(ABS!$D$21=\"\",\"\",PROPER(ABS!$D$21))","v":"Desti Rani Indriyani"},{"$f":"IF(ABS!$D$22=\"\",\"\",PROPER(ABS!$D$22))","v":"Dewi Suciati Fauzun"},{"$f":"IF(ABS!$D$23=\"\",\"\",PROPER(ABS!$D$23))","v":"Dimas Nusantara Adi"},{"$f":"IF(ABS!$D$24=\"\",\"\",PROPER(ABS!$D$24))","v":"Edo Wanda Prastyo"},{"$f":"IF(ABS!$D$25=\"\",\"\",PROPER(ABS!$D$25))","v":"Entin Taat Arumningtias"},{"$f":"IF(ABS!$D$26=\"\",\"\",PROPER(ABS!$D$26))","v":"Fajar Adi Pamungkas"},{"$f":"IF(ABS!$D$27=\"\",\"\",PROPER(ABS!$D$27))","v":"Frendy Lasmana Putra"},{"$f":"IF(ABS!$D$28=\"\",\"\",PROPER(ABS!$D$28))","v":"Gana Ridho Akbar"},{"$f":"IF(ABS!$D$29=\"\",\"\",PROPER(ABS!$D$29))","v":"Indra Cahya Permana"},{"$f":"IF(ABS!$D$30=\"\",\"\",PROPER(ABS!$D$30))","v":"Ismia Nivrendita"},{"$f":"IF(ABS!$D$31=\"\",\"\",PROPER(ABS!$D$31))","v":"Krista Ikawan"},{"$f":"IF(ABS!$D$32=\"\",\"\",PROPER(ABS!$D$32))","v":"Lestari"},{"$f":"IF(ABS!$D$33=\"\",\"\",PROPER(ABS!$D$33))","v":"Miasari Sholaiha"},{"$f":"IF(ABS!$D$34=\"\",\"\",PROPER(ABS!$D$34))","v":"Modis Iyonda"},{"$f":"IF(ABS!$D$35=\"\",\"\",PROPER(ABS!$D$35))","v":"Muhammad Agni Farras"},{"$f":"IF(ABS!$D$36=\"\",\"\",PROPER(ABS!$D$36))","v":"Pratomo Setyo Aji"},{"$f":"IF(ABS!$D$37=\"\",\"\",PROPER(ABS!$D$37))","v":"Puji Lestari"},{"$f":"IF(ABS!$D$38=\"\",\"\",PROPER(ABS!$D$38))","v":"Rindra Alriyan"},{"$f":"IF(ABS!$D$39=\"\",\"\",PROPER(ABS!$D$39))","v":"Sinta Anggraeni"},{"$f":"IF(ABS!$D$40=\"\",\"\",PROPER(ABS!$D$40))","v":"Sofi"},{"$f":"IF(ABS!$D$41=\"\",\"\",PROPER(ABS!$D$41))","v":"Tika Wulandari"},{"$f":"IF(ABS!$D$42=\"\",\"\",PROPER(ABS!$D$42))","v":"Tomy Faizal Manaf"},{"$f":"IF(ABS!$D$43=\"\",\"\",PROPER(ABS!$D$43))","v":"Toni Gunawan"},{"$f":"IF(ABS!$D$44=\"\",\"\",PROPER(ABS!$D$44))","v":"Vevy Dyas Lestari"},{"$f":"IF(ABS!$D$45=\"\",\"\",PROPER(ABS!$D$45))","v":"Wahyu Ardhi Gunawan"},{"$f":"IF(ABS!$D$46=\"\",\"\",PROPER(ABS!$D$46))","v":"Widi Pangestu"},{"$f":"IF(ABS!$D$47=\"\",\"\",PROPER(ABS!$D$47))","v":"Yuli Atifah"},{"$f":"IF(ABS!$D$48=\"\",\"\",PROPER(ABS!$D$48))","v":"Yusuf Dwi Prasetya"},{"$f":"IF(ABS!$D$49=\"\",\"\",PROPER(ABS!$D$49))","v":""},{"$f":"IF(ABS!$D$50=\"\",\"\",PROPER(ABS!$D$50))","v":""},{"$f":"IF(ABS!$D$51=\"\",\"\",PROPER(ABS!$D$51))","v":""},{"$f":"IF(ABS!$D$52=\"\",\"\",PROPER(ABS!$D$52))","v":""}]
["Sikap","Kode","Aspek Pengamatan",{"$f":"IF(ABS!$B$15=\"\",\"\",PROPER(ABS!$B$15))","v":"1"},{"$f":"IF(ABS!$B$16=\"\",\"\",PROPER(ABS!$B$16))","v":"2"},{"$f":"IF(ABS!$B$17=\"\",\"\",PROPER(ABS!$B$17))","v":"3"},{"$f":"IF(ABS!$B$18=\"\",\"\",PROPER(ABS!$B$18))","v":"4"},{"$f":"IF(ABS!$B$19=\"\",\"\",PROPER(ABS!$B$19))","v":"5"},{"$f":"IF(ABS!$B$20=\"\",\"\",PROPER(ABS!$B$20))","v":"6"},{"$f":"IF(ABS!$B$21=\"\",\"\",PROPER(ABS!$B$21))","v":"7"},{"$f":"IF(ABS!$B$22=\"\",\"\",PROPER(ABS!$B$22))","v":"8"},{"$f":"IF(ABS!$B$23=\"\",\"\",PROPER(ABS!$B$23))","v":"9"},{"$f":"IF(ABS!$B$24=\"\",\"\",PROPER(ABS!$B$24))","v":"10"},{"$f":"IF(ABS!$B$25=\"\",\"\",PROPER(ABS!$B$25))","v":"11"},{"$f":"IF(ABS!$B$26=\"\",\"\",PROPER(ABS!$B$26))","v":"12"},{"$f":"IF(ABS!$B$27=\"\",\"\",PROPER(ABS!$B$27))","v":"13"},{"$f":"IF(ABS!$B$28=\"\",\"\",PROPER(ABS!$B$28))","v":"14"},{"$f":"IF(ABS!$B$29=\"\",\"\",PROPER(ABS!$B$29))","v":"15"},{"$f":"IF(ABS!$B$30=\"\",\"\",PROPER(ABS!$B$30))","v":"16"},{"$f":"IF(ABS!$B$31=\"\",\"\",PROPER(ABS!$B$31))","v":"17"},{"$f":"IF(ABS!$B$32=\"\",\"\",PROPER(ABS!$B$32))","v":"18"},{"$f":"IF(ABS!$B$33=\"\",\"\",PROPER(ABS!$B$33))","v":"19"},{"$f":"IF(ABS!$B$34=\"\",\"\",PROPER(ABS!$B$34))","v":"20"},{"$f":"IF(ABS!$B$35=\"\",\"\",PROPER(ABS!$B$35))","v":"21"},{"$f":"IF(ABS!$B$36=\"\",\"\",PROPER(ABS!$B$36))","v":"22"},{"$f":"IF(ABS!$B$37=\"\",\"\",PROPER(ABS!$B$37))","v":"23"},{"$f":"IF(ABS!$B$38=\"\",\"\",PROPER(ABS!$B$38))","v":"24"},{"$f":"IF(ABS!$B$39=\"\",\"\",PROPER(ABS!$B$39))","v":"25"},{"$f":"IF(ABS!$B$40=\"\",\"\",PROPER(ABS!$B$40))","v":"26"},{"$f":"IF(ABS!$B$41=\"\",\"\",PROPER(ABS!$B$41))","v":"27"},{"$f":"IF(ABS!$B$42=\"\",\"\",PROPER(ABS!$B$42))","v":"28"},{"$f":"IF(ABS!$B$43=\"\",\"\",PROPER(ABS!$B$43))","v":"29"},{"$f":"IF(ABS!$B$44=\"\",\"\",PROPER(ABS!$B$44))","v":"30"},{"$f":"IF(ABS!$B$45=\"\",\"\",PROPER(ABS!$B$45))","v":"31"},{"$f":"IF(ABS!$B$46=\"\",\"\",PROPER(ABS!$B$46))","v":"32"},{"$f":"IF(ABS!$B$47=\"\",\"\",PROPER(ABS!$B$47))","v":"33"},{"$f":"IF(ABS!$B$48=\"\",\"\",PROPER(ABS!$B$48))","v":"34"},{"$f":"IF(ABS!$B$49=\"\",\"\",PROPER(ABS!$B$49))","v":""},{"$f":"IF(ABS!$B$50=\"\",\"\",PROPER(ABS!$B$50))","v":""},{"$f":"IF(ABS!$B$51=\"\",\"\",PROPER(ABS!$B$51))","v":""},{"$f":"IF(ABS!$B$52=\"\",\"\",PROPER(ABS!$B$52))","v":""}]
["Spiritual","A.1","Berdoa sebelum dan sesudah melakukan sesuatu",1,1]
[null,"A.2","Mengucapkan rasa syukur setelah berhasil mengerjakan sesuatu",1,1]
[null,"A.3","Memberi salam sebelum dan sesudah menyampaikan pendapat",1,1]
[null,"A.4","Menjalankan ibadah tepat waktu",1]
[null,"A.5","Menambah rasa keimanan setelah mempelajari Iptek",1]
[null,null,null,{"$f":"IF(D$2=\"\",\"\",IF(SUM(D3:D7)=0,\"\",SUM(D3:D7)))","v":5},{"$f":"IF(E$2=\"\",\"\",IF(SUM(E3:E7)=0,\"\",SUM(E3:E7)))","v":3},"","","","","","","","","","","","","","","","","","","","","","","","","","","","","","","","","","","",""]
["Jujur","B.1","Tidak nyontek dalam mengerjakan ujian",1]
[null,"B.2","Tidak melakukan plagiat dalam mengerjakan setiap tugas",1]
[null,"B.3","Mengemukakan perasaan thd sesuatu apa adanya",1]
[null,"B.4","Melaporkan data atau informasi apa adanya",1]
[null,"B.5","Mengakui kesalahan atau kekurangan yang dimiliki",1]
[null,null,null,{"$f":"IF(D$2=\"\",\"\",IF(SUM(D9:D13)=0,\"\",SUM(D9:D13)))","v":5},{"$f":"IF(E$2=\"\",\"\",IF(SUM(E9:E13)=0,\"\",SUM(E9:E13)))","v":""},{"$f":"IF(F$2=\"\",\"\",IF(SUM(F9:F13)=0,\"\",SUM(F9:F13)))","v":""},{"$f":"IF(G$2=\"\",\"\",IF(SUM(G9:G13)=0,\"\",SUM(G9:G13)))","v":""},{"$f":"IF(H$2=\"\",\"\",IF(SUM(H9:H13)=0,\"\",SUM(H9:H13)))","v":""},{"$f":"IF(I$2=\"\",\"\",IF(SUM(I9:I13)=0,\"\",SUM(I9:I13)))","v":""},{"$f":"IF(J$2=\"\",\"\",IF(SUM(J9:J13)=0,\"\",SUM(J9:J13)))","v":""},{"$f":"IF(K$2=\"\",\"\",IF(SUM(K9:K13)=0,\"\",SUM(K9:K13)))","v":""},{"$f":"IF(L$2=\"\",\"\",IF(SUM(L9:L13)=0,\"\",SUM(L9:L13)))","v":""},{"$f":"IF(M$2=\"\",\"\",IF(SUM(M9:M13)=0,\"\",SUM(M9:M13)))","v":""},{"$f":"IF(N$2=\"\",\"\",IF(SUM(N9:N13)=0,\"\",SUM(N9:N13)))","v":""},{"$f":"IF(O$2=\"\",\"\",IF(SUM(O9:O13)=0,\"\",SUM(O9:O13)))","v":""},{"$f":"IF(P$2=\"\",\"\",IF(SUM(P9:P13)=0,\"\",SUM(P9:P13)))","v":""},{"$f":"IF(Q$2=\"\",\"\",IF(SUM(Q9:Q13)=0,\"\",SUM(Q9:Q13)))","v":""},{"$f":"IF(R$2=\"\",\"\",IF(SUM(R9:R13)=0,\"\",SUM(R9:R13)))","v":""},{"$f":"IF(S$2=\"\",\"\",IF(SUM(S9:S13)=0,\"\",SUM(S9:S13)))","v":""},{"$f":"IF(T$2=\"\",\"\",IF(SUM(T9:T13)=0,\"\",SUM(T9:T13)))","v":""},{"$f":"IF(U$2=\"\",\"\",IF(SUM(U9:U13)=0,\"\",SUM(U9:U13)))","v":""},{"$f":"IF(V$2=\"\",\"\",IF(SUM(V9:V13)=0,\"\",SUM(V9:V13)))","v":""},{"$f":"IF(W$2=\"\",\"\",IF(SUM(W9:W13)=0,\"\",SUM(W9:W13)))","v":""},{"$f":"IF(X$2=\"\",\"\",IF(SUM(X9:X13)=0,\"\",SUM(X9:X13)))","v":""},{"$f":"IF(Y$2=\"\",\"\",IF(SUM(Y9:Y13)=0,\"\",SUM(Y9:Y13)))","v":""},{"$f":"IF(Z$2=\"\",\"\",IF(SUM(Z9:Z13)=0,\"\",SUM(Z9:Z13)))","v":""},{"$f":"IF(AA$2=\"\",\"\",IF(SUM(AA9:AA13)=0,\"\",SUM(AA9:AA13)))","v":""},{"$f":"IF(AB$2=\"\",\"\",IF(SUM(AB9:AB13)=0,\"\",SUM(AB9:AB13)))","v":""},{"$f":"IF(AC$2=\"\",\"\",IF(SUM(AC9:AC13)=0,\"\",SUM(AC9:AC13)))","v":""},{"$f":"IF(AD$2=\"\",\"\",IF(SUM(AD9:AD13)=0,\"\",SUM(AD9:AD13)))","v":""},{"$f":"IF(AE$2=\"\",\"\",IF(SUM(AE9:AE13)=0,\"\",SUM(AE9:AE13)))","v":""},{"$f":"IF(AF$2=\"\",\"\",IF(SUM(AF9:AF13)=0,\"\",SUM(AF9:AF13)))","v":""},{"$f":"IF(AG$2=\"\",\"\",IF(SUM(AG9:AG13)=0,\"\",SUM(AG9:AG13)))","v":""},{"$f":"IF(AH$2=\"\",\"\",IF(SUM(AH9:AH13)=0,\"\",SUM(AH9:AH13)))","v":""},{"$f":"IF(AI$2=\"\",\"\",IF(SUM(AI9:AI13)=0,\"\",SUM(AI9:AI13)))","v":""},{"$f":"IF(AJ$2=\"\",\"\",IF(SUM(AJ9:AJ13)=0,\"\",SUM(AJ9:AJ13)))","v":""},{"$f":"IF(AK$2=\"\",\"\",IF(SUM(AK9:AK13)=0,\"\",SUM(AK9:AK13)))","v":""},{"$f":"IF(AL$2=\"\",\"\",IF(SUM(AL9:AL13)=0,\"\",SUM(AL9:AL13)))","v":""},{"$f":"IF(AM$2=\"\",\"\",IF(SUM(AM9:AM13)=0,\"\",SUM(AM9:AM13)))","v":""},{"$f":"IF(AN$2=\"\",\"\",IF(SUM(AN9:AN13)=0,\"\",SUM(AN9:AN13)))","v":""},{"$f":"IF(AO$2=\"\",\"\",IF(SUM(AO9:AO13)=0,\"\",SUM(AO9:AO13)))","v":""}]
["Disiplin","C.1","Masuk Kelas tepat waktu",1]
[null,"C.2","Mengumpulkan tugas tepat waktu",1]
[null,"C.3","Memakai seragam sesuai tata tertib",1]
[null,"C.4","Mengerjakan tugas yang diberikan",1]
[null,"C.5","Tertib dalam mengikuti pembelajaran",1]
[null,"C.6","Mengikuti praktikum sesuai dengan langkah yg ditetapkan",1]
[null,"C.7","Membawa buku tulis sesuai mapel",1]
[null,"C.8","Membawa buku teks mapel",1]
[null,null,null,{"$f":"IF(D$2=\"\",\"\",IF(SUM(D15:D22)=0,\"\",SUM(D15:D22)))","v":8},{"$f":"IF(E$2=\"\",\"\",IF(SUM(E15:E22)=0,\"\",SUM(E15:E22)))","v":""},"","","","","","","","","","","","","","","","","","","","","","","","","","","","","","","","","","","",""]
["Tanggung Jawab","D.1","Melaksanakan tugas individu dengan baik",1]
[null,"D.2","Menerima resiko dari tindakan yang dilakukan",1]
[null,"D.3","Tidak menuduh orang lain tanpa buktu yang akurat",1]
[null,"D.4","Mengembalikan barang yang dipinjam",1]
[null,"D.5","Meminta maaf atas kesalahan yang dilakukan",1]
[null,null,null,{"$f":"IF(D$2=\"\",\"\",IF(SUM(D24:D28)=0,\"\",SUM(D24:D28)))","v":5},{"$f":"IF(E$2=\"\",\"\",IF(SUM(E24:E28)=0,\"\",SUM(E24:E28)))","v":""},{"$f":"IF(F$2=\"\",\"\",IF(SUM(F24:F28)=0,\"\",SUM(F24:F28)))","v":""},{"$f":"IF(G$2=\"\",\"\",IF(SUM(G24:G28)=0,\"\",SUM(G24:G28)))","v":""},{"$f":"IF(H$2=\"\",\"\",IF(SUM(H24:H28)=0,\"\",SUM(H24:H28)))","v":""},{"$f":"IF(I$2=\"\",\"\",IF(SUM(I24:I28)=0,\"\",SUM(I24:I28)))","v":""},{"$f":"IF(J$2=\"\",\"\",IF(SUM(J24:J28)=0,\"\",SUM(J24:J28)))","v":""},{"$f":"IF(K$2=\"\",\"\",IF(SUM(K24:K28)=0,\"\",SUM(K24:K28)))","v":""},{"$f":"IF(L$2=\"\",\"\",IF(SUM(L24:L28)=0,\"\",SUM(L24:L28)))","v":""},{"$f":"IF(M$2=\"\",\"\",IF(SUM(M24:M28)=0,\"\",SUM(M24:M28)))","v":""},{"$f":"IF(N$2=\"\",\"\",IF(SUM(N24:N28)=0,\"\",SUM(N24:N28)))","v":""},{"$f":"IF(O$2=\"\",\"\",IF(SUM(O24:O28)=0,\"\",SUM(O24:O28)))","v":""},{"$f":"IF(P$2=\"\",\"\",IF(SUM(P24:P28)=0,\"\",SUM(P24:P28)))","v":""},{"$f":"IF(Q$2=\"\",\"\",IF(SUM(Q24:Q28)=0,\"\",SUM(Q24:Q28)))","v":""},{"$f":"IF(R$2=\"\",\"\",IF(SUM(R24:R28)=0,\"\",SUM(R24:R28)))","v":""},{"$f":"IF(S$2=\"\",\"\",IF(SUM(S24:S28)=0,\"\",SUM(S24:S28)))","v":""},{"$f":"IF(T$2=\"\",\"\",IF(SUM(T24:T28)=0,\"\",SUM(T24:T28)))","v":""},{"$f":"IF(U$2=\"\",\"\",IF(SUM(U24:U28)=0,\"\",SUM(U24:U28)))","v":""},{"$f":"IF(V$2=\"\",\"\",IF(SUM(V24:V28)=0,\"\",SUM(V24:V28)))","v":""},{"$f":"IF(W$2=\"\",\"\",IF(SUM(W24:W28)=0,\"\",SUM(W24:W28)))","v":""},{"$f":"IF(X$2=\"\",\"\",IF(SUM(X24:X28)=0,\"\",SUM(X24:X28)))","v":""},{"$f":"IF(Y$2=\"\",\"\",IF(SUM(Y24:Y28)=0,\"\",SUM(Y24:Y28)))","v":""},{"$f":"IF(Z$2=\"\",\"\",IF(SUM(Z24:Z28)=0,\"\",SUM(Z24:Z28)))","v":""},{"$f":"IF(AA$2=\"\",\"\",IF(SUM(AA24:AA28)=0,\"\",SUM(AA24:AA28)))","v":""},{"$f":"IF(AB$2=\"\",\"\",IF(SUM(AB24:AB28)=0,\"\",SUM(AB24:AB28)))","v":""},{"$f":"IF(AC$2=\"\",\"\",IF(SUM(AC24:AC28)=0,\"\",SUM(AC24:AC28)))","v":""},{"$f":"IF(AD$2=\"\",\"\",IF(SUM(AD24:AD28)=0,\"\",SUM(AD24:AD28)))","v":""},{"$f":"IF(AE$2=\"\",\"\",IF(SUM(AE24:AE28)=0,\"\",SUM(AE24:AE28)))","v":""},{"$f":"IF(AF$2=\"\",\"\",IF(SUM(AF24:AF28)=0,\"\",SUM(AF24:AF28)))","v":""},{"$f":"IF(AG$2=\"\",\"\",IF(SUM(AG24:AG28)=0,\"\",SUM(AG24:AG28)))","v":""},{"$f":"IF(AH$2=\"\",\"\",IF(SUM(AH24:AH28)=0,\"\",SUM(AH24:AH28)))","v":""},{"$f":"IF(AI$2=\"\",\"\",IF(SUM(AI24:AI28)=0,\"\",SUM(AI24:AI28)))","v":""},{"$f":"IF(AJ$2=\"\",\"\",IF(SUM(AJ24:AJ28)=0,\"\",SUM(AJ24:AJ28)))","v":""},{"$f":"IF(AK$2=\"\",\"\",IF(SUM(AK24:AK28)=0,\"\",SUM(AK24:AK28)))","v":""},{"$f":"IF(AL$2=\"\",\"\",IF(SUM(AL24:AL28)=0,\"\",SUM(AL24:AL28)))","v":""},{"$f":"IF(AM$2=\"\",\"\",IF(SUM(AM24:AM28)=0,\"\",SUM(AM24:AM28)))","v":""},{"$f":"IF(AN$2=\"\",\"\",IF(SUM(AN24:AN28)=0,\"\",SUM(AN24:AN28)))","v":""},{"$f":"IF(AO$2=\"\",\"\",IF(SUM(AO24:AO28)=0,\"\",SUM(AO24:AO28)))","v":""}]
["Toleransi","E.1","Menghargai pendapat teman",1]
[null,"E.2","Menghargai teman yang berbeda SARA",1]
[null,"E.3","Menerima kesepakatan meskipun berbeda dg pendapatnya",1]
[null,"E.4","Menerima kekurangan orang lain",1]
[null,"E.5","Memaafkan kesalahan orang lain",1]
[null,null,null,{"$f":"IF(D$2=\"\",\"\",IF(SUM(D30:D34)=0,\"\",SUM(D30:D34)))","v":5},{"$f":"IF(E$2=\"\",\"\",IF(SUM(E30:E34)=0,\"\",SUM(E30:E34)))","v":""},{"$f":"IF(F$2=\"\",\"\",IF(SUM(F30:F34)=0,\"\",SUM(F30:F34)))","v":""},{"$f":"IF(G$2=\"\",\"\",IF(SUM(G30:G34)=0,\"\",SUM(G30:G34)))","v":""},{"$f":"IF(H$2=\"\",\"\",IF(SUM(H30:H34)=0,\"\",SUM(H30:H34)))","v":""},{"$f":"IF(I$2=\"\",\"\",IF(SUM(I30:I34)=0,\"\",SUM(I30:I34)))","v":""},{"$f":"IF(J$2=\"\",\"\",IF(SUM(J30:J34)=0,\"\",SUM(J30:J34)))","v":""},{"$f":"IF(K$2=\"\",\"\",IF(SUM(K30:K34)=0,\"\",SUM(K30:K34)))","v":""},{"$f":"IF(L$2=\"\",\"\",IF(SUM(L30:L34)=0,\"\",SUM(L30:L34)))","v":""},{"$f":"IF(M$2=\"\",\"\",IF(SUM(M30:M34)=0,\"\",SUM(M30:M34)))","v":""},{"$f":"IF(N$2=\"\",\"\",IF(SUM(N30:N34)=0,\"\",SUM(N30:N34)))","v":""},{"$f":"IF(O$2=\"\",\"\",IF(SUM(O30:O34)=0,\"\",SUM(O30:O34)))","v":""},{"$f":"IF(P$2=\"\",\"\",IF(SUM(P30:P34)=0,\"\",SUM(P30:P34)))","v":""},{"$f":"IF(Q$2=\"\",\"\",IF(SUM(Q30:Q34)=0,\"\",SUM(Q30:Q34)))","v":""},{"$f":"IF(R$2=\"\",\"\",IF(SUM(R30:R34)=0,\"\",SUM(R30:R34)))","v":""},{"$f":"IF(S$2=\"\",\"\",IF(SUM(S30:S34)=0,\"\",SUM(S30:S34)))","v":""},{"$f":"IF(T$2=\"\",\"\",IF(SUM(T30:T34)=0,\"\",SUM(T30:T34)))","v":""},{"$f":"IF(U$2=\"\",\"\",IF(SUM(U30:U34)=0,\"\",SUM(U30:U34)))","v":""},{"$f":"IF(V$2=\"\",\"\",IF(SUM(V30:V34)=0,\"\",SUM(V30:V34)))","v":""},{"$f":"IF(W$2=\"\",\"\",IF(SUM(W30:W34)=0,\"\",SUM(W30:W34)))","v":""},{"$f":"IF(X$2=\"\",\"\",IF(SUM(X30:X34)=0,\"\",SUM(X30:X34)))","v":""},{"$f":"IF(Y$2=\"\",\"\",IF(SUM(Y30:Y34)=0,\"\",SUM(Y30:Y34)))","v":""},{"$f":"IF(Z$2=\"\",\"\",IF(SUM(Z30:Z34)=0,\"\",SUM(Z30:Z34)))","v":""},{"$f":"IF(AA$2=\"\",\"\",IF(SUM(AA30:AA34)=0,\"\",SUM(AA30:AA34)))","v":""},{"$f":"IF(AB$2=\"\",\"\",IF(SUM(AB30:AB34)=0,\"\",SUM(AB30:AB34)))","v":""},{"$f":"IF(AC$2=\"\",\"\",IF(SUM(AC30:AC34)=0,\"\",SUM(AC30:AC34)))","v":""},{"$f":"IF(AD$2=\"\",\"\",IF(SUM(AD30:AD34)=0,\"\",SUM(AD30:AD34)))","v":""},{"$f":"IF(AE$2=\"\",\"\",IF(SUM(AE30:AE34)=0,\"\",SUM(AE30:AE34)))","v":""},{"$f":"IF(AF$2=\"\",\"\",IF(SUM(AF30:AF34)=0,\"\",SUM(AF30:AF34)))","v":""},{"$f":"IF(AG$2=\"\",\"\",IF(SUM(AG30:AG34)=0,\"\",SUM(AG30:AG34)))","v":""},{"$f":"IF(AH$2=\"\",\"\",IF(SUM(AH30:AH34)=0,\"\",SUM(AH30:AH34)))","v":""},{"$f":"IF(AI$2=\"\",\"\",IF(SUM(AI30:AI34)=0,\"\",SUM(AI30:AI34)))","v":""},{"$f":"IF(AJ$2=\"\",\"\",IF(SUM(AJ30:AJ34)=0,\"\",SUM(AJ30:AJ34)))","v":""},{"$f":"IF(AK$2=\"\",\"\",IF(SUM(AK30:AK34)=0,\"\",SUM(AK30:AK34)))","v":""},{"$f":"IF(AL$2=\"\",\"\",IF(SUM(AL30:AL34)=0,\"\",SUM(AL30:AL34)))","v":""},{"$f":"IF(AM$2=\"\",\"\",IF(SUM(AM30:AM34)=0,\"\",SUM(AM30:AM34)))","v":""},{"$f":"IF(AN$2=\"\",\"\",IF(SUM(AN30:AN34)=0,\"\",SUM(AN30:AN34)))","v":""},{"$f":"IF(AO$2=\"\",\"\",IF(SUM(AO30:AO34)=0,\"\",SUM(AO30:AO34)))","v":""}]
["Gotong Royong","F.1","Aktif dalam kerja kelompok",1]
[null,"F.2","Suka menolong teman lain",1]
[null,"F.3","Kesediaan melakukan tugas sesuai kesepakatan",1]
[null,"F.4","Rela berkorban untuk teman lain",1]
[null,null,null,{"$f":"IF(D$2=\"\",\"\",IF(SUM(D36:D39)=0,\"\",SUM(D36:D39)))","v":4},{"$f":"IF(E$2=\"\",\"\",IF(SUM(E36:E39)=0,\"\",SUM(E36:E39)))","v":""},"","","","","","","","","","","","","","","","","","","","","","","","","","","","","","","","","","","",""]
["Santun","G.1","Menghormati orang yang lebih tua",1]
[null,"G.2","Mengucapkan terima kasih setelah menerima bantuan orang lain",1]
[null,"G.3","Menggunakan bahasa santun saat menyampaikan pendapat",1]
[null,"G.4","Menggunakan bahasa santun saat menkritik pendapat teman",1]
[null,"G.5","Bersikap 3S (Salam - Senyum - Sapa) kepada orang lain",1]
[null,null,null,{"$f":"IF(D$2=\"\",\"\",IF(SUM(D41:D45)=0,\"\",SUM(D41:D45)))","v":5},{"$f":"IF(E$2=\"\",\"\",IF(SUM(E41:E45)=0,\"\",SUM(E41:E45)))","v":""},{"$f":"IF(F$2=\"\",\"\",IF(SUM(F41:F45)=0,\"\",SUM(F41:F45)))","v":""},{"$f":"IF(G$2=\"\",\"\",IF(SUM(G41:G45)=0,\"\",SUM(G41:G45)))","v":""},{"$f":"IF(H$2=\"\",\"\",IF(SUM(H41:H45)=0,\"\",SUM(H41:H45)))","v":""},{"$f":"IF(I$2=\"\",\"\",IF(SUM(I41:I45)=0,\"\",SUM(I41:I45)))","v":""},{"$f":"IF(J$2=\"\",\"\",IF(SUM(J41:J45)=0,\"\",SUM(J41:J45)))","v":""},{"$f":"IF(K$2=\"\",\"\",IF(SUM(K41:K45)=0,\"\",SUM(K41:K45)))","v":""},{"$f":"IF(L$2=\"\",\"\",IF(SUM(L41:L45)=0,\"\",SUM(L41:L45)))","v":""},{"$f":"IF(M$2=\"\",\"\",IF(SUM(M41:M45)=0,\"\",SUM(M41:M45)))","v":""},{"$f":"IF(N$2=\"\",\"\",IF(SUM(N41:N45)=0,\"\",SUM(N41:N45)))","v":""},{"$f":"IF(O$2=\"\",\"\",IF(SUM(O41:O45)=0,\"\",SUM(O41:O45)))","v":""},{"$f":"IF(P$2=\"\",\"\",IF(SUM(P41:P45)=0,\"\",SUM(P41:P45)))","v":""},{"$f":"IF(Q$2=\"\",\"\",IF(SUM(Q41:Q45)=0,\"\",SUM(Q41:Q45)))","v":""},{"$f":"IF(R$2=\"\",\"\",IF(SUM(R41:R45)=0,\"\",SUM(R41:R45)))","v":""},{"$f":"IF(S$2=\"\",\"\",IF(SUM(S41:S45)=0,\"\",SUM(S41:S45)))","v":""},{"$f":"IF(T$2=\"\",\"\",IF(SUM(T41:T45)=0,\"\",SUM(T41:T45)))","v":""},{"$f":"IF(U$2=\"\",\"\",IF(SUM(U41:U45)=0,\"\",SUM(U41:U45)))","v":""},{"$f":"IF(V$2=\"\",\"\",IF(SUM(V41:V45)=0,\"\",SUM(V41:V45)))","v":""},{"$f":"IF(W$2=\"\",\"\",IF(SUM(W41:W45)=0,\"\",SUM(W41:W45)))","v":""},{"$f":"IF(X$2=\"\",\"\",IF(SUM(X41:X45)=0,\"\",SUM(X41:X45)))","v":""},{"$f":"IF(Y$2=\"\",\"\",IF(SUM(Y41:Y45)=0,\"\",SUM(Y41:Y45)))","v":""},{"$f":"IF(Z$2=\"\",\"\",IF(SUM(Z41:Z45)=0,\"\",SUM(Z41:Z45)))","v":""},{"$f":"IF(AA$2=\"\",\"\",IF(SUM(AA41:AA45)=0,\"\",SUM(AA41:AA45)))","v":""},{"$f":"IF(AB$2=\"\",\"\",IF(SUM(AB41:AB45)=0,\"\",SUM(AB41:AB45)))","v":""},{"$f":"IF(AC$2=\"\",\"\",IF(SUM(AC41:AC45)=0,\"\",SUM(AC41:AC45)))","v":""},{"$f":"IF(AD$2=\"\",\"\",IF(SUM(AD41:AD45)=0,\"\",SUM(AD41:AD45)))","v":""},{"$f":"IF(AE$2=\"\",\"\",IF(SUM(AE41:AE45)=0,\"\",SUM(AE41:AE45)))","v":""},{"$f":"IF(AF$2=\"\",\"\",IF(SUM(AF41:AF45)=0,\"\",SUM(AF41:AF45)))","v":""},{"$f":"IF(AG$2=\"\",\"\",IF(SUM(AG41:AG45)=0,\"\",SUM(AG41:AG45)))","v":""},{"$f":"IF(AH$2=\"\",\"\",IF(SUM(AH41:AH45)=0,\"\",SUM(AH41:AH45)))","v":""},{"$f":"IF(AI$2=\"\",\"\",IF(SUM(AI41:AI45)=0,\"\",SUM(AI41:AI45)))","v":""},{"$f":"IF(AJ$2=\"\",\"\",IF(SUM(AJ41:AJ45)=0,\"\",SUM(AJ41:AJ45)))","v":""},{"$f":"IF(AK$2=\"\",\"\",IF(SUM(AK41:AK45)=0,\"\",SUM(AK41:AK45)))","v":""},{"$f":"IF(AL$2=\"\",\"\",IF(SUM(AL41:AL45)=0,\"\",SUM(AL41:AL45)))","v":""},{"$f":"IF(AM$2=\"\",\"\",IF(SUM(AM41:AM45)=0,\"\",SUM(AM41:AM45)))","v":""},{"$f":"IF(AN$2=\"\",\"\",IF(SUM(AN41:AN45)=0,\"\",SUM(AN41:AN45)))","v":""},{"$f":"IF(AO$2=\"\",\"\",IF(SUM(AO41:AO45)=0,\"\",SUM(AO41:AO45)))","v":""}]
["Percaya Diri","H.1","Berani presentasi di depan kelas",1]
[null,"H.2","Berani berpendapat, bertanya, dan menjawab pertanyaan",1]
[null,"H.3","Berpendapat atau bertindak tanpa ragu-ragu",1]
[null,"H.4","Mampu membuat keputusan dengan tepat",1]
[null,"H.5","Tidak mudah putus asa",1]
[null,null,null,{"$f":"IF(D$2=\"\",\"\",IF(SUM(D47:D51)=0,\"\",SUM(D47:D51)))","v":5},{"$f":"IF(E$2=\"\",\"\",IF(SUM(E47:E51)=0,\"\",SUM(E47:E51)))","v":""},{"$f":"IF(F$2=\"\",\"\",IF(SUM(F47:F51)=0,\"\",SUM(F47:F51)))","v":""},{"$f":"IF(G$2=\"\",\"\",IF(SUM(G47:G51)=0,\"\",SUM(G47:G51)))","v":""},{"$f":"IF(H$2=\"\",\"\",IF(SUM(H47:H51)=0,\"\",SUM(H47:H51)))","v":""},{"$f":"IF(I$2=\"\",\"\",IF(SUM(I47:I51)=0,\"\",SUM(I47:I51)))","v":""},{"$f":"IF(J$2=\"\",\"\",IF(SUM(J47:J51)=0,\"\",SUM(J47:J51)))","v":""},{"$f":"IF(K$2=\"\",\"\",IF(SUM(K47:K51)=0,\"\",SUM(K47:K51)))","v":""},{"$f":"IF(L$2=\"\",\"\",IF(SUM(L47:L51)=0,\"\",SUM(L47:L51)))","v":""},{"$f":"IF(M$2=\"\",\"\",IF(SUM(M47:M51)=0,\"\",SUM(M47:M51)))","v":""},{"$f":"IF(N$2=\"\",\"\",IF(SUM(N47:N51)=0,\"\",SUM(N47:N51)))","v":""},{"$f":"IF(O$2=\"\",\"\",IF(SUM(O47:O51)=0,\"\",SUM(O47:O51)))","v":""},{"$f":"IF(P$2=\"\",\"\",IF(SUM(P47:P51)=0,\"\",SUM(P47:P51)))","v":""},{"$f":"IF(Q$2=\"\",\"\",IF(SUM(Q47:Q51)=0,\"\",SUM(Q47:Q51)))","v":""},{"$f":"IF(R$2=\"\",\"\",IF(SUM(R47:R51)=0,\"\",SUM(R47:R51)))","v":""},{"$f":"IF(S$2=\"\",\"\",IF(SUM(S47:S51)=0,\"\",SUM(S47:S51)))","v":""},{"$f":"IF(T$2=\"\",\"\",IF(SUM(T47:T51)=0,\"\",SUM(T47:T51)))","v":""},{"$f":"IF(U$2=\"\",\"\",IF(SUM(U47:U51)=0,\"\",SUM(U47:U51)))","v":""},{"$f":"IF(V$2=\"\",\"\",IF(SUM(V47:V51)=0,\"\",SUM(V47:V51)))","v":""},{"$f":"IF(W$2=\"\",\"\",IF(SUM(W47:W51)=0,\"\",SUM(W47:W51)))","v":""},{"$f":"IF(X$2=\"\",\"\",IF(SUM(X47:X51)=0,\"\",SUM(X47:X51)))","v":""},{"$f":"IF(Y$2=\"\",\"\",IF(SUM(Y47:Y51)=0,\"\",SUM(Y47:Y51)))","v":""},{"$f":"IF(Z$2=\"\",\"\",IF(SUM(Z47:Z51)=0,\"\",SUM(Z47:Z51)))","v":""},{"$f":"IF(AA$2=\"\",\"\",IF(SUM(AA47:AA51)=0,\"\",SUM(AA47:AA51)))","v":""},{"$f":"IF(AB$2=\"\",\"\",IF(SUM(AB47:AB51)=0,\"\",SUM(AB47:AB51)))","v":""},{"$f":"IF(AC$2=\"\",\"\",IF(SUM(AC47:AC51)=0,\"\",SUM(AC47:AC51)))","v":""},{"$f":"IF(AD$2=\"\",\"\",IF(SUM(AD47:AD51)=0,\"\",SUM(AD47:AD51)))","v":""},{"$f":"IF(AE$2=\"\",\"\",IF(SUM(AE47:AE51)=0,\"\",SUM(AE47:AE51)))","v":""},{"$f":"IF(AF$2=\"\",\"\",IF(SUM(AF47:AF51)=0,\"\",SUM(AF47:AF51)))","v":""},{"$f":"IF(AG$2=\"\",\"\",IF(SUM(AG47:AG51)=0,\"\",SUM(AG47:AG51)))","v":""},{"$f":"IF(AH$2=\"\",\"\",IF(SUM(AH47:AH51)=0,\"\",SUM(AH47:AH51)))","v":""},{"$f":"IF(AI$2=\"\",\"\",IF(SUM(AI47:AI51)=0,\"\",SUM(AI47:AI51)))","v":""},{"$f":"IF(AJ$2=\"\",\"\",IF(SUM(AJ47:AJ51)=0,\"\",SUM(AJ47:AJ51)))","v":""},{"$f":"IF(AK$2=\"\",\"\",IF(SUM(AK47:AK51)=0,\"\",SUM(AK47:AK51)))","v":""},{"$f":"IF(AL$2=\"\",\"\",IF(SUM(AL47:AL51)=0,\"\",SUM(AL47:AL51)))","v":""},{"$f":"IF(AM$2=\"\",\"\",IF(SUM(AM47:AM51)=0,\"\",SUM(AM47:AM51)))","v":""},{"$f":"IF(AN$2=\"\",\"\",IF(SUM(AN47:AN51)=0,\"\",SUM(AN47:AN51)))","v":""},{"$f":"IF(AO$2=\"\",\"\",IF(SUM(AO47:AO51)=0,\"\",SUM(AO47:AO51)))","v":""}]
[]
[null,null,null,{"$f":"IF(D2=\"\",\"\",SUM(D52,D46,D40,D35,D29,D23,D14,D8))","v":42},{"$f":"IF(E2=\"\",\"\",SUM(E52,E46,E40,E35,E29,E23,E14,E8))","v":3},0,0,0,0,0,0,0,0,0,0,0,0,0,0,0,0,0,0,0,0,0,0,0,0,0,0,0,0,0,0,0,0,"","","",""]

{"sheet":"DIR","index":9,"n_rows":54,"n_cols":41,"rows_kept":54,"cut":false,"hidden":false,"merged":[[40,0,45,0],[46,0,51,0],[2,0,7,0],[8,0,13,0],[14,0,22,0],[23,0,28,0],[29,0,34,0],[35,0,39,0]]}
["REKAP PENILAIAN DIRI SENDIRI",null,null,{"$f":"IF(ABS!$D$15=\"\",\"\",PROPER(ABS!$D$15))","v":"Adhitya Ferdi Kristianto"},{"$f":"IF(ABS!$D$16=\"\",\"\",PROPER(ABS!$D$16))","v":"Agung Dwi Saputro"},{"$f":"IF(ABS!$D$17=\"\",\"\",PROPER(ABS!$D$17))","v":"Anissa Dhea Paramitha"},{"$f":"IF(ABS!$D$18=\"\",\"\",PROPER(ABS!$D$18))","v":"Aprilia Desi Laraswati"},{"$f":"IF(ABS!$D$19=\"\",\"\",PROPER(ABS!$D$19))","v":"Bagas Adifirmansyah"},{"$f":"IF(ABS!$D$20=\"\",\"\",PROPER(ABS!$D$20))","v":"Dela Shabrina"},{"$f":"IF(ABS!$D$21=\"\",\"\",PROPER(ABS!$D$21))","v":"Desti Rani Indriyani"},{"$f":"IF(ABS!$D$22=\"\",\"\",PROPER(ABS!$D$22))","v":"Dewi Suciati Fauzun"},{"$f":"IF(ABS!$D$23=\"\",\"\",PROPER(ABS!$D$23))","v":"Dimas Nusantara Adi"},{"$f":"IF(ABS!$D$24=\"\",\"\",PROPER(ABS!$D$24))","v":"Edo Wanda Prastyo"},{"$f":"IF(ABS!$D$25=\"\",\"\",PROPER(ABS!$D$25))","v":"Entin Taat Arumningtias"},{"$f":"IF(ABS!$D$26=\"\",\"\",PROPER(ABS!$D$26))","v":"Fajar Adi Pamungkas"},{"$f":"IF(ABS!$D$27=\"\",\"\",PROPER(ABS!$D$27))","v":"Frendy Lasmana Putra"},{"$f":"IF(ABS!$D$28=\"\",\"\",PROPER(ABS!$D$28))","v":"Gana Ridho Akbar"},{"$f":"IF(ABS!$D$29=\"\",\"\",PROPER(ABS!$D$29))","v":"Indra Cahya Permana"},{"$f":"IF(ABS!$D$30=\"\",\"\",PROPER(ABS!$D$30))","v":"Ismia Nivrendita"},{"$f":"IF(ABS!$D$31=\"\",\"\",PROPER(ABS!$D$31))","v":"Krista Ikawan"},{"$f":"IF(ABS!$D$32=\"\",\"\",PROPER(ABS!$D$32))","v":"Lestari"},{"$f":"IF(ABS!$D$33=\"\",\"\",PROPER(ABS!$D$33))","v":"Miasari Sholaiha"},{"$f":"IF(ABS!$D$34=\"\",\"\",PROPER(ABS!$D$34))","v":"Modis Iyonda"},{"$f":"IF(ABS!$D$35=\"\",\"\",PROPER(ABS!$D$35))","v":"Muhammad Agni Farras"},{"$f":"IF(ABS!$D$36=\"\",\"\",PROPER(ABS!$D$36))","v":"Pratomo Setyo Aji"},{"$f":"IF(ABS!$D$37=\"\",\"\",PROPER(ABS!$D$37))","v":"Puji Lestari"},{"$f":"IF(ABS!$D$38=\"\",\"\",PROPER(ABS!$D$38))","v":"Rindra Alriyan"},{"$f":"IF(ABS!$D$39=\"\",\"\",PROPER(ABS!$D$39))","v":"Sinta Anggraeni"},{"$f":"IF(ABS!$D$40=\"\",\"\",PROPER(ABS!$D$40))","v":"Sofi"},{"$f":"IF(ABS!$D$41=\"\",\"\",PROPER(ABS!$D$41))","v":"Tika Wulandari"},{"$f":"IF(ABS!$D$42=\"\",\"\",PROPER(ABS!$D$42))","v":"Tomy Faizal Manaf"},{"$f":"IF(ABS!$D$43=\"\",\"\",PROPER(ABS!$D$43))","v":"Toni Gunawan"},{"$f":"IF(ABS!$D$44=\"\",\"\",PROPER(ABS!$D$44))","v":"Vevy Dyas Lestari"},{"$f":"IF(ABS!$D$45=\"\",\"\",PROPER(ABS!$D$45))","v":"Wahyu Ardhi Gunawan"},{"$f":"IF(ABS!$D$46=\"\",\"\",PROPER(ABS!$D$46))","v":"Widi Pangestu"},{"$f":"IF(ABS!$D$47=\"\",\"\",PROPER(ABS!$D$47))","v":"Yuli Atifah"},{"$f":"IF(ABS!$D$48=\"\",\"\",PROPER(ABS!$D$48))","v":"Yusuf Dwi Prasetya"},{"$f":"IF(ABS!$D$49=\"\",\"\",PROPER(ABS!$D$49))","v":""},{"$f":"IF(ABS!$D$50=\"\",\"\",PROPER(ABS!$D$50))","v":""},{"$f":"IF(ABS!$D$51=\"\",\"\",PROPER(ABS!$D$51))","v":""},{"$f":"IF(ABS!$D$52=\"\",\"\",PROPER(ABS!$D$52))","v":""}]
["Sikap","Kode","Aspek Pengamatan",{"$f":"IF(ABS!$B$15=\"\",\"\",PROPER(ABS!$B$15))","v":"1"},{"$f":"IF(ABS!$B$16=\"\",\"\",PROPER(ABS!$B$16))","v":"2"},{"$f":"IF(ABS!$B$17=\"\",\"\",PROPER(ABS!$B$17))","v":"3"},{"$f":"IF(ABS!$B$18=\"\",\"\",PROPER(ABS!$B$18))","v":"4"},{"$f":"IF(ABS!$B$19=\"\",\"\",PROPER(ABS!$B$19))","v":"5"},{"$f":"IF(ABS!$B$20=\"\",\"\",PROPER(ABS!$B$20))","v":"6"},{"$f":"IF(ABS!$B$21=\"\",\"\",PROPER(ABS!$B$21))","v":"7"},{"$f":"IF(ABS!$B$22=\"\",\"\",PROPER(ABS!$B$22))","v":"8"},{"$f":"IF(ABS!$B$23=\"\",\"\",PROPER(ABS!$B$23))","v":"9"},{"$f":"IF(ABS!$B$24=\"\",\"\",PROPER(ABS!$B$24))","v":"10"},{"$f":"IF(ABS!$B$25=\"\",\"\",PROPER(ABS!$B$25))","v":"11"},{"$f":"IF(ABS!$B$26=\"\",\"\",PROPER(ABS!$B$26))","v":"12"},{"$f":"IF(ABS!$B$27=\"\",\"\",PROPER(ABS!$B$27))","v":"13"},{"$f":"IF(ABS!$B$28=\"\",\"\",PROPER(ABS!$B$28))","v":"14"},{"$f":"IF(ABS!$B$29=\"\",\"\",PROPER(ABS!$B$29))","v":"15"},{"$f":"IF(ABS!$B$30=\"\",\"\",PROPER(ABS!$B$30))","v":"16"},{"$f":"IF(ABS!$B$31=\"\",\"\",PROPER(ABS!$B$31))","v":"17"},{"$f":"IF(ABS!$B$32=\"\",\"\",PROPER(ABS!$B$32))","v":"18"},{"$f":"IF(ABS!$B$33=\"\",\"\",PROPER(ABS!$B$33))","v":"19"},{"$f":"IF(ABS!$B$34=\"\",\"\",PROPER(ABS!$B$34))","v":"20"},{"$f":"IF(ABS!$B$35=\"\",\"\",PROPER(ABS!$B$35))","v":"21"},{"$f":"IF(ABS!$B$36=\"\",\"\",PROPER(ABS!$B$36))","v":"22"},{"$f":"IF(ABS!$B$37=\"\",\"\",PROPER(ABS!$B$37))","v":"23"},{"$f":"IF(ABS!$B$38=\"\",\"\",PROPER(ABS!$B$38))","v":"24"},{"$f":"IF(ABS!$B$39=\"\",\"\",PROPER(ABS!$B$39))","v":"25"},{"$f":"IF(ABS!$B$40=\"\",\"\",PROPER(ABS!$B$40))","v":"26"},{"$f":"IF(ABS!$B$41=\"\",\"\",PROPER(ABS!$B$41))","v":"27"},{"$f":"IF(ABS!$B$42=\"\",\"\",PROPER(ABS!$B$42))","v":"28"},{"$f":"IF(ABS!$B$43=\"\",\"\",PROPER(ABS!$B$43))","v":"29"},{"$f":"IF(ABS!$B$44=\"\",\"\",PROPER(ABS!$B$44))","v":"30"},{"$f":"IF(ABS!$B$45=\"\",\"\",PROPER(ABS!$B$45))","v":"31"},{"$f":"IF(ABS!$B$46=\"\",\"\",PROPER(ABS!$B$46))","v":"32"},{"$f":"IF(ABS!$B$47=\"\",\"\",PROPER(ABS!$B$47))","v":"33"},{"$f":"IF(ABS!$B$48=\"\",\"\",PROPER(ABS!$B$48))","v":"34"},{"$f":"IF(ABS!$B$49=\"\",\"\",PROPER(ABS!$B$49))","v":""},{"$f":"IF(ABS!$B$50=\"\",\"\",PROPER(ABS!$B$50))","v":""},{"$f":"IF(ABS!$B$51=\"\",\"\",PROPER(ABS!$B$51))","v":""},{"$f":"IF(ABS!$B$52=\"\",\"\",PROPER(ABS!$B$52))","v":""}]
["Spiritual","A.1","Berdoa sebelum dan sesudah melakukan sesuatu"]
[null,"A.2","Mengucapkan rasa syukur setelah berhasil mengerjakan sesuatu"]
[null,"A.3","Memberi salam sebelum dan sesudah menyampaikan pendapat"]
[null,"A.4","Menjalankan ibadah tepat waktu"]
[null,"A.5","Menambah rasa keimanan setelah mempelajari Iptek"]
[null,null,null,{"$f":"IF(D$2=\"\",\"\",IF(SUM(D3:D7)=0,\"\",SUM(D3:D7)))","v":""},{"$f":"IF(E$2=\"\",\"\",IF(SUM(E3:E7)=0,\"\",SUM(E3:E7)))","v":""},"","","","","","","","","","","","","","","","","","","","","","","","","","","","","","","","","","","",""]
["Jujur","B.1","Tidak nyontek dalam mengerjakan ujian"]
[null,"B.2","Tidak melakukan plagiat dalam mengerjakan setiap tugas"]
[null,"B.3","Mengemukakan perasaan thd sesuatu apa adanya"]
[null,"B.4","Melaporkan data atau informasi apa adanya"]
[null,"B.5","Mengakui kesalahan atau kekurangan yang dimiliki"]
[null,null,null,{"$f":"IF(D$2=\"\",\"\",IF(SUM(D9:D13)=0,\"\",SUM(D9:D13)))","v":""},{"$f":"IF(E$2=\"\",\"\",IF(SUM(E9:E13)=0,\"\",SUM(E9:E13)))","v":""},"","","","","","","","","","","","","","","","","","","","","","","","","","","","","","","","","","","",""]
["Disiplin","C.1","Masuk Kelas tepat waktu"]
[null,"C.2","Mengumpulkan tugas tepat waktu"]
[null,"C.3","Memakai seragam sesuai tata tertib"]
[null,"C.4","Mengerjakan tugas yang diberikan"]
[null,"C.5","Tertib dalam mengikuti pembelajaran"]
[null,"C.6","Mengikuti praktikum sesuai dengan langkah yg ditetapkan"]
[null,"C.7","Membawa buku tulis sesuai mapel"]
[null,"C.8","Membawa buku teks mapel"]
[null,null,null,{"$f":"IF(D$2=\"\",\"\",IF(SUM(D15:D22)=0,\"\",SUM(D15:D22)))","v":""},{"$f":"IF(E$2=\"\",\"\",IF(SUM(E15:E22)=0,\"\",SUM(E15:E22)))","v":""},"","","","","","","","","","","","","","","","","","","","","","","","","","","","","","","","","","","",""]
["Tanggung Jawab","D.1","Melaksanakan tugas individu dengan baik"]
[null,"D.2","Menerima resiko dari tindakan yang dilakukan"]
[null,"D.3","Tidak menuduh orang lain tanpa buktu yang akurat"]
[null,"D.4","Mengembalikan barang yang dipinjam"]
[null,"D.5","Meminta maaf atas kesalahan yang dilakukan"]
[null,null,null,{"$f":"IF(D$2=\"\",\"\",IF(SUM(D24:D28)=0,\"\",SUM(D24:D28)))","v":""},{"$f":"IF(E$2=\"\",\"\",IF(SUM(E24:E28)=0,\"\",SUM(E24:E28)))","v":""},"","","","","","","","","","","","","","","","","","","","","","","","","","","","","","","","","","","",""]
["Toleransi","E.1","Menghargai pendapat teman"]
[null,"E.2","Menghargai teman yang berbeda SARA"]
[null,"E.3","Menerima kesepakatan meskipun berbeda dg pendapatnya"]
[null,"E.4","Menerima kekurangan orang lain"]
[null,"E.5","Memaafkan kesalahan orang lain"]
[null,null,null,{"$f":"IF(D$2=\"\",\"\",IF(SUM(D30:D34)=0,\"\",SUM(D30:D34)))","v":""},{"$f":"IF(E$2=\"\",\"\",IF(SUM(E30:E34)=0,\"\",SUM(E30:E34)))","v":""},"","","","","","","","","","","","","","","","","","","","","","","","","","","","","","","","","","","",""]
["Gotong Royong","F.1","Aktif dalam kerja kelompok"]
[null,"F.2","Suka menolong teman lain"]
[null,"F.3","Kesediaan melakukan tugas sesuai kesepakatan"]
[null,"F.4","Rela berkorban untuk teman lain"]
[null,null,null,{"$f":"IF(D$2=\"\",\"\",IF(SUM(D36:D39)=0,\"\",SUM(D36:D39)))","v":""},{"$f":"IF(E$2=\"\",\"\",IF(SUM(E36:E39)=0,\"\",SUM(E36:E39)))","v":""},"","","","","","","","","","","","","","","","","","","","","","","","","","","","","","","","","","","",""]
["Santun","G.1","Menghormati orang yang lebih tua"]
[null,"G.2","Mengucapkan terima kasih setelah menerima bantuan orang lain"]
[null,"G.3","Menggunakan bahasa santun saat menyampaikan pendapat"]
[null,"G.4","Menggunakan bahasa santun saat menkritik pendapat teman"]
[null,"G.5","Bersikap 3S (Salam - Senyum - Sapa) kepada orang lain"]
[null,null,null,{"$f":"IF(D$2=\"\",\"\",IF(SUM(D41:D45)=0,\"\",SUM(D41:D45)))","v":""},{"$f":"IF(E$2=\"\",\"\",IF(SUM(E41:E45)=0,\"\",SUM(E41:E45)))","v":""},"","","","","","","","","","","","","","","","","","","","","","","","","","","","","","","","","","","",""]
["Percaya Diri","H.1","Berani presentasi di depan kelas"]
[null,"H.2","Berani berpendapat, bertanya, dan menjawab pertanyaan"]
[null,"H.3","Berpendapat atau bertindak tanpa ragu-ragu"]
[null,"H.4","Mampu membuat keputusan dengan tepat"]
[null,"H.5","Tidak mudah putus asa"]
[null,null,null,{"$f":"IF(D$2=\"\",\"\",IF(SUM(D47:D51)=0,\"\",SUM(D47:D51)))","v":""},{"$f":"IF(E$2=\"\",\"\",IF(SUM(E47:E51)=0,\"\",SUM(E47:E51)))","v":""},"","","","","","","","","","","","","","","","","","","","","","","","","","","","","","","","","","","",""]
[]
[null,null,null,{"$f":"IF(D2=\"\",\"\",SUM(D52,D46,D40,D35,D29,D23,D14,D8))","v":0},{"$f":"IF(E2=\"\",\"\",SUM(E52,E46,E40,E35,E29,E23,E14,E8))","v":0},0,0,0,0,0,0,0,0,0,0,0,0,0,0,0,0,0,0,0,0,0,0,0,0,0,0,0,0,0,0,0,0,"","","",""]

{"sheet":"TEM","index":10,"n_rows":48,"n_cols":41,"rows_kept":48,"cut":false,"hidden":false,"merged":[[34,0,39,0],[40,0,45,0],[2,0,7,0],[8,0,16,0],[17,0,22,0],[23,0,28,0],[29,0,33,0]]}
["REKAP PENILAIAN ANTARTEMAN",null,null,{"$f":"IF(ABS!$D$15=\"\",\"\",PROPER(ABS!$D$15))","v":"Adhitya Ferdi Kristianto"},{"$f":"IF(ABS!$D$16=\"\",\"\",PROPER(ABS!$D$16))","v":"Agung Dwi Saputro"},{"$f":"IF(ABS!$D$17=\"\",\"\",PROPER(ABS!$D$17))","v":"Anissa Dhea Paramitha"},{"$f":"IF(ABS!$D$18=\"\",\"\",PROPER(ABS!$D$18))","v":"Aprilia Desi Laraswati"},{"$f":"IF(ABS!$D$19=\"\",\"\",PROPER(ABS!$D$19))","v":"Bagas Adifirmansyah"},{"$f":"IF(ABS!$D$20=\"\",\"\",PROPER(ABS!$D$20))","v":"Dela Shabrina"},{"$f":"IF(ABS!$D$21=\"\",\"\",PROPER(ABS!$D$21))","v":"Desti Rani Indriyani"},{"$f":"IF(ABS!$D$22=\"\",\"\",PROPER(ABS!$D$22))","v":"Dewi Suciati Fauzun"},{"$f":"IF(ABS!$D$23=\"\",\"\",PROPER(ABS!$D$23))","v":"Dimas Nusantara Adi"},{"$f":"IF(ABS!$D$24=\"\",\"\",PROPER(ABS!$D$24))","v":"Edo Wanda Prastyo"},{"$f":"IF(ABS!$D$25=\"\",\"\",PROPER(ABS!$D$25))","v":"Entin Taat Arumningtias"},{"$f":"IF(ABS!$D$26=\"\",\"\",PROPER(ABS!$D$26))","v":"Fajar Adi Pamungkas"},{"$f":"IF(ABS!$D$27=\"\",\"\",PROPER(ABS!$D$27))","v":"Frendy Lasmana Putra"},{"$f":"IF(ABS!$D$28=\"\",\"\",PROPER(ABS!$D$28))","v":"Gana Ridho Akbar"},{"$f":"IF(ABS!$D$29=\"\",\"\",PROPER(ABS!$D$29))","v":"Indra Cahya Permana"},{"$f":"IF(ABS!$D$30=\"\",\"\",PROPER(ABS!$D$30))","v":"Ismia Nivrendita"},{"$f":"IF(ABS!$D$31=\"\",\"\",PROPER(ABS!$D$31))","v":"Krista Ikawan"},{"$f":"IF(ABS!$D$32=\"\",\"\",PROPER(ABS!$D$32))","v":"Lestari"},{"$f":"IF(ABS!$D$33=\"\",\"\",PROPER(ABS!$D$33))","v":"Miasari Sholaiha"},{"$f":"IF(ABS!$D$34=\"\",\"\",PROPER(ABS!$D$34))","v":"Modis Iyonda"},{"$f":"IF(ABS!$D$35=\"\",\"\",PROPER(ABS!$D$35))","v":"Muhammad Agni Farras"},{"$f":"IF(ABS!$D$36=\"\",\"\",PROPER(ABS!$D$36))","v":"Pratomo Setyo Aji"},{"$f":"IF(ABS!$D$37=\"\",\"\",PROPER(ABS!$D$37))","v":"Puji Lestari"},{"$f":"IF(ABS!$D$38=\"\",\"\",PROPER(ABS!$D$38))","v":"Rindra Alriyan"},{"$f":"IF(ABS!$D$39=\"\",\"\",PROPER(ABS!$D$39))","v":"Sinta Anggraeni"},{"$f":"IF(ABS!$D$40=\"\",\"\",PROPER(ABS!$D$40))","v":"Sofi"},{"$f":"IF(ABS!$D$41=\"\",\"\",PROPER(ABS!$D$41))","v":"Tika Wulandari"},{"$f":"IF(ABS!$D$42=\"\",\"\",PROPER(ABS!$D$42))","v":"Tomy Faizal Manaf"},{"$f":"IF(ABS!$D$43=\"\",\"\",PROPER(ABS!$D$43))","v":"Toni Gunawan"},{"$f":"IF(ABS!$D$44=\"\",\"\",PROPER(ABS!$D$44))","v":"Vevy Dyas Lestari"},{"$f":"IF(ABS!$D$45=\"\",\"\",PROPER(ABS!$D$45))","v":"Wahyu Ardhi Gunawan"},{"$f":"IF(ABS!$D$46=\"\",\"\",PROPER(ABS!$D$46))","v":"Widi Pangestu"},{"$f":"IF(ABS!$D$47=\"\",\"\",PROPER(ABS!$D$47))","v":"Yuli Atifah"},{"$f":"IF(ABS!$D$48=\"\",\"\",PROPER(ABS!$D$48))","v":"Yusuf Dwi Prasetya"},{"$f":"IF(ABS!$D$49=\"\",\"\",PROPER(ABS!$D$49))","v":""},{"$f":"IF(ABS!$D$50=\"\",\"\",PROPER(ABS!$D$50))","v":""},{"$f":"IF(ABS!$D$51=\"\",\"\",PROPER(ABS!$D$51))","v":""},{"$f":"IF(ABS!$D$52=\"\",\"\",PROPER(ABS!$D$52))","v":""}]
["Sikap","Kode","Aspek Pengamatan",{"$f":"IF(ABS!$B$15=\"\",\"\",PROPER(ABS!$B$15))","v":"1"},{"$f":"IF(ABS!$B$16=\"\",\"\",PROPER(ABS!$B$16))","v":"2"},{"$f":"IF(ABS!$B$17=\"\",\"\",PROPER(ABS!$B$17))","v":"3"},{"$f":"IF(ABS!$B$18=\"\",\"\",PROPER(ABS!$B$18))","v":"4"},{"$f":"IF(ABS!$B$19=\"\",\"\",PROPER(ABS!$B$19))","v":"5"},{"$f":"IF(ABS!$B$20=\"\",\"\",PROPER(ABS!$B$20))","v":"6"},{"$f":"IF(ABS!$B$21=\"\",\"\",PROPER(ABS!$B$21))","v":"7"},{"$f":"IF(ABS!$B$22=\"\",\"\",PROPER(ABS!$B$22))","v":"8"},{"$f":"IF(ABS!$B$23=\"\",\"\",PROPER(ABS!$B$23))","v":"9"},{"$f":"IF(ABS!$B$24=\"\",\"\",PROPER(ABS!$B$24))","v":"10"},{"$f":"IF(ABS!$B$25=\"\",\"\",PROPER(ABS!$B$25))","v":"11"},{"$f":"IF(ABS!$B$26=\"\",\"\",PROPER(ABS!$B$26))","v":"12"},{"$f":"IF(ABS!$B$27=\"\",\"\",PROPER(ABS!$B$27))","v":"13"},{"$f":"IF(ABS!$B$28=\"\",\"\",PROPER(ABS!$B$28))","v":"14"},{"$f":"IF(ABS!$B$29=\"\",\"\",PROPER(ABS!$B$29))","v":"15"},{"$f":"IF(ABS!$B$30=\"\",\"\",PROPER(ABS!$B$30))","v":"16"},{"$f":"IF(ABS!$B$31=\"\",\"\",PROPER(ABS!$B$31))","v":"17"},{"$f":"IF(ABS!$B$32=\"\",\"\",PROPER(ABS!$B$32))","v":"18"},{"$f":"IF(ABS!$B$33=\"\",\"\",PROPER(ABS!$B$33))","v":"19"},{"$f":"IF(ABS!$B$34=\"\",\"\",PROPER(ABS!$B$34))","v":"20"},{"$f":"IF(ABS!$B$35=\"\",\"\",PROPER(ABS!$B$35))","v":"21"},{"$f":"IF(ABS!$B$36=\"\",\"\",PROPER(ABS!$B$36))","v":"22"},{"$f":"IF(ABS!$B$37=\"\",\"\",PROPER(ABS!$B$37))","v":"23"},{"$f":"IF(ABS!$B$38=\"\",\"\",PROPER(ABS!$B$38))","v":"24"},{"$f":"IF(ABS!$B$39=\"\",\"\",PROPER(ABS!$B$39))","v":"25"},{"$f":"IF(ABS!$B$40=\"\",\"\",PROPER(ABS!$B$40))","v":"26"},{"$f":"IF(ABS!$B$41=\"\",\"\",PROPER(ABS!$B$41))","v":"27"},{"$f":"IF(ABS!$B$42=\"\",\"\",PROPER(ABS!$B$42))","v":"28"},{"$f":"IF(ABS!$B$43=\"\",\"\",PROPER(ABS!$B$43))","v":"29"},{"$f":"IF(ABS!$B$44=\"\",\"\",PROPER(ABS!$B$44))","v":"30"},{"$f":"IF(ABS!$B$45=\"\",\"\",PROPER(ABS!$B$45))","v":"31"},{"$f":"IF(ABS!$B$46=\"\",\"\",PROPER(ABS!$B$46))","v":"32"},{"$f":"IF(ABS!$B$47=\"\",\"\",PROPER(ABS!$B$47))","v":"33"},{"$f":"IF(ABS!$B$48=\"\",\"\",PROPER(ABS!$B$48))","v":"34"},{"$f":"IF(ABS!$B$49=\"\",\"\",PROPER(ABS!$B$49))","v":""},{"$f":"IF(ABS!$B$50=\"\",\"\",PROPER(ABS!$B$50))","v":""},{"$f":"IF(ABS!$B$51=\"\",\"\",PROPER(ABS!$B$51))","v":""},{"$f":"IF(ABS!$B$52=\"\",\"\",PROPER(ABS!$B$52))","v":""}]
["Jujur","B.1","Tidak nyontek dalam mengerjakan ujian",4]
[null,"B.2","Tidak melakukan plagiat dalam mengerjakan setiap tugas",4]
[null,"B.3","Mengemukakan perasaan thd sesuatu apa adanya",3]
[null,"B.4","Melaporkan data atau informasi apa adanya",3]
[null,"B.5","Mengakui kesalahan atau kekurangan yang dimiliki",3]
[null,null,null,{"$f":"IF(D$2=\"\",\"\",IF(SUM(D3:D7)=0,\"\",SUM(D3:D7)))","v":17},{"$f":"IF(E$2=\"\",\"\",IF(SUM(E3:E7)=0,\"\",SUM(E3:E7)))","v":""},"","","","","","","","","","","","","","","","","","","","","","","","","","","","","","","","","","","",""]
["Disiplin","C.1","Masuk Kelas tepat waktu"]
[null,"C.2","Mengumpulkan tugas tepat waktu"]
[null,"C.3","Memakai seragam sesuai tata tertib"]
[null,"C.4","Mengerjakan tugas yang diberikan"]
[null,"C.5","Tertib dalam mengikuti pembelajaran"]
[null,"C.6","Mengikuti praktikum sesuai dengan langkah yg ditetapkan"]
[null,"C.7","Membawa buku tulis sesuai mapel"]
[null,"C.8","Membawa buku teks mapel"]
[null,null,null,{"$f":"IF(D$2=\"\",\"\",IF(SUM(D9:D16)=0,\"\",SUM(D9:D16)))","v":""},{"$f":"IF(E$2=\"\",\"\",IF(SUM(E9:E16)=0,\"\",SUM(E9:E16)))","v":""},"","","","","","","","","","","","","","","","","","","","","","","","","","","","","","","","","","","",""]
["Tanggung Jawab","D.1","Melaksanakan tugas individu dengan baik"]
[null,"D.2","Menerima resiko dari tindakan yang dilakukan"]
[null,"D.3","Tidak menuduh orang lain tanpa buktu yang akurat"]
[null,"D.4","Mengembalikan barang yang dipinjam"]
[null,"D.5","Meminta maaf atas kesalahan yang dilakukan"]
[null,null,null,{"$f":"IF(D$2=\"\",\"\",IF(SUM(D18:D22)=0,\"\",SUM(D18:D22)))","v":""},{"$f":"IF(E$2=\"\",\"\",IF(SUM(E18:E22)=0,\"\",SUM(E18:E22)))","v":""},"","","","","","","","","","","","","","","","","","","","","","","","","","","","","","","","","","","",""]
["Toleransi","E.1","Menghargai pendapat teman"]
[null,"E.2","Menghargai teman yang berbeda SARA"]
[null,"E.3","Menerima kesepakatan meskipun berbeda dg pendapatnya"]
[null,"E.4","Menerima kekurangan orang lain"]
[null,"E.5","Memaafkan kesalahan orang lain"]
[null,null,null,{"$f":"IF(D$2=\"\",\"\",IF(SUM(D24:D28)=0,\"\",SUM(D24:D28)))","v":""},{"$f":"IF(E$2=\"\",\"\",IF(SUM(E24:E28)=0,\"\",SUM(E24:E28)))","v":""},"","","","","","","","","","","","","","","","","","","","","","","","","","","","","","","","","","","",""]
["Gotong Royong","F.1","Aktif dalam kerja kelompok"]
[null,"F.2","Suka menolong teman lain"]
[null,"F.3","Kesediaan melakukan tugas sesuai kesepakatan"]
[null,"F.4","Rela berkorban untuk teman lain"]
[null,null,null,{"$f":"IF(D$2=\"\",\"\",IF(SUM(D30:D33)=0,\"\",SUM(D30:D33)))","v":""},{"$f":"IF(E$2=\"\",\"\",IF(SUM(E30:E33)=0,\"\",SUM(E30:E33)))","v":""},"","","","","","","","","","","","","","","","","","","","","","","","","","","","","","","","","","","",""]
["Santun","G.1","Menghormati orang yang lebih tua"]
[null,"G.2","Mengucapkan terima kasih setelah menerima bantuan orang lain"]
[null,"G.3","Menggunakan bahasa santun saat menyampaikan pendapat"]
[null,"G.4","Menggunakan bahasa santun saat menkritik pendapat teman"]
[null,"G.5","Bersikap 3S (Salam - Senyum - Sapa) kepada orang lain"]
[null,null,null,{"$f":"IF(D$2=\"\",\"\",IF(SUM(D35:D39)=0,\"\",SUM(D35:D39)))","v":""},{"$f":"IF(E$2=\"\",\"\",IF(SUM(E35:E39)=0,\"\",SUM(E35:E39)))","v":""},"","","","","","","","","","","","","","","","","","","","","","","","","","","","","","","","","","","",""]
["Percaya Diri","H.1","Berani presentasi di depan kelas"]
[null,"H.2","Berani berpendapat, bertanya, dan menjawab pertanyaan"]
[null,"H.3","Berpendapat atau bertindak tanpa ragu-ragu"]
[null,"H.4","Mampu membuat keputusan dengan tepat"]
[null,"H.5","Tidak mudah putus asa"]
[null,null,null,{"$f":"IF(D$2=\"\",\"\",IF(SUM(D41:D45)=0,\"\",SUM(D41:D45)))","v":""},{"$f":"IF(E$2=\"\",\"\",IF(SUM(E41:E45)=0,\"\",SUM(E41:E45)))","v":""},"","","","","","","","","","","","","","","","","","","","","","","","","","","","","","","","","","","",""]
[]
[null,null,null,{"$f":"IF(D2=\"\",\"\",SUM(D46,D40,D34,D29,D23,D17,D8))","v":17},{"$f":"IF(E2=\"\",\"\",SUM(E46,E40,E34,E29,E23,E17,E8))","v":0},0,0,0,0,0,0,0,0,0,0,0,0,0,0,0,0,0,0,0,0,0,0,0,0,0,0,0,0,0,0,0,0,"","","",""]

{"sheet":"JUR","index":11,"n_rows":4,"n_cols":5,"rows_kept":4,"cut":false,"hidden":false,"merged":[]}
["NILAI JURNAL CATATAN GURU"]
["No.","Hari dan Tanggal","Nama Siswa","Kejadian","Aspek Yang Diamati"]
[1,"Senin, 4 Nopember 2013","Arif Kuncoro Aji","Pada ulangan Struktur atom, yang bersangkutan mencontek temannya","Kejujuran"]
[2,"Senin, 11 Nopember 2013","Herlina Herawati","terlambat masuk sekolah untuk ke-3 kalinya","Disiplin"]

{"sheet":"PRA","index":12,"n_rows":65,"n_cols":22,"rows_kept":65,"cut":false,"hidden":false,"merged":[[2,11,3,11],[2,0,3,0],[2,1,3,1],[2,2,2,4],[2,5,2,7],[2,8,2,10],[2,15,2,18],[2,19,3,19],[2,13,3,13],[2,14,3,14],[2,20,3,20],[29,10,30,10],[29,2,29,5],[29,6,29,9],[29,0,30,0],[29,1,30,1],[29,14,30,14],[29,15,29,19],[29,20,30,20],[29,21,30,21],[29,11,30,11],[29,13,30,13],[44,0,46,0],[44,11,46,11],[44,1,46,5],[64,0,64,5],[44,7,44,10],[45,7,45,10],[46,7,46,8],[46,9,46,10],[47,7,47,8],[44,6,45,6],[47,9,47,10],[48,7,48,8],[48,9,48,10],[49,7,49,8],[49,9,49,10],[50,7,50,8],[50,9,50,10],[51,7,51,8],[51,9,51,10],[52,7,52,8],[52,9,52,10],[53,7,53,8],[53,9,53,10],[54,7,54,8],[54,9,54,10],[55,7,55,8],[55,9,55,10],[56,7,56,8],[56,9,56,10],[57,7,57,8],[57,9,57,10],[58,7,58,8],[58,9,58,10],[59,7,59,8],[59,9,59,10],[60,7,60,8],[60,9,60,10],[64,7,64,8],[64,9,64,10],[61,7,61,8],[61,9,61,10],[62,7,62,8],[62,9,62,10],[63,7,63,8],[63,9,63,10]]}
["LEMBAR PENILAIAN PRAKTIK (SENI MUSIK)",null,null,null,null,null,null,null,null,null,null,null,null,"LEMBAR PENILAIAN PRAKTIK (BAHASA)"]
[]
["No ","Nama Siswa ","Penampilan ",null,null,"Harmoni ",null,null,"Teknik Vokal ",null,null,"Hasil akhir ",null,"No","Nama","Skor untuk",null,null,null,"Jumlah Skor","Nilai"]
[null,null,1,2,3,1,2,3,1,2,3,null,null,null,null,"Kelancaran","Ucapan","Intonasi","Pilihan.Kata"]
[1,null,null,null,null,null,null,null,null,null,null,null,null,1]
[2,null,null,null,null,null,null,null,null,null,null,null,null,2]
[3,null,null,null,null,null,null,null,null,null,null,null,null,3]
[]
["Kriteria Penilaian",null,null,null,null,null,null,null,null,null,null,null,null,"Kriteria Penilaian"]
[null,null,null,null,null,null,null,null,null,null,null,null,null,"Kelancaran (fluency)",null,"3 = Lancar"]
["Penampilan",null,null,null,null,null,null,null,null,null,null,null,null,null,null,"2 = Kurang lancar"]
["3.  Ekspresi dan gaya sudah sempurna.",null,null,null,null,null,null,null,null,null,null,null,null,null,null,"1 = Tidak lancar"]
["2.  Ekspresi dan gaya baik tapi masih ragu-ragu."]
["1.  Ekspresi dan gaya kaku.",null,null,null,null,null,null,null,null,null,null,null,null,"Pengucapan (pronunciation)",null,"3 = Baik"]
[null,null,null,null,null,null,null,null,null,null,null,null,null,null,null,"2 = Kurang baik"]
["Harmoni",null,null,null,null,null,null,null,null,null,null,null,null,null,null,"1 = Tidak baik"]
["3.  Vokal dan musik seimbang dan harmonis."]
["2.  Vokal dan musik kadang-kadang tidak senada.",null,null,null,null,null,null,null,null,null,null,null,null,"Intonasi (Intonation)",null,"3 = Sesuai"]
["1.  Vokal dan musik tidak seimbang.",null,null,null,null,null,null,null,null,null,null,null,null,null,null,"2 = Kurang sesuai"]
[null,null,null,null,null,null,null,null,null,null,null,null,null,null,null,"1 = Tidak sesuai"]
["Teknik Vokal"]
["3.  Suara yang keluar sempurna, bagus dan jernih. Pernapasan baik menggunakan diafragma.",null,null,null,null,null,null,null,null,null,null,null,null,"Pilihan kata (Diction)",null,"3 = Tepat"]
["2.  Suara yang keluar dan pernapasan masih ragu-ragu.",null,null,null,null,null,null,null,null,null,null,null,null,null,null,"2 = Kurang tepat"]
["1.  Suara yang keluar dan pernapasan tidak sempurna. ",null,null,null,null,null,null,null,null,null,null,null,null,null,null,"1 = Tidak tepat"]
[]
[]
[]
["LEMBAR PENILAIAN PRAKTIK (Biologi)",null,null,null,null,null,null,null,null,null,null,null,null,"LEMBAR PENILAIAN PRAKTIK (Kimia)"]
[]
["No.","Nama Siswa","Percobaan 1",null,null,null,"Percobaan 2",null,null,null,"Jumlah\nSkor","Nilai",null,"NO","Nama Siswa","Perolehan skor",null,null,null,null,"Jml Skor","Nilai"]
[null,null,1,2,3,4,1,2,3,4,null,null,null,null,null,"Rancangan\nPercobaan","Kelengkapan \nLaporan","Cara Kerja","Anaisis Data","Kesimpulan "]
[1,null,null,null,null,null,null,null,null,null,null,null,null,1]
[2,null,null,null,null,null,null,null,null,null,null,null,null,2]
[3,null,null,null,null,null,null,null,null,null,null,null,null,3]
[]
["Kriteria Penilaian",null,null,null,null,null,null,null,null,null,null,null,null,"Kriteria Penilaian"]
["1 = Kurang, Tidak melakukan percobaan ",null,null,null,null,null,null,null,null,null,null,null,null,"1 =","Kurang"]
["2 = Cukup, Melakukan percobaan dengan prosedur yang salah dan hasil yang salah",null,null,null,null,null,null,null,null,null,null,null,null,"2 =","Cukup"]
["3 = Baik, Melakukan percobaan dengan prosedur yang benar dan hasil yang salah",null,null,null,null,null,null,null,null,null,null,null,null,"3 =","Baik"]
["4 = Baik Sekali, Melakukan percobaan dengan prosedur yang benar dan hasil yang benar",null,null,null,null,null,null,null,null,null,null,null,null,"4 =","Baik Sekali"]
[]
[]
[]
["LEMBAR PENILAIAN PRAKTIK PRESENTASI"]
["No.","Penilaian",null,null,null,null,"Bobot","Skor Penilaian",null,null,null,"Nilai"]
[null,null,null,null,null,null,null,"(0 – 100)"]
[null,null,null,null,null,null,"(B)","Skor (S)",null,"B x S"]
[null,"ASPEK PENAMPILAN",null,null,null,null,10]
["1.","Kerapian",null,null,null,null,5]
["2.","Keserasian",null,null,null,null,5]
[null,"ASPEK MATERI PRESENTASI",null,null,null,null,25]
["3.","Substansi materi",null,null,null,null,10]
["4.","Tampilan Presentasi",null,null,null,null,8]
["5.","Data Pendukung",null,null,null,null,7]
[null,"ASPEK PENYAMPAIAN PRESENTASI",null,null,null,null,25]
["6.","Penguasaan materi",null,null,null,null,12]
["7.","Alur Presentasi",null,null,null,null,8]
["8.","Gaya Presentasi",null,null,null,null,5]
[null,"ASPEK INTERAKSI",null,null,null,null,20]
["9.","Cara menghadapi audiens",null,null,null,null,10]
["10.","Cara menjawab pertanyaan",null,null,null,null,10]
[null,"ASPEK KEMAMPUAN BAHASA",null,null,null,null,10]
["11.","Intonasi, asksentuasi",null,null,null,null,5]
["12.","Perbendaharaan Kata",null,null,null,null,5]
["TOTAL SKOR"]

{"sheet":"PRO","index":13,"n_rows":0,"n_cols":0,"rows_kept":0,"cut":false,"hidden":false,"merged":[]}

{"sheet":"POR","index":14,"n_rows":0,"n_cols":0,"rows_kept":0,"cut":false,"hidden":false,"merged":[]}

{"sheet":"REK","index":15,"n_rows":49,"n_cols":12,"rows_kept":49,"cut":false,"hidden":false,"merged":[[48,1,48,3],[8,4,8,6],[0,1,0,2],[2,4,2,6],[3,4,3,6],[4,4,4,6],[5,4,5,6],[6,4,6,6],[0,3,0,8],[5,7,5,8],[6,7,6,8],[2,1,2,3],[3,1,3,3],[4,1,4,3],[5,1,5,3],[6,1,6,3],[2,10,6,11],[8,7,8,9],[8,10,8,11],[8,1,9,1],[8,2,9,2],[8,3,9,3],[2,7,2,8],[3,7,3,8],[4,7,4,8]]}
[null,null,null,"** REKAP NILAI CAPAIAN KOMPETENSI **\nKURIKULUM SMA 2013",null,null,null,null,null,{"$f":"CONCATENATE(TEXT(TODAY(),\"dddd\"),\", \",TEXT(TODAY(),\"dd mmmm yyyy\"),\"\nWaktu : \",TEXT(NOW(),\"HH:MM:SS\"))","v":"Wednesday, 08 July 2020\nWaktu : 19:12:56"},"Versi : \n2013.003",{"$f":"CONCATENATE(\"Copyright 2013 by :\n \",IDT!V4)","v":"Copyright 2013 by :\n SMP NEGERI 1 KALIWIRO"}]
[]
[null,"Mata Pelajaran ",null,null,{"$f":"IF(CEK<>\"Siap Diisi\",\"\",ABS!F4)","v":""},null,null,"Kelas",null,{"$f":"IF(CEK<>\"Siap Diisi\",\"\",ABS!AC4)","v":""},{"$f":"IF(ABS!O7=\"Nama File Belum Sama\",\"Cek di Input Presensi\",\"Siap Diisi\")","v":"Cek di Input Presensi"}]
[null,"Nama Guru Mapel",null,null,{"$f":"IF(CEK<>\"Siap Diisi\",\"\",ABS!F6)","v":""},null,null,"Semester",null,{"$f":"IF(CEK<>\"Siap Diisi\",\"\",ABS!K5)","v":""}]
[null,{"$f":"IFERROR(VLOOKUP(ABS!$W$6,DATAGURU,3,FALSE),\"\")","v":"NIP"},null,null,{"$f":"IF(CEK<>\"Siap Diisi\",\"\",IFERROR(VLOOKUP(ABS!$W$6,DATAGURU,4,FALSE),\"\"))","v":""},null,null,"Tahun Pelajaran",null,{"$f":"IF(CEK<>\"Siap Diisi\",\"\",ABS!F5)","v":""}]
[null,"Nama Kepala Sekolah",null,null,{"$f":"IF(CEK<>\"Siap Diisi\",\"\",IDT!F3)","v":""},null,null,"Wali Kelas",null,{"$f":"IF(CEK<>\"Siap Diisi\",\"\",IF(CEK<>\"Siap Diisi\",\"\",VLOOKUP((VLOOKUP(J3,KODEWALI,3,FALSE)),DATAGURU,2,FALSE)))","v":""}]
[null,{"$f":"CONCATENATE(VLOOKUP(\"AA\",DATAGURU,3,FALSE),\" Kepala Sekolah\")","v":{"$error":"#N/A"}},null,null,{"$f":"IF(CEK<>\"Siap Diisi\",\"\",IDT!H3)","v":""},null,null,"Nilai KKM",null,{"$f":"IF(CEK<>\"Siap Diisi\",\"\",CONCATENATE(Rerata_KKM,\"    atau    \",IDT!V9))","v":""}]
[]
[null,"NO","NIS","NAMA","Pengetahuan (KI-3)",null,null,"Ketrampilan (KI-4)",null,null,"Sikap Spiritual dan Sosial (KI-1 dan KI-2)"]
[null,null,null,null,"Angka","Predikat","Deskripsi","Angka","Predikat","Deskripsi","Predikat","Deskripsi"]
[null,{"$f":"IF(ABS!B15=\"\",\"\",ABS!B15)","v":1},{"$f":"IF(ABS!C15=\"\",\"\",ABS!C15)","v":12419},{"$f":"IF(ABS!D15=\"\",\"\",PROPER(ABS!D15))","v":"Adhitya Ferdi Kristianto"},{"$f":"IF(CEK<>\"Siap Diisi\",\"\",IF(KOG!AV7=\"\",\"\",KOG!AV7))","v":""},{"$f":"IF(CEK<>\"Siap Diisi\",\"\",IF(KOG!AW7=\"\",\"\",KOG!AW7))","v":""},{"$f":"IF(CEK<>\"Siap Diisi\",\"\",IF(KOG!AX7=\"\",\"\",KOG!AX7))","v":""},{"$f":"IF(CEK<>\"Siap Diisi\",\"\",IF(PSI!Q5=\"\",\"\",PSI!Q5))","v":""},{"$f":"IF(CEK<>\"Siap Diisi\",\"\",IF(PSI!R5=\"\",\"\",PSI!R5))","v":""},{"$f":"IF(CEK<>\"Siap Diisi\",\"\",IF(PSI!S5=\"\",\"\",PSI!S5))","v":""},{"$f":"IF(CEK<>\"Siap Diisi\",\"\",IF(AFE!U5=\"\",\"\",AFE!U5))","v":""},{"$f":"IF(CEK<>\"Siap Diisi\",\"\",IF(AFE!V5=\"\",\"\",AFE!V5))","v":""}]
[null,{"$f":"IF(ABS!B16=\"\",\"\",ABS!B16)","v":2},{"$f":"IF(ABS!C16=\"\",\"\",ABS!C16)","v":12428},{"$f":"IF(ABS!D16=\"\",\"\",PROPER(ABS!D16))","v":"Agung Dwi Saputro"},{"$f":"IF(CEK<>\"Siap Diisi\",\"\",IF(KOG!AV8=\"\",\"\",KOG!AV8))","v":""},{"$f":"IF(CEK<>\"Siap Diisi\",\"\",IF(KOG!AW8=\"\",\"\",KOG!AW8))","v":""},{"$f":"IF(CEK<>\"Siap Diisi\",\"\",IF(KOG!AX8=\"\",\"\",KOG!AX8))","v":""},{"$f":"IF(CEK<>\"Siap Diisi\",\"\",IF(PSI!Q6=\"\",\"\",PSI!Q6))","v":""},{"$f":"IF(CEK<>\"Siap Diisi\",\"\",IF(PSI!R6=\"\",\"\",PSI!R6))","v":""},{"$f":"IF(CEK<>\"Siap Diisi\",\"\",IF(PSI!S6=\"\",\"\",PSI!S6))","v":""},{"$f":"IF(CEK<>\"Siap Diisi\",\"\",IF(AFE!U6=\"\",\"\",AFE!U6))","v":""},{"$f":"IF(CEK<>\"Siap Diisi\",\"\",IF(AFE!V6=\"\",\"\",AFE!V6))","v":""}]
[null,{"$f":"IF(ABS!B17=\"\",\"\",ABS!B17)","v":3},{"$f":"IF(ABS!C17=\"\",\"\",ABS!C17)","v":12453},{"$f":"IF(ABS!D17=\"\",\"\",PROPER(ABS!D17))","v":"Anissa Dhea Paramitha"},{"$f":"IF(CEK<>\"Siap Diisi\",\"\",IF(KOG!AV9=\"\",\"\",KOG!AV9))","v":""},{"$f":"IF(CEK<>\"Siap Diisi\",\"\",IF(KOG!AW9=\"\",\"\",KOG!AW9))","v":""},{"$f":"IF(CEK<>\"Siap Diisi\",\"\",IF(KOG!AX9=\"\",\"\",KOG!AX9))","v":""},{"$f":"IF(CEK<>\"Siap Diisi\",\"\",IF(PSI!Q7=\"\",\"\",PSI!Q7))","v":""},{"$f":"IF(CEK<>\"Siap Diisi\",\"\",IF(PSI!R7=\"\",\"\",PSI!R7))","v":""},{"$f":"IF(CEK<>\"Siap Diisi\",\"\",IF(PSI!S7=\"\",\"\",PSI!S7))","v":""},{"$f":"IF(CEK<>\"Siap Diisi\",\"\",IF(AFE!U7=\"\",\"\",AFE!U7))","v":""},{"$f":"IF(CEK<>\"Siap Diisi\",\"\",IF(AFE!V7=\"\",\"\",AFE!V7))","v":""}]
[null,{"$f":"IF(ABS!B18=\"\",\"\",ABS!B18)","v":4},{"$f":"IF(ABS!C18=\"\",\"\",ABS!C18)","v":12455},{"$f":"IF(ABS!D18=\"\",\"\",PROPER(ABS!D18))","v":"Aprilia Desi Laraswati"},{"$f":"IF(CEK<>\"Siap Diisi\",\"\",IF(KOG!AV10=\"\",\"\",KOG!AV10))","v":""},{"$f":"IF(CEK<>\"Siap Diisi\",\"\",IF(KOG!AW10=\"\",\"\",KOG!AW10))","v":""},{"$f":"IF(CEK<>\"Siap Diisi\",\"\",IF(KOG!AX10=\"\",\"\",KOG!AX10))","v":""},{"$f":"IF(CEK<>\"Siap Diisi\",\"\",IF(PSI!Q8=\"\",\"\",PSI!Q8))","v":""},{"$f":"IF(CEK<>\"Siap Diisi\",\"\",IF(PSI!R8=\"\",\"\",PSI!R8))","v":""},{"$f":"IF(CEK<>\"Siap Diisi\",\"\",IF(PSI!S8=\"\",\"\",PSI!S8))","v":""},{"$f":"IF(CEK<>\"Siap Diisi\",\"\",IF(AFE!U8=\"\",\"\",AFE!U8))","v":""},{"$f":"IF(CEK<>\"Siap Diisi\",\"\",IF(AFE!V8=\"\",\"\",AFE!V8))","v":""}]
[null,{"$f":"IF(ABS!B19=\"\",\"\",ABS!B19)","v":5},{"$f":"IF(ABS!C19=\"\",\"\",ABS!C19)","v":12479},{"$f":"IF(ABS!D19=\"\",\"\",PROPER(ABS!D19))","v":"Bagas Adifirmansyah"},{"$f":"IF(CEK<>\"Siap Diisi\",\"\",IF(KOG!AV11=\"\",\"\",KOG!AV11))","v":""},{"$f":"IF(CEK<>\"Siap Diisi\",\"\",IF(KOG!AW11=\"\",\"\",KOG!AW11))","v":""},{"$f":"IF(CEK<>\"Siap Diisi\",\"\",IF(KOG!AX11=\"\",\"\",KOG!AX11))","v":""},{"$f":"IF(CEK<>\"Siap Diisi\",\"\",IF(PSI!Q9=\"\",\"\",PSI!Q9))","v":""},{"$f":"IF(CEK<>\"Siap Diisi\",\"\",IF(PSI!R9=\"\",\"\",PSI!R9))","v":""},{"$f":"IF(CEK<>\"Siap Diisi\",\"\",IF(PSI!S9=\"\",\"\",PSI!S9))","v":""},{"$f":"IF(CEK<>\"Siap Diisi\",\"\",IF(AFE!U9=\"\",\"\",AFE!U9))","v":""},{"$f":"IF(CEK<>\"Siap Diisi\",\"\",IF(AFE!V9=\"\",\"\",AFE!V9))","v":""}]
[null,{"$f":"IF(ABS!B20=\"\",\"\",ABS!B20)","v":6},{"$f":"IF(ABS!C20=\"\",\"\",ABS!C20)","v":12498},{"$f":"IF(ABS!D20=\"\",\"\",PROPER(ABS!D20))","v":"Dela Shabrina"},{"$f":"IF(CEK<>\"Siap Diisi\",\"\",IF(KOG!AV12=\"\",\"\",KOG!AV12))","v":""},{"$f":"IF(CEK<>\"Siap Diisi\",\"\",IF(KOG!AW12=\"\",\"\",KOG!AW12))","v":""},{"$f":"IF(CEK<>\"Siap Diisi\",\"\",IF(KOG!AX12=\"\",\"\",KOG!AX12))","v":""},{"$f":"IF(CEK<>\"Siap Diisi\",\"\",IF(PSI!Q10=\"\",\"\",PSI!Q10))","v":""},{"$f":"IF(CEK<>\"Siap Diisi\",\"\",IF(PSI!R10=\"\",\"\",PSI!R10))","v":""},{"$f":"IF(CEK<>\"Siap Diisi\",\"\",IF(PSI!S10=\"\",\"\",PSI!S10))","v":""},{"$f":"IF(CEK<>\"Siap Diisi\",\"\",IF(AFE!U10=\"\",\"\",AFE!U10))","v":""},{"$f":"IF(CEK<>\"Siap Diisi\",\"\",IF(AFE!V10=\"\",\"\",AFE!V10))","v":""}]
[null,{"$f":"IF(ABS!B21=\"\",\"\",ABS!B21)","v":7},{"$f":"IF(ABS!C21=\"\",\"\",ABS!C21)","v":12501},{"$f":"IF(ABS!D21=\"\",\"\",PROPER(ABS!D21))","v":"Desti Rani Indriyani"},{"$f":"IF(CEK<>\"Siap Diisi\",\"\",IF(KOG!AV13=\"\",\"\",KOG!AV13))","v":""},{"$f":"IF(CEK<>\"Siap Diisi\",\"\",IF(KOG!AW13=\"\",\"\",KOG!AW13))","v":""},{"$f":"IF(CEK<>\"Siap Diisi\",\"\",IF(KOG!AX13=\"\",\"\",KOG!AX13))","v":""},{"$f":"IF(CEK<>\"Siap Diisi\",\"\",IF(PSI!Q11=\"\",\"\",PSI!Q11))","v":""},{"$f":"IF(CEK<>\"Siap Diisi\",\"\",IF(PSI!R11=\"\",\"\",PSI!R11))","v":""},{"$f":"IF(CEK<>\"Siap Diisi\",\"\",IF(PSI!S11=\"\",\"\",PSI!S11))","v":""},{"$f":"IF(CEK<>\"Siap Diisi\",\"\",IF(AFE!U11=\"\",\"\",AFE!U11))","v":""},{"$f":"IF(CEK<>\"Siap Diisi\",\"\",IF(AFE!V11=\"\",\"\",AFE!V11))","v":""}]
[null,{"$f":"IF(ABS!B22=\"\",\"\",ABS!B22)","v":8},{"$f":"IF(ABS!C22=\"\",\"\",ABS!C22)","v":12508},{"$f":"IF(ABS!D22=\"\",\"\",PROPER(ABS!D22))","v":"Dewi Suciati Fauzun"},{"$f":"IF(CEK<>\"Siap Diisi\",\"\",IF(KOG!AV14=\"\",\"\",KOG!AV14))","v":""},{"$f":"IF(CEK<>\"Siap Diisi\",\"\",IF(KOG!AW14=\"\",\"\",KOG!AW14))","v":""},{"$f":"IF(CEK<>\"Siap Diisi\",\"\",IF(KOG!AX14=\"\",\"\",KOG!AX14))","v":""},{"$f":"IF(CEK<>\"Siap Diisi\",\"\",IF(PSI!Q12=\"\",\"\",PSI!Q12))","v":""},{"$f":"IF(CEK<>\"Siap Diisi\",\"\",IF(PSI!R12=\"\",\"\",PSI!R12))","v":""},{"$f":"IF(CEK<>\"Siap Diisi\",\"\",IF(PSI!S12=\"\",\"\",PSI!S12))","v":""},{"$f":"IF(CEK<>\"Siap Diisi\",\"\",IF(AFE!U12=\"\",\"\",AFE!U12))","v":""},{"$f":"IF(CEK<>\"Siap Diisi\",\"\",IF(AFE!V12=\"\",\"\",AFE!V12))","v":""}]
[null,{"$f":"IF(ABS!B23=\"\",\"\",ABS!B23)","v":9},{"$f":"IF(ABS!C23=\"\",\"\",ABS!C23)","v":12516},{"$f":"IF(ABS!D23=\"\",\"\",PROPER(ABS!D23))","v":"Dimas Nusantara Adi"},{"$f":"IF(CEK<>\"Siap Diisi\",\"\",IF(KOG!AV15=\"\",\"\",KOG!AV15))","v":""},{"$f":"IF(CEK<>\"Siap Diisi\",\"\",IF(KOG!AW15=\"\",\"\",KOG!AW15))","v":""},{"$f":"IF(CEK<>\"Siap Diisi\",\"\",IF(KOG!AX15=\"\",\"\",KOG!AX15))","v":""},{"$f":"IF(CEK<>\"Siap Diisi\",\"\",IF(PSI!Q13=\"\",\"\",PSI!Q13))","v":""},{"$f":"IF(CEK<>\"Siap Diisi\",\"\",IF(PSI!R13=\"\",\"\",PSI!R13))","v":""},{"$f":"IF(CEK<>\"Siap Diisi\",\"\",IF(PSI!S13=\"\",\"\",PSI!S13))","v":""},{"$f":"IF(CEK<>\"Siap Diisi\",\"\",IF(AFE!U13=\"\",\"\",AFE!U13))","v":""},{"$f":"IF(CEK<>\"Siap Diisi\",\"\",IF(AFE!V13=\"\",\"\",AFE!V13))","v":""}]
[null,{"$f":"IF(ABS!B24=\"\",\"\",ABS!B24)","v":10},{"$f":"IF(ABS!C24=\"\",\"\",ABS!C24)","v":12529},{"$f":"IF(ABS!D24=\"\",\"\",PROPER(ABS!D24))","v":"Edo Wanda Prastyo"},{"$f":"IF(CEK<>\"Siap Diisi\",\"\",IF(KOG!AV16=\"\",\"\",KOG!AV16))","v":""},{"$f":"IF(CEK<>\"Siap Diisi\",\"\",IF(KOG!AW16=\"\",\"\",KOG!AW16))","v":""},{"$f":"IF(CEK<>\"Siap Diisi\",\"\",IF(KOG!AX16=\"\",\"\",KOG!AX16))","v":""},{"$f":"IF(CEK<>\"Siap Diisi\",\"\",IF(PSI!Q14=\"\",\"\",PSI!Q14))","v":""},{"$f":"IF(CEK<>\"Siap Diisi\",\"\",IF(PSI!R14=\"\",\"\",PSI!R14))","v":""},{"$f":"IF(CEK<>\"Siap Diisi\",\"\",IF(PSI!S14=\"\",\"\",PSI!S14))","v":""},{"$f":"IF(CEK<>\"Siap Diisi\",\"\",IF(AFE!U14=\"\",\"\",AFE!U14))","v":""},{"$f":"IF(CEK<>\"Siap Diisi\",\"\",IF(AFE!V14=\"\",\"\",AFE!V14))","v":""}]
[null,{"$f":"IF(ABS!B25=\"\",\"\",ABS!B25)","v":11},{"$f":"IF(ABS!C25=\"\",\"\",ABS!C25)","v":12537},{"$f":"IF(ABS!D25=\"\",\"\",PROPER(ABS!D25))","v":"Entin Taat Arumningtias"},{"$f":"IF(CEK<>\"Siap Diisi\",\"\",IF(KOG!AV17=\"\",\"\",KOG!AV17))","v":""},{"$f":"IF(CEK<>\"Siap Diisi\",\"\",IF(KOG!AW17=\"\",\"\",KOG!AW17))","v":""},{"$f":"IF(CEK<>\"Siap Diisi\",\"\",IF(KOG!AX17=\"\",\"\",KOG!AX17))","v":""},{"$f":"IF(CEK<>\"Siap Diisi\",\"\",IF(PSI!Q15=\"\",\"\",PSI!Q15))","v":""},{"$f":"IF(CEK<>\"Siap Diisi\",\"\",IF(PSI!R15=\"\",\"\",PSI!R15))","v":""},{"$f":"IF(CEK<>\"Siap Diisi\",\"\",IF(PSI!S15=\"\",\"\",PSI!S15))","v":""},{"$f":"IF(CEK<>\"Siap Diisi\",\"\",IF(AFE!U15=\"\",\"\",AFE!U15))","v":""},{"$f":"IF(CEK<>\"Siap Diisi\",\"\",IF(AFE!V15=\"\",\"\",AFE!V15))","v":""}]
[null,{"$f":"IF(ABS!B26=\"\",\"\",ABS!B26)","v":12},{"$f":"IF(ABS!C26=\"\",\"\",ABS!C26)","v":12544},{"$f":"IF(ABS!D26=\"\",\"\",PROPER(ABS!D26))","v":"Fajar Adi Pamungkas"},{"$f":"IF(CEK<>\"Siap Diisi\",\"\",IF(KOG!AV18=\"\",\"\",KOG!AV18))","v":""},{"$f":"IF(CEK<>\"Siap Diisi\",\"\",IF(KOG!AW18=\"\",\"\",KOG!AW18))","v":""},{"$f":"IF(CEK<>\"Siap Diisi\",\"\",IF(KOG!AX18=\"\",\"\",KOG!AX18))","v":""},{"$f":"IF(CEK<>\"Siap Diisi\",\"\",IF(PSI!Q16=\"\",\"\",PSI!Q16))","v":""},{"$f":"IF(CEK<>\"Siap Diisi\",\"\",IF(PSI!R16=\"\",\"\",PSI!R16))","v":""},{"$f":"IF(CEK<>\"Siap Diisi\",\"\",IF(PSI!S16=\"\",\"\",PSI!S16))","v":""},{"$f":"IF(CEK<>\"Siap Diisi\",\"\",IF(AFE!U16=\"\",\"\",AFE!U16))","v":""},{"$f":"IF(CEK<>\"Siap Diisi\",\"\",IF(AFE!V16=\"\",\"\",AFE!V16))","v":""}]
[null,{"$f":"IF(ABS!B27=\"\",\"\",ABS!B27)","v":13},{"$f":"IF(ABS!C27=\"\",\"\",ABS!C27)","v":12796},{"$f":"IF(ABS!D27=\"\",\"\",PROPER(ABS!D27))","v":"Frendy Lasmana Putra"},{"$f":"IF(CEK<>\"Siap Diisi\",\"\",IF(KOG!AV19=\"\",\"\",KOG!AV19))","v":""},{"$f":"IF(CEK<>\"Siap Diisi\",\"\",IF(KOG!AW19=\"\",\"\",KOG!AW19))","v":""},{"$f":"IF(CEK<>\"Siap Diisi\",\"\",IF(KOG!AX19=\"\",\"\",KOG!AX19))","v":""},{"$f":"IF(CEK<>\"Siap Diisi\",\"\",IF(PSI!Q17=\"\",\"\",PSI!Q17))","v":""},{"$f":"IF(CEK<>\"Siap Diisi\",\"\",IF(PSI!R17=\"\",\"\",PSI!R17))","v":""},{"$f":"IF(CEK<>\"Siap Diisi\",\"\",IF(PSI!S17=\"\",\"\",PSI!S17))","v":""},{"$f":"IF(CEK<>\"Siap Diisi\",\"\",IF(AFE!U17=\"\",\"\",AFE!U17))","v":""},{"$f":"IF(CEK<>\"Siap Diisi\",\"\",IF(AFE!V17=\"\",\"\",AFE!V17))","v":""}]
[null,{"$f":"IF(ABS!B28=\"\",\"\",ABS!B28)","v":14},{"$f":"IF(ABS!C28=\"\",\"\",ABS!C28)","v":12204},{"$f":"IF(ABS!D28=\"\",\"\",PROPER(ABS!D28))","v":"Gana Ridho Akbar"},{"$f":"IF(CEK<>\"Siap Diisi\",\"\",IF(KOG!AV20=\"\",\"\",KOG!AV20))","v":""},{"$f":"IF(CEK<>\"Siap Diisi\",\"\",IF(KOG!AW20=\"\",\"\",KOG!AW20))","v":""},{"$f":"IF(CEK<>\"Siap Diisi\",\"\",IF(KOG!AX20=\"\",\"\",KOG!AX20))","v":""},{"$f":"IF(CEK<>\"Siap Diisi\",\"\",IF(PSI!Q18=\"\",\"\",PSI!Q18))","v":""},{"$f":"IF(CEK<>\"Siap Diisi\",\"\",IF(PSI!R18=\"\",\"\",PSI!R18))","v":""},{"$f":"IF(CEK<>\"Siap Diisi\",\"\",IF(PSI!S18=\"\",\"\",PSI!S18))","v":""},{"$f":"IF(CEK<>\"Siap Diisi\",\"\",IF(AFE!U18=\"\",\"\",AFE!U18))","v":""},{"$f":"IF(CEK<>\"Siap Diisi\",\"\",IF(AFE!V18=\"\",\"\",AFE!V18))","v":""}]
[null,{"$f":"IF(ABS!B29=\"\",\"\",ABS!B29)","v":15},{"$f":"IF(ABS!C29=\"\",\"\",ABS!C29)","v":12588},{"$f":"IF(ABS!D29=\"\",\"\",PROPER(ABS!D29))","v":"Indra Cahya Permana"},{"$f":"IF(CEK<>\"Siap Diisi\",\"\",IF(KOG!AV21=\"\",\"\",KOG!AV21))","v":""},{"$f":"IF(CEK<>\"Siap Diisi\",\"\",IF(KOG!AW21=\"\",\"\",KOG!AW21))","v":""},{"$f":"IF(CEK<>\"Siap Diisi\",\"\",IF(KOG!AX21=\"\",\"\",KOG!AX21))","v":""},{"$f":"IF(CEK<>\"Siap Diisi\",\"\",IF(PSI!Q19=\"\",\"\",PSI!Q19))","v":""},{"$f":"IF(CEK<>\"Siap Diisi\",\"\",IF(PSI!R19=\"\",\"\",PSI!R19))","v":""},{"$f":"IF(CEK<>\"Siap Diisi\",\"\",IF(PSI!S19=\"\",\"\",PSI!S19))","v":""},{"$f":"IF(CEK<>\"Siap Diisi\",\"\",IF(AFE!U19=\"\",\"\",AFE!U19))","v":""},{"$f":"IF(CEK<>\"Siap Diisi\",\"\",IF(AFE!V19=\"\",\"\",AFE!V19))","v":""}]
[null,{"$f":"IF(ABS!B30=\"\",\"\",ABS!B30)","v":16},{"$f":"IF(ABS!C30=\"\",\"\",ABS!C30)","v":12598},{"$f":"IF(ABS!D30=\"\",\"\",PROPER(ABS!D30))","v":"Ismia Nivrendita"},{"$f":"IF(CEK<>\"Siap Diisi\",\"\",IF(KOG!AV22=\"\",\"\",KOG!AV22))","v":""},{"$f":"IF(CEK<>\"Siap Diisi\",\"\",IF(KOG!AW22=\"\",\"\",KOG!AW22))","v":""},{"$f":"IF(CEK<>\"Siap Diisi\",\"\",IF(KOG!AX22=\"\",\"\",KOG!AX22))","v":""},{"$f":"IF(CEK<>\"Siap Diisi\",\"\",IF(PSI!Q20=\"\",\"\",PSI!Q20))","v":""},{"$f":"IF(CEK<>\"Siap Diisi\",\"\",IF(PSI!R20=\"\",\"\",PSI!R20))","v":""},{"$f":"IF(CEK<>\"Siap Diisi\",\"\",IF(PSI!S20=\"\",\"\",PSI!S20))","v":""},{"$f":"IF(CEK<>\"Siap Diisi\",\"\",IF(AFE!U20=\"\",\"\",AFE!U20))","v":""},{"$f":"IF(CEK<>\"Siap Diisi\",\"\",IF(AFE!V20=\"\",\"\",AFE!V20))","v":""}]
[null,{"$f":"IF(ABS!B31=\"\",\"\",ABS!B31)","v":17},{"$f":"IF(ABS!C31=\"\",\"\",ABS!C31)","v":12606},{"$f":"IF(ABS!D31=\"\",\"\",PROPER(ABS!D31))","v":"Krista Ikawan"},{"$f":"IF(CEK<>\"Siap Diisi\",\"\",IF(KOG!AV23=\"\",\"\",KOG!AV23))","v":""},{"$f":"IF(CEK<>\"Siap Diisi\",\"\",IF(KOG!AW23=\"\",\"\",KOG!AW23))","v":""},{"$f":"IF(CEK<>\"Siap Diisi\",\"\",IF(KOG!AX23=\"\",\"\",KOG!AX23))","v":""},{"$f":"IF(CEK<>\"Siap Diisi\",\"\",IF(PSI!Q21=\"\",\"\",PSI!Q21))","v":""},{"$f":"IF(CEK<>\"Siap Diisi\",\"\",IF(PSI!R21=\"\",\"\",PSI!R21))","v":""},{"$f":"IF(CEK<>\"Siap Diisi\",\"\",IF(PSI!S21=\"\",\"\",PSI!S21))","v":""},{"$f":"IF(CEK<>\"Siap Diisi\",\"\",IF(AFE!U21=\"\",\"\",AFE!U21))","v":""},{"$f":"IF(CEK<>\"Siap Diisi\",\"\",IF(AFE!V21=\"\",\"\",AFE!V21))","v":""}]
[null,{"$f":"IF(ABS!B32=\"\",\"\",ABS!B32)","v":18},{"$f":"IF(ABS!C32=\"\",\"\",ABS!C32)","v":12612},{"$f":"IF(ABS!D32=\"\",\"\",PROPER(ABS!D32))","v":"Lestari"},{"$f":"IF(CEK<>\"Siap Diisi\",\"\",IF(KOG!AV24=\"\",\"\",KOG!AV24))","v":""},{"$f":"IF(CEK<>\"Siap Diisi\",\"\",IF(KOG!AW24=\"\",\"\",KOG!AW24))","v":""},{"$f":"IF(CEK<>\"Siap Diisi\",\"\",IF(KOG!AX24=\"\",\"\",KOG!AX24))","v":""},{"$f":"IF(CEK<>\"Siap Diisi\",\"\",IF(PSI!Q22=\"\",\"\",PSI!Q22))","v":""},{"$f":"IF(CEK<>\"Siap Diisi\",\"\",IF(PSI!R22=\"\",\"\",PSI!R22))","v":""},{"$f":"IF(CEK<>\"Siap Diisi\",\"\",IF(PSI!S22=\"\",\"\",PSI!S22))","v":""},{"$f":"IF(CEK<>\"Siap Diisi\",\"\",IF(AFE!U22=\"\",\"\",AFE!U22))","v":""},{"$f":"IF(CEK<>\"Siap Diisi\",\"\",IF(AFE!V22=\"\",\"\",AFE!V22))","v":""}]
[null,{"$f":"IF(ABS!B33=\"\",\"\",ABS!B33)","v":19},{"$f":"IF(ABS!C33=\"\",\"\",ABS!C33)","v":12628},{"$f":"IF(ABS!D33=\"\",\"\",PROPER(ABS!D33))","v":"Miasari Sholaiha"},{"$f":"IF(CEK<>\"Siap Diisi\",\"\",IF(KOG!AV25=\"\",\"\",KOG!AV25))","v":""},{"$f":"IF(CEK<>\"Siap Diisi\",\"\",IF(KOG!AW25=\"\",\"\",KOG!AW25))","v":""},{"$f":"IF(CEK<>\"Siap Diisi\",\"\",IF(KOG!AX25=\"\",\"\",KOG!AX25))","v":""},{"$f":"IF(CEK<>\"Siap Diisi\",\"\",IF(PSI!Q23=\"\",\"\",PSI!Q23))","v":""},{"$f":"IF(CEK<>\"Siap Diisi\",\"\",IF(PSI!R23=\"\",\"\",PSI!R23))","v":""},{"$f":"IF(CEK<>\"Siap Diisi\",\"\",IF(PSI!S23=\"\",\"\",PSI!S23))","v":""},{"$f":"IF(CEK<>\"Siap Diisi\",\"\",IF(AFE!U23=\"\",\"\",AFE!U23))","v":""},{"$f":"IF(CEK<>\"Siap Diisi\",\"\",IF(AFE!V23=\"\",\"\",AFE!V23))","v":""}]
[null,{"$f":"IF(ABS!B34=\"\",\"\",ABS!B34)","v":20},{"$f":"IF(ABS!C34=\"\",\"\",ABS!C34)","v":12629},{"$f":"IF(ABS!D34=\"\",\"\",PROPER(ABS!D34))","v":"Modis Iyonda"},{"$f":"IF(CEK<>\"Siap Diisi\",\"\",IF(KOG!AV26=\"\",\"\",KOG!AV26))","v":""},{"$f":"IF(CEK<>\"Siap Diisi\",\"\",IF(KOG!AW26=\"\",\"\",KOG!AW26))","v":""},{"$f":"IF(CEK<>\"Siap Diisi\",\"\",IF(KOG!AX26=\"\",\"\",KOG!AX26))","v":""},{"$f":"IF(CEK<>\"Siap Diisi\",\"\",IF(PSI!Q24=\"\",\"\",PSI!Q24))","v":""},{"$f":"IF(CEK<>\"Siap Diisi\",\"\",IF(PSI!R24=\"\",\"\",PSI!R24))","v":""},{"$f":"IF(CEK<>\"Siap Diisi\",\"\",IF(PSI!S24=\"\",\"\",PSI!S24))","v":""},{"$f":"IF(CEK<>\"Siap Diisi\",\"\",IF(AFE!U24=\"\",\"\",AFE!U24))","v":""},{"$f":"IF(CEK<>\"Siap Diisi\",\"\",IF(AFE!V24=\"\",\"\",AFE!V24))","v":""}]
[null,{"$f":"IF(ABS!B35=\"\",\"\",ABS!B35)","v":21},{"$f":"IF(ABS!C35=\"\",\"\",ABS!C35)","v":12639},{"$f":"IF(ABS!D35=\"\",\"\",PROPER(ABS!D35))","v":"Muhammad Agni Farras"},{"$f":"IF(CEK<>\"Siap Diisi\",\"\",IF(KOG!AV27=\"\",\"\",KOG!AV27))","v":""},{"$f":"IF(CEK<>\"Siap Diisi\",\"\",IF(KOG!AW27=\"\",\"\",KOG!AW27))","v":""},{"$f":"IF(CEK<>\"Siap Diisi\",\"\",IF(KOG!AX27=\"\",\"\",KOG!AX27))","v":""},{"$f":"IF(CEK<>\"Siap Diisi\",\"\",IF(PSI!Q25=\"\",\"\",PSI!Q25))","v":""},{"$f":"IF(CEK<>\"Siap Diisi\",\"\",IF(PSI!R25=\"\",\"\",PSI!R25))","v":""},{"$f":"IF(CEK<>\"Siap Diisi\",\"\",IF(PSI!S25=\"\",\"\",PSI!S25))","v":""},{"$f":"IF(CEK<>\"Siap Diisi\",\"\",IF(AFE!U25=\"\",\"\",AFE!U25))","v":""},{"$f":"IF(CEK<>\"Siap Diisi\",\"\",IF(AFE!V25=\"\",\"\",AFE!V25))","v":""}]
[null,{"$f":"IF(ABS!B36=\"\",\"\",ABS!B36)","v":22},{"$f":"IF(ABS!C36=\"\",\"\",ABS!C36)","v":12673},{"$f":"IF(ABS!D36=\"\",\"\",PROPER(ABS!D36))","v":"Pratomo Setyo Aji"},{"$f":"IF(CEK<>\"Siap Diisi\",\"\",IF(KOG!AV28=\"\",\"\",KOG!AV28))","v":""},{"$f":"IF(CEK<>\"Siap Diisi\",\"\",IF(KOG!AW28=\"\",\"\",KOG!AW28))","v":""},{"$f":"IF(CEK<>\"Siap Diisi\",\"\",IF(KOG!AX28=\"\",\"\",KOG!AX28))","v":""},{"$f":"IF(CEK<>\"Siap Diisi\",\"\",IF(PSI!Q26=\"\",\"\",PSI!Q26))","v":""},{"$f":"IF(CEK<>\"Siap Diisi\",\"\",IF(PSI!R26=\"\",\"\",PSI!R26))","v":""},{"$f":"IF(CEK<>\"Siap Diisi\",\"\",IF(PSI!S26=\"\",\"\",PSI!S26))","v":""},{"$f":"IF(CEK<>\"Siap Diisi\",\"\",IF(AFE!U26=\"\",\"\",AFE!U26))","v":""},{"$f":"IF(CEK<>\"Siap Diisi\",\"\",IF(AFE!V26=\"\",\"\",AFE!V26))","v":""}]
[null,{"$f":"IF(ABS!B37=\"\",\"\",ABS!B37)","v":23},{"$f":"IF(ABS!C37=\"\",\"\",ABS!C37)","v":12674},{"$f":"IF(ABS!D37=\"\",\"\",PROPER(ABS!D37))","v":"Puji Lestari"},{"$f":"IF(CEK<>\"Siap Diisi\",\"\",IF(KOG!AV29=\"\",\"\",KOG!AV29))","v":""},{"$f":"IF(CEK<>\"Siap Diisi\",\"\",IF(KOG!AW29=\"\",\"\",KOG!AW29))","v":""},{"$f":"IF(CEK<>\"Siap Diisi\",\"\",IF(KOG!AX29=\"\",\"\",KOG!AX29))","v":""},{"$f":"IF(CEK<>\"Siap Diisi\",\"\",IF(PSI!Q27=\"\",\"\",PSI!Q27))","v":""},{"$f":"IF(CEK<>\"Siap Diisi\",\"\",IF(PSI!R27=\"\",\"\",PSI!R27))","v":""},{"$f":"IF(CEK<>\"Siap Diisi\",\"\",IF(PSI!S27=\"\",\"\",PSI!S27))","v":""},{"$f":"IF(CEK<>\"Siap Diisi\",\"\",IF(AFE!U27=\"\",\"\",AFE!U27))","v":""},{"$f":"IF(CEK<>\"Siap Diisi\",\"\",IF(AFE!V27=\"\",\"\",AFE!V27))","v":""}]
[null,{"$f":"IF(ABS!B38=\"\",\"\",ABS!B38)","v":24},{"$f":"IF(ABS!C38=\"\",\"\",ABS!C38)","v":12701},{"$f":"IF(ABS!D38=\"\",\"\",PROPER(ABS!D38))","v":"Rindra Alriyan"},{"$f":"IF(CEK<>\"Siap Diisi\",\"\",IF(KOG!AV30=\"\",\"\",KOG!AV30))","v":""},{"$f":"IF(CEK<>\"Siap Diisi\",\"\",IF(KOG!AW30=\"\",\"\",KOG!AW30))","v":""},{"$f":"IF(CEK<>\"Siap Diisi\",\"\",IF(KOG!AX30=\"\",\"\",KOG!AX30))","v":""},{"$f":"IF(CEK<>\"Siap Diisi\",\"\",IF(PSI!Q28=\"\",\"\",PSI!Q28))","v":""},{"$f":"IF(CEK<>\"Siap Diisi\",\"\",IF(PSI!R28=\"\",\"\",PSI!R28))","v":""},{"$f":"IF(CEK<>\"Siap Diisi\",\"\",IF(PSI!S28=\"\",\"\",PSI!S28))","v":""},{"$f":"IF(CEK<>\"Siap Diisi\",\"\",IF(AFE!U28=\"\",\"\",AFE!U28))","v":""},{"$f":"IF(CEK<>\"Siap Diisi\",\"\",IF(AFE!V28=\"\",\"\",AFE!V28))","v":""}]
[null,{"$f":"IF(ABS!B39=\"\",\"\",ABS!B39)","v":25},{"$f":"IF(ABS!C39=\"\",\"\",ABS!C39)","v":12729},{"$f":"IF(ABS!D39=\"\",\"\",PROPER(ABS!D39))","v":"Sinta Anggraeni"},{"$f":"IF(CEK<>\"Siap Diisi\",\"\",IF(KOG!AV31=\"\",\"\",KOG!AV31))","v":""},{"$f":"IF(CEK<>\"Siap Diisi\",\"\",IF(KOG!AW31=\"\",\"\",KOG!AW31))","v":""},{"$f":"IF(CEK<>\"Siap Diisi\",\"\",IF(KOG!AX31=\"\",\"\",KOG!AX31))","v":""},{"$f":"IF(CEK<>\"Siap Diisi\",\"\",IF(PSI!Q29=\"\",\"\",PSI!Q29))","v":""},{"$f":"IF(CEK<>\"Siap Diisi\",\"\",IF(PSI!R29=\"\",\"\",PSI!R29))","v":""},{"$f":"IF(CEK<>\"Siap Diisi\",\"\",IF(PSI!S29=\"\",\"\",PSI!S29))","v":""},{"$f":"IF(CEK<>\"Siap Diisi\",\"\",IF(AFE!U29=\"\",\"\",AFE!U29))","v":""},{"$f":"IF(CEK<>\"Siap Diisi\",\"\",IF(AFE!V29=\"\",\"\",AFE!V29))","v":""}]
[null,{"$f":"IF(ABS!B40=\"\",\"\",ABS!B40)","v":26},{"$f":"IF(ABS!C40=\"\",\"\",ABS!C40)","v":12734},{"$f":"IF(ABS!D40=\"\",\"\",PROPER(ABS!D40))","v":"Sofi"},{"$f":"IF(CEK<>\"Siap Diisi\",\"\",IF(KOG!AV32=\"\",\"\",KOG!AV32))","v":""},{"$f":"IF(CEK<>\"Siap Diisi\",\"\",IF(KOG!AW32=\"\",\"\",KOG!AW32))","v":""},{"$f":"IF(CEK<>\"Siap Diisi\",\"\",IF(KOG!AX32=\"\",\"\",KOG!AX32))","v":""},{"$f":"IF(CEK<>\"Siap Diisi\",\"\",IF(PSI!Q30=\"\",\"\",PSI!Q30))","v":""},{"$f":"IF(CEK<>\"Siap Diisi\",\"\",IF(PSI!R30=\"\",\"\",PSI!R30))","v":""},{"$f":"IF(CEK<>\"Siap Diisi\",\"\",IF(PSI!S30=\"\",\"\",PSI!S30))","v":""},{"$f":"IF(CEK<>\"Siap Diisi\",\"\",IF(AFE!U30=\"\",\"\",AFE!U30))","v":""},{"$f":"IF(CEK<>\"Siap Diisi\",\"\",IF(AFE!V30=\"\",\"\",AFE!V30))","v":""}]
[null,{"$f":"IF(ABS!B41=\"\",\"\",ABS!B41)","v":27},{"$f":"IF(ABS!C41=\"\",\"\",ABS!C41)","v":12745},{"$f":"IF(ABS!D41=\"\",\"\",PROPER(ABS!D41))","v":"Tika Wulandari"},{"$f":"IF(CEK<>\"Siap Diisi\",\"\",IF(KOG!AV33=\"\",\"\",KOG!AV33))","v":""},{"$f":"IF(CEK<>\"Siap Diisi\",\"\",IF(KOG!AW33=\"\",\"\",KOG!AW33))","v":""},{"$f":"IF(CEK<>\"Siap Diisi\",\"\",IF(KOG!AX33=\"\",\"\",KOG!AX33))","v":""},{"$f":"IF(CEK<>\"Siap Diisi\",\"\",IF(PSI!Q31=\"\",\"\",PSI!Q31))","v":""},{"$f":"IF(CEK<>\"Siap Diisi\",\"\",IF(PSI!R31=\"\",\"\",PSI!R31))","v":""},{"$f":"IF(CEK<>\"Siap Diisi\",\"\",IF(PSI!S31=\"\",\"\",PSI!S31))","v":""},{"$f":"IF(CEK<>\"Siap Diisi\",\"\",IF(AFE!U31=\"\",\"\",AFE!U31))","v":""},{"$f":"IF(CEK<>\"Siap Diisi\",\"\",IF(AFE!V31=\"\",\"\",AFE!V31))","v":""}]
[null,{"$f":"IF(ABS!B42=\"\",\"\",ABS!B42)","v":28},{"$f":"IF(ABS!C42=\"\",\"\",ABS!C42)","v":12747},{"$f":"IF(ABS!D42=\"\",\"\",PROPER(ABS!D42))","v":"Tomy Faizal Manaf"},{"$f":"IF(CEK<>\"Siap Diisi\",\"\",IF(KOG!AV34=\"\",\"\",KOG!AV34))","v":""},{"$f":"IF(CEK<>\"Siap Diisi\",\"\",IF(KOG!AW34=\"\",\"\",KOG!AW34))","v":""},{"$f":"IF(CEK<>\"Siap Diisi\",\"\",IF(KOG!AX34=\"\",\"\",KOG!AX34))","v":""},{"$f":"IF(CEK<>\"Siap Diisi\",\"\",IF(PSI!Q32=\"\",\"\",PSI!Q32))","v":""},{"$f":"IF(CEK<>\"Siap Diisi\",\"\",IF(PSI!R32=\"\",\"\",PSI!R32))","v":""},{"$f":"IF(CEK<>\"Siap Diisi\",\"\",IF(PSI!S32=\"\",\"\",PSI!S32))","v":""},{"$f":"IF(CEK<>\"Siap Diisi\",\"\",IF(AFE!U32=\"\",\"\",AFE!U32))","v":""},{"$f":"IF(CEK<>\"Siap Diisi\",\"\",IF(AFE!V32=\"\",\"\",AFE!V32))","v":""}]
[null,{"$f":"IF(ABS!B43=\"\",\"\",ABS!B43)","v":29},{"$f":"IF(ABS!C43=\"\",\"\",ABS!C43)","v":12748},{"$f":"IF(ABS!D43=\"\",\"\",PROPER(ABS!D43))","v":"Toni Gunawan"},{"$f":"IF(CEK<>\"Siap Diisi\",\"\",IF(KOG!AV35=\"\",\"\",KOG!AV35))","v":""},{"$f":"IF(CEK<>\"Siap Diisi\",\"\",IF(KOG!AW35=\"\",\"\",KOG!AW35))","v":""},{"$f":"IF(CEK<>\"Siap Diisi\",\"\",IF(KOG!AX35=\"\",\"\",KOG!AX35))","v":""},{"$f":"IF(CEK<>\"Siap Diisi\",\"\",IF(PSI!Q33=\"\",\"\",PSI!Q33))","v":""},{"$f":"IF(CEK<>\"Siap Diisi\",\"\",IF(PSI!R33=\"\",\"\",PSI!R33))","v":""},{"$f":"IF(CEK<>\"Siap Diisi\",\"\",IF(PSI!S33=\"\",\"\",PSI!S33))","v":""},{"$f":"IF(CEK<>\"Siap Diisi\",\"\",IF(AFE!U33=\"\",\"\",AFE!U33))","v":""},{"$f":"IF(CEK<>\"Siap Diisi\",\"\",IF(AFE!V33=\"\",\"\",AFE!V33))","v":""}]
[null,{"$f":"IF(ABS!B44=\"\",\"\",ABS!B44)","v":30},{"$f":"IF(ABS!C44=\"\",\"\",ABS!C44)","v":12757},{"$f":"IF(ABS!D44=\"\",\"\",PROPER(ABS!D44))","v":"Vevy Dyas Lestari"},{"$f":"IF(CEK<>\"Siap Diisi\",\"\",IF(KOG!AV36=\"\",\"\",KOG!AV36))","v":""},{"$f":"IF(CEK<>\"Siap Diisi\",\"\",IF(KOG!AW36=\"\",\"\",KOG!AW36))","v":""},{"$f":"IF(CEK<>\"Siap Diisi\",\"\",IF(KOG!AX36=\"\",\"\",KOG!AX36))","v":""},{"$f":"IF(CEK<>\"Siap Diisi\",\"\",IF(PSI!Q34=\"\",\"\",PSI!Q34))","v":""},{"$f":"IF(CEK<>\"Siap Diisi\",\"\",IF(PSI!R34=\"\",\"\",PSI!R34))","v":""},{"$f":"IF(CEK<>\"Siap Diisi\",\"\",IF(PSI!S34=\"\",\"\",PSI!S34))","v":""},{"$f":"IF(CEK<>\"Siap Diisi\",\"\",IF(AFE!U34=\"\",\"\",AFE!U34))","v":""},{"$f":"IF(CEK<>\"Siap Diisi\",\"\",IF(AFE!V34=\"\",\"\",AFE!V34))","v":""}]
[null,{"$f":"IF(ABS!B45=\"\",\"\",ABS!B45)","v":31},{"$f":"IF(ABS!C45=\"\",\"\",ABS!C45)","v":12765},{"$f":"IF(ABS!D45=\"\",\"\",PROPER(ABS!D45))","v":"Wahyu Ardhi Gunawan"},{"$f":"IF(CEK<>\"Siap Diisi\",\"\",IF(KOG!AV37=\"\",\"\",KOG!AV37))","v":""},{"$f":"IF(CEK<>\"Siap Diisi\",\"\",IF(KOG!AW37=\"\",\"\",KOG!AW37))","v":""},{"$f":"IF(CEK<>\"Siap Diisi\",\"\",IF(KOG!AX37=\"\",\"\",KOG!AX37))","v":""},{"$f":"IF(CEK<>\"Siap Diisi\",\"\",IF(PSI!Q35=\"\",\"\",PSI!Q35))","v":""},{"$f":"IF(CEK<>\"Siap Diisi\",\"\",IF(PSI!R35=\"\",\"\",PSI!R35))","v":""},{"$f":"IF(CEK<>\"Siap Diisi\",\"\",IF(PSI!S35=\"\",\"\",PSI!S35))","v":""},{"$f":"IF(CEK<>\"Siap Diisi\",\"\",IF(AFE!U35=\"\",\"\",AFE!U35))","v":""},{"$f":"IF(CEK<>\"Siap Diisi\",\"\",IF(AFE!V35=\"\",\"\",AFE!V35))","v":""}]
[null,{"$f":"IF(ABS!B46=\"\",\"\",ABS!B46)","v":32},{"$f":"IF(ABS!C46=\"\",\"\",ABS!C46)","v":12767},{"$f":"IF(ABS!D46=\"\",\"\",PROPER(ABS!D46))","v":"Widi Pangestu"},{"$f":"IF(CEK<>\"Siap Diisi\",\"\",IF(KOG!AV38=\"\",\"\",KOG!AV38))","v":""},{"$f":"IF(CEK<>\"Siap Diisi\",\"\",IF(KOG!AW38=\"\",\"\",KOG!AW38))","v":""},{"$f":"IF(CEK<>\"Siap Diisi\",\"\",IF(KOG!AX38=\"\",\"\",KOG!AX38))","v":""},{"$f":"IF(CEK<>\"Siap Diisi\",\"\",IF(PSI!Q36=\"\",\"\",PSI!Q36))","v":""},{"$f":"IF(CEK<>\"Siap Diisi\",\"\",IF(PSI!R36=\"\",\"\",PSI!R36))","v":""},{"$f":"IF(CEK<>\"Siap Diisi\",\"\",IF(PSI!S36=\"\",\"\",PSI!S36))","v":""},{"$f":"IF(CEK<>\"Siap Diisi\",\"\",IF(AFE!U36=\"\",\"\",AFE!U36))","v":""},{"$f":"IF(CEK<>\"Siap Diisi\",\"\",IF(AFE!V36=\"\",\"\",AFE!V36))","v":""}]
[null,{"$f":"IF(ABS!B47=\"\",\"\",ABS!B47)","v":33},{"$f":"IF(ABS!C47=\"\",\"\",ABS!C47)","v":12784},{"$f":"IF(ABS!D47=\"\",\"\",PROPER(ABS!D47))","v":"Yuli Atifah"},{"$f":"IF(CEK<>\"Siap Diisi\",\"\",IF(KOG!AV39=\"\",\"\",KOG!AV39))","v":""},{"$f":"IF(CEK<>\"Siap Diisi\",\"\",IF(KOG!AW39=\"\",\"\",KOG!AW39))","v":""},{"$f":"IF(CEK<>\"Siap Diisi\",\"\",IF(KOG!AX39=\"\",\"\",KOG!AX39))","v":""},{"$f":"IF(CEK<>\"Siap Diisi\",\"\",IF(PSI!Q37=\"\",\"\",PSI!Q37))","v":""},{"$f":"IF(CEK<>\"Siap Diisi\",\"\",IF(PSI!R37=\"\",\"\",PSI!R37))","v":""},{"$f":"IF(CEK<>\"Siap Diisi\",\"\",IF(PSI!S37=\"\",\"\",PSI!S37))","v":""},{"$f":"IF(CEK<>\"Siap Diisi\",\"\",IF(AFE!U37=\"\",\"\",AFE!U37))","v":""},{"$f":"IF(CEK<>\"Siap Diisi\",\"\",IF(AFE!V37=\"\",\"\",AFE!V37))","v":""}]
[null,{"$f":"IF(ABS!B48=\"\",\"\",ABS!B48)","v":34},{"$f":"IF(ABS!C48=\"\",\"\",ABS!C48)","v":12788},{"$f":"IF(ABS!D48=\"\",\"\",PROPER(ABS!D48))","v":"Yusuf Dwi Prasetya"},{"$f":"IF(CEK<>\"Siap Diisi\",\"\",IF(KOG!AV40=\"\",\"\",KOG!AV40))","v":""},{"$f":"IF(CEK<>\"Siap Diisi\",\"\",IF(KOG!AW40=\"\",\"\",KOG!AW40))","v":""},{"$f":"IF(CEK<>\"Siap Diisi\",\"\",IF(KOG!AX40=\"\",\"\",KOG!AX40))","v":""},{"$f":"IF(CEK<>\"Siap Diisi\",\"\",IF(PSI!Q38=\"\",\"\",PSI!Q38))","v":""},{"$f":"IF(CEK<>\"Siap Diisi\",\"\",IF(PSI!R38=\"\",\"\",PSI!R38))","v":""},{"$f":"IF(CEK<>\"Siap Diisi\",\"\",IF(PSI!S38=\"\",\"\",PSI!S38))","v":""},{"$f":"IF(CEK<>\"Siap Diisi\",\"\",IF(AFE!U38=\"\",\"\",AFE!U38))","v":""},{"$f":"IF(CEK<>\"Siap Diisi\",\"\",IF(AFE!V38=\"\",\"\",AFE!V38))","v":""}]
[null,{"$f":"IF(ABS!B49=\"\",\"\",ABS!B49)","v":""},{"$f":"IF(ABS!C49=\"\",\"\",ABS!C49)","v":""},{"$f":"IF(ABS!D49=\"\",\"\",PROPER(ABS!D49))","v":""},{"$f":"IF(CEK<>\"Siap Diisi\",\"\",IF(KOG!AV41=\"\",\"\",KOG!AV41))","v":""},{"$f":"IF(CEK<>\"Siap Diisi\",\"\",IF(KOG!AW41=\"\",\"\",KOG!AW41))","v":""},{"$f":"IF(CEK<>\"Siap Diisi\",\"\",IF(KOG!AX41=\"\",\"\",KOG!AX41))","v":""},{"$f":"IF(CEK<>\"Siap Diisi\",\"\",IF(PSI!Q39=\"\",\"\",PSI!Q39))","v":""},{"$f":"IF(CEK<>\"Siap Diisi\",\"\",IF(PSI!R39=\"\",\"\",PSI!R39))","v":""},{"$f":"IF(CEK<>\"Siap Diisi\",\"\",IF(PSI!S39=\"\",\"\",PSI!S39))","v":""},{"$f":"IF(CEK<>\"Siap Diisi\",\"\",IF(AFE!U39=\"\",\"\",AFE!U39))","v":""},{"$f":"IF(CEK<>\"Siap Diisi\",\"\",IF(AFE!V39=\"\",\"\",AFE!V39))","v":""}]
[null,{"$f":"IF(ABS!B50=\"\",\"\",ABS!B50)","v":""},{"$f":"IF(ABS!C50=\"\",\"\",ABS!C50)","v":""},{"$f":"IF(ABS!D50=\"\",\"\",PROPER(ABS!D50))","v":""},{"$f":"IF(CEK<>\"Siap Diisi\",\"\",IF(KOG!AV42=\"\",\"\",KOG!AV42))","v":""},{"$f":"IF(CEK<>\"Siap Diisi\",\"\",IF(KOG!AW42=\"\",\"\",KOG!AW42))","v":""},{"$f":"IF(CEK<>\"Siap Diisi\",\"\",IF(KOG!AX42=\"\",\"\",KOG!AX42))","v":""},{"$f":"IF(CEK<>\"Siap Diisi\",\"\",IF(PSI!Q40=\"\",\"\",PSI!Q40))","v":""},{"$f":"IF(CEK<>\"Siap Diisi\",\"\",IF(PSI!R40=\"\",\"\",PSI!R40))","v":""},{"$f":"IF(CEK<>\"Siap Diisi\",\"\",IF(PSI!S40=\"\",\"\",PSI!S40))","v":""},{"$f":"IF(CEK<>\"Siap Diisi\",\"\",IF(AFE!U40=\"\",\"\",AFE!U40))","v":""},{"$f":"IF(CEK<>\"Siap Diisi\",\"\",IF(AFE!V40=\"\",\"\",AFE!V40))","v":""}]
[null,{"$f":"IF(ABS!B51=\"\",\"\",ABS!B51)","v":""},{"$f":"IF(ABS!C51=\"\",\"\",ABS!C51)","v":""},{"$f":"IF(ABS!D51=\"\",\"\",PROPER(ABS!D51))","v":""},{"$f":"IF(CEK<>\"Siap Diisi\",\"\",IF(KOG!AV43=\"\",\"\",KOG!AV43))","v":""},{"$f":"IF(CEK<>\"Siap Diisi\",\"\",IF(KOG!AW43=\"\",\"\",KOG!AW43))","v":""},{"$f":"IF(CEK<>\"Siap Diisi\",\"\",IF(KOG!AX43=\"\",\"\",KOG!AX43))","v":""},{"$f":"IF(CEK<>\"Siap Diisi\",\"\",IF(PSI!Q41=\"\",\"\",PSI!Q41))","v":""},{"$f":"IF(CEK<>\"Siap Diisi\",\"\",IF(PSI!R41=\"\",\"\",PSI!R41))","v":""},{"$f":"IF(CEK<>\"Siap Diisi\",\"\",IF(PSI!S41=\"\",\"\",PSI!S41))","v":""},{"$f":"IF(CEK<>\"Siap Diisi\",\"\",IF(AFE!U41=\"\",\"\",AFE!U41))","v":""},{"$f":"IF(CEK<>\"Siap Diisi\",\"\",IF(AFE!V41=\"\",\"\",AFE!V41))","v":""}]
[null,{"$f":"IF(ABS!B52=\"\",\"\",ABS!B52)","v":""},{"$f":"IF(ABS!C52=\"\",\"\",ABS!C52)","v":""},{"$f":"IF(ABS!D52=\"\",\"\",PROPER(ABS!D52))","v":""},{"$f":"IF(CEK<>\"Siap Diisi\",\"\",IF(KOG!AV44=\"\",\"\",KOG!AV44))","v":""},{"$f":"IF(CEK<>\"Siap Diisi\",\"\",IF(KOG!AW44=\"\",\"\",KOG!AW44))","v":""},{"$f":"IF(CEK<>\"Siap Diisi\",\"\",IF(KOG!AX44=\"\",\"\",KOG!AX44))","v":""},{"$f":"IF(CEK<>\"Siap Diisi\",\"\",IF(PSI!Q42=\"\",\"\",PSI!Q42))","v":""},{"$f":"IF(CEK<>\"Siap Diisi\",\"\",IF(PSI!R42=\"\",\"\",PSI!R42))","v":""},{"$f":"IF(CEK<>\"Siap Diisi\",\"\",IF(PSI!S42=\"\",\"\",PSI!S42))","v":""},{"$f":"IF(CEK<>\"Siap Diisi\",\"\",IF(AFE!U42=\"\",\"\",AFE!U42))","v":""},{"$f":"IF(CEK<>\"Siap Diisi\",\"\",IF(AFE!V42=\"\",\"\",AFE!V42))","v":""}]
[null,"RATA-RATA"]

{"sheet":"PET","index":16,"n_rows":76,"n_cols":10,"rows_kept":76,"cut":false,"hidden":false,"merged":[[1,1,1,12],[31,4,31,12],[32,4,32,12],[33,4,33,12],[75,0,75,13],[38,4,38,12],[39,4,39,12],[40,4,40,12],[73,2,74,12]]}
[null,"PETUNJUK PENGGUNAAN"]
[null,"Aplikasi ini gratis, silahkan dipakai, dimodifikasi, maupun diklaim buatan sekolah anda\nyang penting sebarkan ilmu ini ke sekolah-sekolah lainnya yang membutuhkan.\n(jika kesulitan silahkan hubungi admin sekolah atau website sekolah)"]
[]
[null,"1.","Pada saat pertama kali dibuka, maka akan muncul tampilan sbb:"]
[]
[]
[null,null,"klik pada tulisan Options, kemudian berikan pilihan pada Enable this content, dan terakhir klik OK"]
[]
[]
[]
[]
[]
[]
[]
[]
[]
[]
[]
[]
[]
[]
[null,"2.","Isikan identitas Sekolah dan Data Guru melalui menu"]
[null,null,"Isikan kolom-kolom yang berwarna biru muda untuk:"]
[null,null,"a. Identitas Sekolah"]
[null,null,"b. Nama guru mata pelajaran"]
[null,null,"c. Nama kelas dan wali kelasnya"]
[null,null,"d. Nama mata pelajaran"]
[]
[null,"3.","Isikan Deskripsi melalui menu"]
[null,null,"a. Deskripsi untuk Pengetahuan yang diambilkan dari KI-3"]
[null,null,null,"Isikan secara garis besar dari KI-3 tersebut, misalnya: dalam Kimia SMA untuk KI-3 tertulis sbb:"]
[null,null,null,"3.2","Menganalisis perkembangan model atom."]
[null,null,null,"3.3","Menganalisis struktur atom berdasarkan teori atom Bohr dan teori mekanika kuantum."]
[null,null,null,"3.4","Menganalisis hubungan konfigurasi elektron dan diagram orbital untuk menentukan letak unsur dalam tabel periodik dan sifat-sifat periodik unsur."]
[null,null,null,"Garis besar dari KI-3 tersebut adalah \" Model Atom dan Struktur Atom\""]
[]
[null,null,"b. Deskripsi untuk Ketrampilan yang diambilkan dari KI-4"]
[null,null,null,"Isikan secara garis besar dari KI-4 tersebut, misalnya: dalam Kimia SMA untuk KI-4 tertulis sbb:"]
[null,null,null,"4.2","Mengolah dan menganalisis perkembangan model atom."]
[null,null,null,"4.3","Mengolah dan menganalisis struktur atom berdasarkan teori atom Bohr dan teori mekanika kuantum."]
[null,null,null,"4.4","Menyajikan hasil analisis hubungan konfigurasi elektron dan diagram orbital untuk menentukan  letak unsur dalam tabel periodik dan sifat-sifat periodik unsur."]
[null,null,null,"Garis besar dari KI-4 tersebut adalah \" Menganalisis model atom, struktur atom, dan tabel periodik\""]
[]
[null,null,"c. Deskripsi untuk Sikap Spiritual dan Sikap Sosial yang diambilkan dari KI-1 dan KI-2"]
[null,null,null,"Sikap Spiritual",null,null,null,null,null,"Sikap Sosial"]
[null,null,null,"♥ doa sebelum dan sesudah melakukan sesuatu",null,null,null,null,null,"♥ Jujur"]
[null,null,null,"♥ rasa syukur setelah berhasil mengerjakan sesuatu",null,null,null,null,null,"♥ Disiplin"]
[null,null,null,"♥ salam sebelum dan sesudah menyampaikan pendapat",null,null,null,null,null,"♥ Tanggung Jawab"]
[null,null,null,"♥ ibadah tepat waktu",null,null,null,null,null,"♥ Toleransi"]
[null,null,null,"♥ rasa keimanan setelah mempelajari Iptek",null,null,null,null,null,"♥ Gotong Royong"]
[null,null,null,null,null,null,null,null,null,"♥ Santun"]
[null,null,null,null,null,null,null,null,null,"♥ Percaya Diri"]
[]
[null,"4.","Isikan Data Siswa melalui menu"]
[null,null,"a. Copykan data siswa dari file excel lain, dimulai dari NIS, Nama dan Jenis Kelamin"]
[null,null,"b. Letakan pada cell yang sesuai, kemudian klik \"PASTE VALUES\""]
[null,null,"c. Ketikan secara manual kelasnya di Cell F15 (hanya Sekali saja lainnya akan terisi otomatis)"]
[null,null,"d. Isikan jumlah KD (Kompetensi Dasar) apakah 2, 3, 4 atau 5"]
[null,null,"e. Isikan jumlah hari efektif dalam semester ini"]
[null,null,"f. Pilih Kode guru"]
[null,null,"g. Pilih kode mapel"]
[null,null,"h. Isikan alokasi jam mengajar per minggunya"]
[null,null,"i. Isikan jumlah pertemuan seharusnya dalam semester ini"]
[null,null,"PERHATIKAN :"]
[null,null,null,"Pada Nama File seharusnya dan Nama File Sebelum dirubah apakah sudah sama atau tidak. Jika tidak"]
[null,null,null,"maka program ini tidak akan bisa dipakai secara otomatis."]
[]
[null,null,"Cara menyamakan:"]
[null,null,"a. Catat pada selembar kertas nama file seharusnya."]
[null,null,"b. Tutup dan keluarkan file excel yang saat ini anda buka"]
[null,null,"c. Gunakan dengan windows explorer, kemudian rubah nama file sesuai catatan di langkah (a)"]
[null,null,"d. Buka kembali file tersebut. Jika Benar, maka tulisan disampingnya akan berbunyi \"Sudah Sama\""]
[]
[null,null,"Langkah lainnya anda tinggal masuk menu utama, \nkemudian pilih atau klik tombol menu yang akan anda isikan"]
[]
["Copyright 2013 by Drs. SUPRIYANTO (SMA Muhammadiyah Wonosobo) 30 Nopember 2013"]

{"sheet":"FormNDS","index":17,"n_rows":79,"n_cols":7,"rows_kept":79,"cut":false,"hidden":false,"merged":[[30,1,31,1],[30,2,31,2],[30,3,30,4],[53,1,54,1],[53,2,54,2],[53,3,53,6],[30,5,31,6],[32,5,32,6],[33,5,33,6],[41,1,41,2],[42,1,42,2],[43,1,43,2],[44,1,44,2],[66,4,66,6],[67,4,67,6],[46,4,46,6],[47,4,47,6],[48,4,48,6],[49,4,49,6],[50,4,50,6],[51,4,51,6],[28,4,28,6],[62,4,62,6],[63,4,63,6],[64,4,64,6],[65,4,65,6],[34,5,34,6],[35,5,35,6],[36,5,36,6],[37,5,37,6],[38,5,38,6],[39,5,39,6],[41,5,41,6],[42,5,42,6],[43,5,43,6],[44,5,44,6],[23,4,23,6],[24,4,24,6],[25,4,25,6],[26,4,26,6],[27,4,27,6]]}
[null,"FORMULIR PENILAIAN DIRI "]
[]
[]
[]
[]
[]
[]
[]
[]
[null,"No","Pernyataan","TP","KD","SR","SL"]
[null,1,"Saya tambah yakin dengan keberadaan Tuhan setelah mempelajari ilmu pengetahuan"]
[null,2,"Saya berdoa sebelum dan sesudah melakukan sesuatu kegiatan"]
[null,3,"Saya mengucapkan rasa syukur atas segala karunia Tuhan sesuai dengan agama saya"]
[null,4,"Saya memberi salam sebelum dan sesudah mengungkapkan pendapat di depan umum sesuai dengan agama saya"]
[null,5,"Saya mengungkapkan keagungan Tuhan apabila melihat kebesaranNya sesuai dengan agama saya"]
[]
[null,"No","Pernyataan","TP","KD","SR","SL"]
[null,1,"Saya menyontek pada saat mengerjakan Ulangan"]
[null,2,"Saya menyalin karya orang lain tanpa menyebutkan sumbernya pada saat mengerjakan tugas"]
[null,3,"Saya melaporkan kepada yang berwenang jika menemukan barang"]
[null,4,"Saya berani mengakui kesalahan yang dilakukan"]
[null,5,"Saya mengerjakan soal ujian tanpa melihat jawaban teman yang lain"]
[]
[null,"No","Pernyataan","Sikap","Alasan"]
[null,1,"Sebagai siswa saya melakukan tugas- tugas dengan baik"]
[null,2,"Saya berani menerima resiko atas tindakan yang dilakukan"]
[null,3,"Saya menuduh orang lain tanpa bukti"]
[null,4,"Saya mau mengembalikan barang yang dipinjam dari orang lain"]
[null,5,"Saya berani meminta maaf jika melakukan kesalahan yang merugikan orang lain"]
[]
[null,"No","Pernyataan","Melakukan",null,"Keterangan"]
[null,null,null,"Ya","Tidak"]
[null,1,"Saya masuk kelas tepat waktu"]
[null,2,"Saya mengumpulkan tugas tepat waktu"]
[null,3,"Saya memakai seragam sesuai tata tertib"]
[null,4,"Saya mengerjakan tugas yang diberikan"]
[null,5,"Saya tertib dalam mengikuti pembelajaran"]
[null,6,"Saya mengikuti praktikum sesuai dengan langkah yang ditetapkan"]
[null,7,"Saya membawa buku tulis sesuai mata pelajaran"]
[null,8,"Saya membawa buku teks mata pelajaran"]
[]
[null,"Rela berbagi",null,null,null,"Pelit"]
[null,"Aktif",null,null,null,"Pasif"]
[null,"Bekerja sama",null,null,null,"Egois"]
[null,"Iklas",null,null,null,"Pamrih"]
[]
[null,"No","Pernyataan","Sikap","Alasan"]
[null,1,"Saya marah dengan teman yang berbeda pendapat"]
[null,2,"Saya menghormati teman yang berbeda agama, ras, gender, budaya, suku"]
[null,3,"Saya mau melakukan apa yang sudah menjadi kesepakatan bersama"]
[null,4,"Saya menerima dan menghargai kekurangan orang lain"]
[null,5,"Saya memaafkan kesalahan orang lain dengan iklas"]
[]
[null,"No","Pernyataan","Penilaian"]
[null,null,null,"STS","TS","S","SS"]
[null,1,"Saya menghormasti orang yang lebih tua"]
[null,2,"Saya tidak berkata kata kotor, kasardan takabur"]
[null,3,"Saya meludah di tempatsembarangan"]
[null,4,"Saya tidak menyela pembicaraan"]
[null,5,"Saya mengucapkan terima kasih saat menerima bantuan dari orang lain"]
[null,6,"Saya tersenyum, menyapa, memberi salam kepada orang yang ada di sekitar kita"]
[]
[null,"No","Pernyataan","Sikap","Alasan"]
[null,1,"Saya melakukan segala sesuatu tanpa ragu-ragu"]
[null,2,"Saya berani mengambil keputusan secara cepat dan bisa dipertanggungjawabkan"]
[null,3,"Saya tidak mudah putus asa"]
[null,4,"Saya berani menunjukkan kemampuan yang dimiliki di depan orang banyak"]
[null,5,"Saya berani mencoba hal-hal yang baru"]
[]
[null,"KETERANGAN:"]
[null,"SL","= Selalu, apabila selalu melakukan sesuai pernyataan"]
[null,"SR ","= Sering, apabila sering melakukan sesuai pernyataan dan kadang- kadang tidak melakukan"]
[null,"KD ","= Kadang-kadang, apabila kadang-kadang melakukan dan sering tidak melakukan"]
[null,"TP ","= Tidak Pernah, apabila tidak pernah melakukan"]
[]
[null,"STS","= Sangat Tidak Setuju"]
[null,"TS","= Tidak Setuju"]
[null,"S","= Setuju"]
[null,"SS","= Sangat Setuju"]

{"sheet":"FormNAT","index":18,"n_rows":55,"n_cols":6,"rows_kept":55,"cut":false,"hidden":false,"merged":[[8,0,9,0],[8,1,9,1],[8,2,8,5]]}
["FORMULIR PENILAIAN ANTAR TEMAN"]
[]
[null,null,null,"4 = Selalu"]
[null,null,null,"3 = Sering"]
[null,null,null,"2 = Jarang"]
[null,null,null,"1 = Tidak Pernah"]
[]
["Berilah tanda cek pada kolom pilihan berikut dengan"]
["No","Aspek yang Diamati","Skor"]
[null,null,1,2,3,4]
[]
[1,"Tidak nyontek dalam mengerjakan ujian/ulangan"]
[2,"Tidak melakukan plagiat (mengambil /menyalin karya orang lain tanpa menyebutkan sumber) dalam mengerjakan setiap tugas"]
[3,"Mengemukakan perasaan terhadap sesuatu apa adanya"]
[4,"Melaporkan data atau informasi apa adanya"]
[]
[1,"Mengakui kesalahan atau kekurangan yang dimiliki"]
[2,"Masuk kelas tepat waktu"]
[3,"Mengumpulkan tugas tepat waktu"]
[4,"Memakai seragam sesuai tata tertib"]
[5,"Mengerjakan tugas yang diberikan"]
[6,"Tertib dalam mengikuti pembelajaran"]
[7,"Mengikuti praktikum sesuai dengan langkah yang ditetapkan"]
[8,"Membawa buku tulis sesuai mata pelajaran"]
[9,"Membawa buku teks mata pelajaran"]
[]
[1,"Melaksanakan tugas individu dengan baik"]
[2,"Menerima resiko dari tindakan yang dilakukan"]
[3,"Tidak menuduh orang lain tanpa bukti yang akurat"]
[4,"Mengembalikan barang yang dipinjam"]
[5,"Meminta maaf atas kesalahan yang dilakukan"]
[]
[1,"Menghormati pendapat teman"]
[2,"Menghormati teman yang berbeda suku, agama, ras, budaya, dan gender"]
[3,"Menerima kesepakatan meskipun berbeda dengan pendapatnya"]
[4,"Menerima kekurangan orang lain"]
[5,"Memaafkan kesalahan orang lain"]
[]
[1,"Aktif dalam kerja kelompok"]
[2,"Suka menolong teman/orang lain"]
[3,"Kesediaan melakukan tugas sesuai kesepakatan"]
[4,"Rela berkorban untuk orang lain"]
[]
[1,"Menghormati orang yang lebih tua"]
[2,"Mengucapkan terima kasih setelah menerima bantuan orang lain"]
[3,"Menggunakan bahasa santun saat menyampaikan pendapat"]
[4,"Menggunakan bahasa santun saat mengkritik pendapat teman"]
[5,"Bersikap 3S (salam, senyum, sapa) saat bertemu orang lain"]
[]
[1,"Berani presentasi di depan kelas"]
[2,"Berani berpendapat, bertanya, dan menjawab pertanyaan"]
[3,"Berpendapat atau melakukan kegiatan tanpa ragu-ragu"]
[4,"Mampu membuat keputusan dengan cepat"]
[5,"Tidak mudah putus asa/pantang menyerah"]
[null,"JUMLAH"]